You are viewing a plain text version of this content. The canonical link for it is here.
Posted to builds@lucene.apache.org by Apache Jenkins Server <je...@builds.apache.org> on 2025/07/20 03:57:20 UTC

[JENKINS] Lucene » Lucene-NightlyTests-main - Build # 1732 - Still Unstable!

Build: https://ci-builds.apache.org/job/Lucene/job/Lucene-NightlyTests-main/1732/

1 tests failed.
FAILED:  org.apache.lucene.search.TestLRUQueryCache.testRandom

Error Message:
java.lang.AssertionError

Stack Trace:
java.lang.AssertionError
	at __randomizedtesting.SeedInfo.seed([9B778D8743E52D9:7BFB5DD7C55EE4AA]:0)
	at org.apache.lucene.tests.search.AssertingBulkScorer.score(AssertingBulkScorer.java:83)
	at org.apache.lucene.search.IndexSearcher.searchLeaf(IndexSearcher.java:843)
	at org.apache.lucene.search.IndexSearcher.search(IndexSearcher.java:803)
	at org.apache.lucene.tests.search.AssertingIndexSearcher.search(AssertingIndexSearcher.java:77)
	at org.apache.lucene.search.IndexSearcher.lambda$search$0(IndexSearcher.java:773)
	at java.base/java.util.concurrent.FutureTask.run(FutureTask.java:328)
	at org.apache.lucene.search.TaskExecutor$Task.run(TaskExecutor.java:173)
	at org.apache.lucene.search.TaskExecutor.invokeAll(TaskExecutor.java:111)
	at org.apache.lucene.search.IndexSearcher.search(IndexSearcher.java:777)
	at org.apache.lucene.search.IndexSearcher.search(IndexSearcher.java:744)
	at org.apache.lucene.search.IndexSearcher.searchAfter(IndexSearcher.java:590)
	at org.apache.lucene.search.IndexSearcher.search(IndexSearcher.java:613)
	at org.apache.lucene.search.TestLRUQueryCache.testRandom(TestLRUQueryCache.java:1168)
	at java.base/jdk.internal.reflect.DirectMethodHandleAccessor.invoke(DirectMethodHandleAccessor.java:104)
	at java.base/java.lang.reflect.Method.invoke(Method.java:565)
	at com.carrotsearch.randomizedtesting.RandomizedRunner.invoke(RandomizedRunner.java:1763)
	at com.carrotsearch.randomizedtesting.RandomizedRunner$8.evaluate(RandomizedRunner.java:946)
	at com.carrotsearch.randomizedtesting.RandomizedRunner$9.evaluate(RandomizedRunner.java:982)
	at com.carrotsearch.randomizedtesting.RandomizedRunner$10.evaluate(RandomizedRunner.java:996)
	at org.apache.lucene.tests.util.TestRuleSetupTeardownChained$1.evaluate(TestRuleSetupTeardownChained.java:48)
	at org.apache.lucene.tests.util.AbstractBeforeAfterRule$1.evaluate(AbstractBeforeAfterRule.java:43)
	at org.apache.lucene.tests.util.TestRuleThreadAndTestName$1.evaluate(TestRuleThreadAndTestName.java:45)
	at org.apache.lucene.tests.util.TestRuleIgnoreAfterMaxFailures$1.evaluate(TestRuleIgnoreAfterMaxFailures.java:60)
	at org.apache.lucene.tests.util.TestRuleMarkFailure$1.evaluate(TestRuleMarkFailure.java:44)
	at org.junit.rules.RunRules.evaluate(RunRules.java:20)
	at com.carrotsearch.randomizedtesting.rules.StatementAdapter.evaluate(StatementAdapter.java:36)
	at com.carrotsearch.randomizedtesting.ThreadLeakControl$StatementRunner.run(ThreadLeakControl.java:390)
	at com.carrotsearch.randomizedtesting.ThreadLeakControl.forkTimeoutingTask(ThreadLeakControl.java:843)
	at com.carrotsearch.randomizedtesting.ThreadLeakControl$3.evaluate(ThreadLeakControl.java:490)
	at com.carrotsearch.randomizedtesting.RandomizedRunner.runSingleTest(RandomizedRunner.java:955)
	at com.carrotsearch.randomizedtesting.RandomizedRunner$5.evaluate(RandomizedRunner.java:840)
	at com.carrotsearch.randomizedtesting.RandomizedRunner$6.evaluate(RandomizedRunner.java:891)
	at com.carrotsearch.randomizedtesting.RandomizedRunner$7.evaluate(RandomizedRunner.java:902)
	at org.apache.lucene.tests.util.AbstractBeforeAfterRule$1.evaluate(AbstractBeforeAfterRule.java:43)
	at com.carrotsearch.randomizedtesting.rules.StatementAdapter.evaluate(StatementAdapter.java:36)
	at org.apache.lucene.tests.util.TestRuleStoreClassName$1.evaluate(TestRuleStoreClassName.java:38)
	at com.carrotsearch.randomizedtesting.rules.NoShadowingOrOverridesOnMethodsRule$1.evaluate(NoShadowingOrOverridesOnMethodsRule.java:40)
	at com.carrotsearch.randomizedtesting.rules.NoShadowingOrOverridesOnMethodsRule$1.evaluate(NoShadowingOrOverridesOnMethodsRule.java:40)
	at com.carrotsearch.randomizedtesting.rules.StatementAdapter.evaluate(StatementAdapter.java:36)
	at com.carrotsearch.randomizedtesting.rules.StatementAdapter.evaluate(StatementAdapter.java:36)
	at org.apache.lucene.tests.util.TestRuleAssertionsRequired$1.evaluate(TestRuleAssertionsRequired.java:53)
	at org.apache.lucene.tests.util.AbstractBeforeAfterRule$1.evaluate(AbstractBeforeAfterRule.java:43)
	at org.apache.lucene.tests.util.TestRuleMarkFailure$1.evaluate(TestRuleMarkFailure.java:44)
	at org.apache.lucene.tests.util.TestRuleIgnoreAfterMaxFailures$1.evaluate(TestRuleIgnoreAfterMaxFailures.java:60)
	at org.apache.lucene.tests.util.TestRuleIgnoreTestSuites$1.evaluate(TestRuleIgnoreTestSuites.java:47)
	at org.junit.rules.RunRules.evaluate(RunRules.java:20)
	at com.carrotsearch.randomizedtesting.rules.StatementAdapter.evaluate(StatementAdapter.java:36)
	at com.carrotsearch.randomizedtesting.ThreadLeakControl$StatementRunner.run(ThreadLeakControl.java:390)
	at com.carrotsearch.randomizedtesting.ThreadLeakControl.lambda$forkTimeoutingTask$0(ThreadLeakControl.java:850)
	at java.base/java.lang.Thread.run(Thread.java:1447)




Build Log:
[...truncated 747 lines...]
ERROR: The following test has failed:

  - org.apache.lucene.search.TestLRUQueryCache.testRandom (:lucene:core)
    Test output: /home/jenkins/jenkins-agent/workspace/Lucene/Lucene-NightlyTests-main/checkout/lucene/core/build/test-results/test/outputs/OUTPUT-org.apache.lucene.search.TestLRUQueryCache.txt
    Reproduce with: gradlew :lucene:core:test --tests "org.apache.lucene.search.TestLRUQueryCache.testRandom" -Ptests.file.encoding=ISO-8859-1 -Ptests.gui=true -Ptests.haltonfailure=false -Ptests.jvmargs= -Ptests.jvms=4 -Ptests.linedocsfile=/home/jenkins/jenkins-agent/workspace/Lucene/Lucene-NightlyTests-main/test-data/enwiki.random.lines.txt -Ptests.multiplier=2 -Ptests.nightly=true -Ptests.seed=9B778D8743E52D9 -Ptests.vectorsize=256


[Incubating] Problems report is available at: file:///home/jenkins/jenkins-agent/workspace/Lucene/Lucene-NightlyTests-main/checkout/build/reports/problems/problems-report.html

Deprecated Gradle features were used in this build, making it incompatible with Gradle 9.0.

You can use '--warning-mode all' to show the individual deprecation warnings and determine if they come from your own scripts or plugins.

For more on this, please refer to https://docs.gradle.org/8.14/userguide/command_line_interface.html#sec:command_line_warnings in the Gradle documentation.

BUILD SUCCESSFUL in 1h 26m 33s
254 actionable tasks: 38 executed, 216 up-to-date
Build step 'Invoke Gradle script' changed build result to SUCCESS
Archiving artifacts
Recording test results
[Checks API] No suitable checks publisher found.
Build step 'Publish JUnit test result report' changed build result to UNSTABLE
Email was triggered for: Unstable (Test Failures)
Sending email for trigger: Unstable (Test Failures)