You are viewing a plain text version of this content. The canonical link for it is here.
Posted to builds@hbase.apache.org by Apache Jenkins Server <je...@builds.apache.org> on 2024/08/15 15:49:23 UTC
Jenkins build is still unstable: HBase-Nightly-s390x #501
See <https://ci-hbase.apache.org/job/HBase-Nightly-s390x/501/display/redirect?page=changes>
Jenkins build is still unstable: HBase-Nightly-s390x #605
Posted by Apache Jenkins Server <je...@builds.apache.org>.
See <https://ci-hbase.apache.org/job/HBase-Nightly-s390x/605/display/redirect?page=changes>
Jenkins build is unstable: HBase-Nightly-s390x #604
Posted by Apache Jenkins Server <je...@builds.apache.org>.
See <https://ci-hbase.apache.org/job/HBase-Nightly-s390x/604/display/redirect>
Build failed in Jenkins: HBase-Nightly-s390x #603
Posted by Apache Jenkins Server <je...@builds.apache.org>.
See <https://ci-hbase.apache.org/job/HBase-Nightly-s390x/603/display/redirect?page=changes>
Changes:
[noreply] HBASE-28634 Fix FuzzyRowFilter may not return data on reverse scans (#6457)
------------------------------------------
[...truncated 1.96 MB...]
[INFO] Tests run: 2, Failures: 0, Errors: 0, Skipped: 0, Time elapsed: 22.398 s - in org.apache.hadoop.hbase.master.procedure.TestDeleteColumnFamilyProcedureFromClient
WARNING: A terminally deprecated method in java.lang.System has been called
WARNING: System::setSecurityManager has been called by org.apache.hadoop.hbase.SystemExitRule (file:/home/jenkins/jenkins-home/70ad3735/workspace/HBase-Nightly-s390x/hbase-common/target/test-classes/)
WARNING: Please consider reporting this to the maintainers of org.apache.hadoop.hbase.SystemExitRule
WARNING: System::setSecurityManager will be removed in a future release
[INFO] Running org.apache.hadoop.hbase.master.procedure.TestFlushTableProcedureMasterRestarts
WARNING: A terminally deprecated method in java.lang.System has been called
WARNING: System::setSecurityManager has been called by org.apache.hadoop.hbase.SystemExitRule$1 (file:/home/jenkins/jenkins-home/70ad3735/workspace/HBase-Nightly-s390x/hbase-common/target/test-classes/)
WARNING: Please consider reporting this to the maintainers of org.apache.hadoop.hbase.SystemExitRule$1
WARNING: System::setSecurityManager will be removed in a future release
[INFO] Tests run: 2, Failures: 0, Errors: 0, Skipped: 0, Time elapsed: 107.67 s - in org.apache.hadoop.hbase.master.procedure.TestFlushTableProcedureMasterRestarts
WARNING: A terminally deprecated method in java.lang.System has been called
WARNING: System::setSecurityManager has been called by org.apache.hadoop.hbase.SystemExitRule (file:/home/jenkins/jenkins-home/70ad3735/workspace/HBase-Nightly-s390x/hbase-common/target/test-classes/)
WARNING: Please consider reporting this to the maintainers of org.apache.hadoop.hbase.SystemExitRule
WARNING: System::setSecurityManager will be removed in a future release
[INFO] Running org.apache.hadoop.hbase.master.procedure.TestDeleteNamespaceProcedure
WARNING: A terminally deprecated method in java.lang.System has been called
WARNING: System::setSecurityManager has been called by org.apache.hadoop.hbase.SystemExitRule$1 (file:/home/jenkins/jenkins-home/70ad3735/workspace/HBase-Nightly-s390x/hbase-common/target/test-classes/)
WARNING: Please consider reporting this to the maintainers of org.apache.hadoop.hbase.SystemExitRule$1
WARNING: System::setSecurityManager will be removed in a future release
[INFO] Tests run: 6, Failures: 0, Errors: 0, Skipped: 0, Time elapsed: 12.596 s - in org.apache.hadoop.hbase.master.procedure.TestDeleteNamespaceProcedure
WARNING: A terminally deprecated method in java.lang.System has been called
WARNING: System::setSecurityManager has been called by org.apache.hadoop.hbase.SystemExitRule (file:/home/jenkins/jenkins-home/70ad3735/workspace/HBase-Nightly-s390x/hbase-common/target/test-classes/)
WARNING: Please consider reporting this to the maintainers of org.apache.hadoop.hbase.SystemExitRule
WARNING: System::setSecurityManager will be removed in a future release
[INFO] Running org.apache.hadoop.hbase.master.procedure.TestMasterProcedureSchedulerConcurrency
WARNING: A terminally deprecated method in java.lang.System has been called
WARNING: System::setSecurityManager has been called by org.apache.hadoop.hbase.SystemExitRule$1 (file:/home/jenkins/jenkins-home/70ad3735/workspace/HBase-Nightly-s390x/hbase-common/target/test-classes/)
WARNING: Please consider reporting this to the maintainers of org.apache.hadoop.hbase.SystemExitRule$1
WARNING: System::setSecurityManager will be removed in a future release
[INFO] Tests run: 3, Failures: 0, Errors: 0, Skipped: 0, Time elapsed: 36.929 s - in org.apache.hadoop.hbase.master.procedure.TestMasterProcedureSchedulerConcurrency
WARNING: A terminally deprecated method in java.lang.System has been called
WARNING: System::setSecurityManager has been called by org.apache.hadoop.hbase.SystemExitRule (file:/home/jenkins/jenkins-home/70ad3735/workspace/HBase-Nightly-s390x/hbase-common/target/test-classes/)
WARNING: Please consider reporting this to the maintainers of org.apache.hadoop.hbase.SystemExitRule
WARNING: System::setSecurityManager will be removed in a future release
[INFO] Running org.apache.hadoop.hbase.master.procedure.TestProcedureTracing
WARNING: A terminally deprecated method in java.lang.System has been called
WARNING: System::setSecurityManager has been called by org.apache.hadoop.hbase.SystemExitRule$1 (file:/home/jenkins/jenkins-home/70ad3735/workspace/HBase-Nightly-s390x/hbase-common/target/test-classes/)
WARNING: Please consider reporting this to the maintainers of org.apache.hadoop.hbase.SystemExitRule$1
WARNING: System::setSecurityManager will be removed in a future release
[INFO] Tests run: 1, Failures: 0, Errors: 0, Skipped: 0, Time elapsed: 7.815 s - in org.apache.hadoop.hbase.master.procedure.TestProcedureTracing
WARNING: A terminally deprecated method in java.lang.System has been called
WARNING: System::setSecurityManager has been called by org.apache.hadoop.hbase.SystemExitRule (file:/home/jenkins/jenkins-home/70ad3735/workspace/HBase-Nightly-s390x/hbase-common/target/test-classes/)
WARNING: Please consider reporting this to the maintainers of org.apache.hadoop.hbase.SystemExitRule
WARNING: System::setSecurityManager will be removed in a future release
[INFO] Running org.apache.hadoop.hbase.master.procedure.TestMasterObserverPostCalls
WARNING: A terminally deprecated method in java.lang.System has been called
WARNING: System::setSecurityManager has been called by org.apache.hadoop.hbase.SystemExitRule$1 (file:/home/jenkins/jenkins-home/70ad3735/workspace/HBase-Nightly-s390x/hbase-common/target/test-classes/)
WARNING: Please consider reporting this to the maintainers of org.apache.hadoop.hbase.SystemExitRule$1
WARNING: System::setSecurityManager will be removed in a future release
[INFO] Tests run: 7, Failures: 0, Errors: 0, Skipped: 0, Time elapsed: 20.988 s - in org.apache.hadoop.hbase.master.procedure.TestMasterObserverPostCalls
WARNING: A terminally deprecated method in java.lang.System has been called
WARNING: System::setSecurityManager has been called by org.apache.hadoop.hbase.SystemExitRule (file:/home/jenkins/jenkins-home/70ad3735/workspace/HBase-Nightly-s390x/hbase-common/target/test-classes/)
WARNING: Please consider reporting this to the maintainers of org.apache.hadoop.hbase.SystemExitRule
WARNING: System::setSecurityManager will be removed in a future release
[INFO] Running org.apache.hadoop.hbase.master.procedure.TestFlushTableProcedure
WARNING: A terminally deprecated method in java.lang.System has been called
WARNING: System::setSecurityManager has been called by org.apache.hadoop.hbase.SystemExitRule$1 (file:/home/jenkins/jenkins-home/70ad3735/workspace/HBase-Nightly-s390x/hbase-common/target/test-classes/)
WARNING: Please consider reporting this to the maintainers of org.apache.hadoop.hbase.SystemExitRule$1
WARNING: System::setSecurityManager will be removed in a future release
[INFO] Tests run: 4, Failures: 0, Errors: 0, Skipped: 0, Time elapsed: 273.812 s - in org.apache.hadoop.hbase.master.procedure.TestFlushTableProcedure
WARNING: A terminally deprecated method in java.lang.System has been called
WARNING: System::setSecurityManager has been called by org.apache.hadoop.hbase.SystemExitRule (file:/home/jenkins/jenkins-home/70ad3735/workspace/HBase-Nightly-s390x/hbase-common/target/test-classes/)
WARNING: Please consider reporting this to the maintainers of org.apache.hadoop.hbase.SystemExitRule
WARNING: System::setSecurityManager will be removed in a future release
[INFO] Running org.apache.hadoop.hbase.master.procedure.TestReopenTableRegionsProcedureBatching
WARNING: A terminally deprecated method in java.lang.System has been called
WARNING: System::setSecurityManager has been called by org.apache.hadoop.hbase.SystemExitRule$1 (file:/home/jenkins/jenkins-home/70ad3735/workspace/HBase-Nightly-s390x/hbase-common/target/test-classes/)
WARNING: Please consider reporting this to the maintainers of org.apache.hadoop.hbase.SystemExitRule$1
WARNING: System::setSecurityManager will be removed in a future release
[INFO] Tests run: 4, Failures: 0, Errors: 0, Skipped: 0, Time elapsed: 70.813 s - in org.apache.hadoop.hbase.master.procedure.TestReopenTableRegionsProcedureBatching
WARNING: A terminally deprecated method in java.lang.System has been called
WARNING: System::setSecurityManager has been called by org.apache.hadoop.hbase.SystemExitRule (file:/home/jenkins/jenkins-home/70ad3735/workspace/HBase-Nightly-s390x/hbase-common/target/test-classes/)
WARNING: Please consider reporting this to the maintainers of org.apache.hadoop.hbase.SystemExitRule
WARNING: System::setSecurityManager will be removed in a future release
[INFO] Running org.apache.hadoop.hbase.master.procedure.TestSCP
WARNING: A terminally deprecated method in java.lang.System has been called
WARNING: System::setSecurityManager has been called by org.apache.hadoop.hbase.SystemExitRule$1 (file:/home/jenkins/jenkins-home/70ad3735/workspace/HBase-Nightly-s390x/hbase-common/target/test-classes/)
WARNING: Please consider reporting this to the maintainers of org.apache.hadoop.hbase.SystemExitRule$1
WARNING: System::setSecurityManager will be removed in a future release
[INFO] Tests run: 2, Failures: 0, Errors: 0, Skipped: 0, Time elapsed: 119.109 s - in org.apache.hadoop.hbase.master.procedure.TestSCP
WARNING: A terminally deprecated method in java.lang.System has been called
WARNING: System::setSecurityManager has been called by org.apache.hadoop.hbase.SystemExitRule (file:/home/jenkins/jenkins-home/70ad3735/workspace/HBase-Nightly-s390x/hbase-common/target/test-classes/)
WARNING: Please consider reporting this to the maintainers of org.apache.hadoop.hbase.SystemExitRule
WARNING: System::setSecurityManager will be removed in a future release
[INFO] Running org.apache.hadoop.hbase.master.procedure.TestReopenTableRegionsProcedureBatchBackoff
WARNING: A terminally deprecated method in java.lang.System has been called
WARNING: System::setSecurityManager has been called by org.apache.hadoop.hbase.SystemExitRule$1 (file:/home/jenkins/jenkins-home/70ad3735/workspace/HBase-Nightly-s390x/hbase-common/target/test-classes/)
WARNING: Please consider reporting this to the maintainers of org.apache.hadoop.hbase.SystemExitRule$1
WARNING: System::setSecurityManager will be removed in a future release
[INFO] Tests run: 2, Failures: 0, Errors: 0, Skipped: 0, Time elapsed: 52.644 s - in org.apache.hadoop.hbase.master.procedure.TestReopenTableRegionsProcedureBatchBackoff
WARNING: A terminally deprecated method in java.lang.System has been called
WARNING: System::setSecurityManager has been called by org.apache.hadoop.hbase.SystemExitRule (file:/home/jenkins/jenkins-home/70ad3735/workspace/HBase-Nightly-s390x/hbase-common/target/test-classes/)
WARNING: Please consider reporting this to the maintainers of org.apache.hadoop.hbase.SystemExitRule
WARNING: System::setSecurityManager will be removed in a future release
[INFO] Running org.apache.hadoop.hbase.master.procedure.TestSCPWithoutZKCoordinated
WARNING: A terminally deprecated method in java.lang.System has been called
WARNING: System::setSecurityManager has been called by org.apache.hadoop.hbase.SystemExitRule$1 (file:/home/jenkins/jenkins-home/70ad3735/workspace/HBase-Nightly-s390x/hbase-common/target/test-classes/)
WARNING: Please consider reporting this to the maintainers of org.apache.hadoop.hbase.SystemExitRule$1
WARNING: System::setSecurityManager will be removed in a future release
[INFO] Tests run: 2, Failures: 0, Errors: 0, Skipped: 0, Time elapsed: 117.006 s - in org.apache.hadoop.hbase.master.procedure.TestSCPWithoutZKCoordinated
WARNING: A terminally deprecated method in java.lang.System has been called
WARNING: System::setSecurityManager has been called by org.apache.hadoop.hbase.SystemExitRule (file:/home/jenkins/jenkins-home/70ad3735/workspace/HBase-Nightly-s390x/hbase-common/target/test-classes/)
WARNING: Please consider reporting this to the maintainers of org.apache.hadoop.hbase.SystemExitRule
WARNING: System::setSecurityManager will be removed in a future release
[INFO] Running org.apache.hadoop.hbase.master.procedure.TestCreateTableNoRegionServer
WARNING: A terminally deprecated method in java.lang.System has been called
WARNING: System::setSecurityManager has been called by org.apache.hadoop.hbase.SystemExitRule$1 (file:/home/jenkins/jenkins-home/70ad3735/workspace/HBase-Nightly-s390x/hbase-common/target/test-classes/)
WARNING: Please consider reporting this to the maintainers of org.apache.hadoop.hbase.SystemExitRule$1
WARNING: System::setSecurityManager will be removed in a future release
[INFO] Tests run: 1, Failures: 0, Errors: 0, Skipped: 0, Time elapsed: 21.809 s - in org.apache.hadoop.hbase.master.procedure.TestCreateTableNoRegionServer
WARNING: A terminally deprecated method in java.lang.System has been called
WARNING: System::setSecurityManager has been called by org.apache.hadoop.hbase.SystemExitRule (file:/home/jenkins/jenkins-home/70ad3735/workspace/HBase-Nightly-s390x/hbase-common/target/test-classes/)
WARNING: Please consider reporting this to the maintainers of org.apache.hadoop.hbase.SystemExitRule
WARNING: System::setSecurityManager will be removed in a future release
[INFO] Running org.apache.hadoop.hbase.master.procedure.TestSCPWithReplicasWithRSGroup
WARNING: A terminally deprecated method in java.lang.System has been called
WARNING: System::setSecurityManager has been called by org.apache.hadoop.hbase.SystemExitRule$1 (file:/home/jenkins/jenkins-home/70ad3735/workspace/HBase-Nightly-s390x/hbase-common/target/test-classes/)
WARNING: Please consider reporting this to the maintainers of org.apache.hadoop.hbase.SystemExitRule$1
WARNING: System::setSecurityManager will be removed in a future release
[INFO] Tests run: 1, Failures: 0, Errors: 0, Skipped: 0, Time elapsed: 82.827 s - in org.apache.hadoop.hbase.master.procedure.TestSCPWithReplicasWithRSGroup
WARNING: A terminally deprecated method in java.lang.System has been called
WARNING: System::setSecurityManager has been called by org.apache.hadoop.hbase.SystemExitRule (file:/home/jenkins/jenkins-home/70ad3735/workspace/HBase-Nightly-s390x/hbase-common/target/test-classes/)
WARNING: Please consider reporting this to the maintainers of org.apache.hadoop.hbase.SystemExitRule
WARNING: System::setSecurityManager will be removed in a future release
[INFO] Running org.apache.hadoop.hbase.master.procedure.TestCreateTableProcedureMuitipleRegions
WARNING: A terminally deprecated method in java.lang.System has been called
WARNING: System::setSecurityManager has been called by org.apache.hadoop.hbase.SystemExitRule$1 (file:/home/jenkins/jenkins-home/70ad3735/workspace/HBase-Nightly-s390x/hbase-common/target/test-classes/)
WARNING: Please consider reporting this to the maintainers of org.apache.hadoop.hbase.SystemExitRule$1
WARNING: System::setSecurityManager will be removed in a future release
[INFO] Tests run: 1, Failures: 0, Errors: 0, Skipped: 0, Time elapsed: 201.482 s - in org.apache.hadoop.hbase.master.procedure.TestCreateTableProcedureMuitipleRegions
WARNING: A terminally deprecated method in java.lang.System has been called
WARNING: System::setSecurityManager has been called by org.apache.hadoop.hbase.SystemExitRule (file:/home/jenkins/jenkins-home/70ad3735/workspace/HBase-Nightly-s390x/hbase-common/target/test-classes/)
WARNING: Please consider reporting this to the maintainers of org.apache.hadoop.hbase.SystemExitRule
WARNING: System::setSecurityManager will be removed in a future release
[INFO] Running org.apache.hadoop.hbase.master.procedure.TestTableProcedureWaitingQueueCleanup
WARNING: A terminally deprecated method in java.lang.System has been called
WARNING: System::setSecurityManager has been called by org.apache.hadoop.hbase.SystemExitRule$1 (file:/home/jenkins/jenkins-home/70ad3735/workspace/HBase-Nightly-s390x/hbase-common/target/test-classes/)
WARNING: Please consider reporting this to the maintainers of org.apache.hadoop.hbase.SystemExitRule$1
WARNING: System::setSecurityManager will be removed in a future release
[INFO] Tests run: 2, Failures: 0, Errors: 0, Skipped: 0, Time elapsed: 11.158 s - in org.apache.hadoop.hbase.master.procedure.TestTableProcedureWaitingQueueCleanup
WARNING: A terminally deprecated method in java.lang.System has been called
WARNING: System::setSecurityManager has been called by org.apache.hadoop.hbase.SystemExitRule (file:/home/jenkins/jenkins-home/70ad3735/workspace/HBase-Nightly-s390x/hbase-common/target/test-classes/)
WARNING: Please consider reporting this to the maintainers of org.apache.hadoop.hbase.SystemExitRule
WARNING: System::setSecurityManager will be removed in a future release
[INFO] Running org.apache.hadoop.hbase.master.procedure.TestSCPWithMeta
WARNING: A terminally deprecated method in java.lang.System has been called
WARNING: System::setSecurityManager has been called by org.apache.hadoop.hbase.SystemExitRule$1 (file:/home/jenkins/jenkins-home/70ad3735/workspace/HBase-Nightly-s390x/hbase-common/target/test-classes/)
WARNING: Please consider reporting this to the maintainers of org.apache.hadoop.hbase.SystemExitRule$1
WARNING: System::setSecurityManager will be removed in a future release
[INFO] Tests run: 1, Failures: 0, Errors: 0, Skipped: 0, Time elapsed: 253.011 s - in org.apache.hadoop.hbase.master.procedure.TestSCPWithMeta
WARNING: A terminally deprecated method in java.lang.System has been called
WARNING: System::setSecurityManager has been called by org.apache.hadoop.hbase.SystemExitRule (file:/home/jenkins/jenkins-home/70ad3735/workspace/HBase-Nightly-s390x/hbase-common/target/test-classes/)
WARNING: Please consider reporting this to the maintainers of org.apache.hadoop.hbase.SystemExitRule
WARNING: System::setSecurityManager will be removed in a future release
[INFO] Running org.apache.hadoop.hbase.master.procedure.TestRaceBetweenSCPAndDTP
WARNING: A terminally deprecated method in java.lang.System has been called
WARNING: System::setSecurityManager has been called by org.apache.hadoop.hbase.SystemExitRule$1 (file:/home/jenkins/jenkins-home/70ad3735/workspace/HBase-Nightly-s390x/hbase-common/target/test-classes/)
WARNING: Please consider reporting this to the maintainers of org.apache.hadoop.hbase.SystemExitRule$1
WARNING: System::setSecurityManager will be removed in a future release
[INFO] Tests run: 1, Failures: 0, Errors: 0, Skipped: 0, Time elapsed: 13.53 s - in org.apache.hadoop.hbase.master.procedure.TestRaceBetweenSCPAndDTP
WARNING: A terminally deprecated method in java.lang.System has been called
WARNING: System::setSecurityManager has been called by org.apache.hadoop.hbase.SystemExitRule (file:/home/jenkins/jenkins-home/70ad3735/workspace/HBase-Nightly-s390x/hbase-common/target/test-classes/)
WARNING: Please consider reporting this to the maintainers of org.apache.hadoop.hbase.SystemExitRule
WARNING: System::setSecurityManager will be removed in a future release
[INFO] Running org.apache.hadoop.hbase.master.procedure.TestCloneSnapshotProcedure
WARNING: A terminally deprecated method in java.lang.System has been called
WARNING: System::setSecurityManager has been called by org.apache.hadoop.hbase.SystemExitRule$1 (file:/home/jenkins/jenkins-home/70ad3735/workspace/HBase-Nightly-s390x/hbase-common/target/test-classes/)
WARNING: Please consider reporting this to the maintainers of org.apache.hadoop.hbase.SystemExitRule$1
WARNING: System::setSecurityManager will be removed in a future release
[INFO] Tests run: 5, Failures: 0, Errors: 0, Skipped: 0, Time elapsed: 144.648 s - in org.apache.hadoop.hbase.master.procedure.TestCloneSnapshotProcedure
WARNING: A terminally deprecated method in java.lang.System has been called
WARNING: System::setSecurityManager has been called by org.apache.hadoop.hbase.SystemExitRule (file:/home/jenkins/jenkins-home/70ad3735/workspace/HBase-Nightly-s390x/hbase-common/target/test-classes/)
WARNING: Please consider reporting this to the maintainers of org.apache.hadoop.hbase.SystemExitRule
WARNING: System::setSecurityManager will be removed in a future release
[INFO] Running org.apache.hadoop.hbase.master.procedure.TestSnapshotProcedureRSCrashes
WARNING: A terminally deprecated method in java.lang.System has been called
WARNING: System::setSecurityManager has been called by org.apache.hadoop.hbase.SystemExitRule$1 (file:/home/jenkins/jenkins-home/70ad3735/workspace/HBase-Nightly-s390x/hbase-common/target/test-classes/)
WARNING: Please consider reporting this to the maintainers of org.apache.hadoop.hbase.SystemExitRule$1
WARNING: System::setSecurityManager will be removed in a future release
[INFO] Tests run: 2, Failures: 0, Errors: 0, Skipped: 0, Time elapsed: 189.979 s - in org.apache.hadoop.hbase.master.procedure.TestSnapshotProcedureRSCrashes
WARNING: A terminally deprecated method in java.lang.System has been called
WARNING: System::setSecurityManager has been called by org.apache.hadoop.hbase.SystemExitRule (file:/home/jenkins/jenkins-home/70ad3735/workspace/HBase-Nightly-s390x/hbase-common/target/test-classes/)
WARNING: Please consider reporting this to the maintainers of org.apache.hadoop.hbase.SystemExitRule
WARNING: System::setSecurityManager will be removed in a future release
[INFO] Running org.apache.hadoop.hbase.master.procedure.TestFlushTableProcedureWithDoNotSupportFlushTableMaster
FATAL: command execution failed
java.io.EOFException
at java.base/java.io.ObjectInputStream$PeekInputStream.readFully(ObjectInputStream.java:2911)
at java.base/java.io.ObjectInputStream$BlockDataInputStream.readShort(ObjectInputStream.java:3406)
at java.base/java.io.ObjectInputStream.readStreamHeader(ObjectInputStream.java:932)
at java.base/java.io.ObjectInputStream.<init>(ObjectInputStream.java:375)
at hudson.remoting.ObjectInputStreamEx.<init>(ObjectInputStreamEx.java:49)
at hudson.remoting.Command.readFrom(Command.java:142)
at hudson.remoting.Command.readFrom(Command.java:128)
at hudson.remoting.AbstractSynchronousByteArrayCommandTransport.read(AbstractSynchronousByteArrayCommandTransport.java:35)
at hudson.remoting.SynchronousCommandTransport$ReaderThread.run(SynchronousCommandTransport.java:61)
Caused: java.io.IOException: Unexpected termination of the channel
at hudson.remoting.SynchronousCommandTransport$ReaderThread.run(SynchronousCommandTransport.java:75)
Caused: java.io.IOException: Backing channel 'jenkins-s390x-6' is disconnected.
at hudson.remoting.RemoteInvocationHandler.channelOrFail(RemoteInvocationHandler.java:215)
at hudson.remoting.RemoteInvocationHandler.invoke(RemoteInvocationHandler.java:285)
at com.sun.proxy.$Proxy112.isAlive(Unknown Source)
at hudson.Launcher$RemoteLauncher$ProcImpl.isAlive(Launcher.java:1212)
at hudson.Launcher$RemoteLauncher$ProcImpl.join(Launcher.java:1204)
at hudson.tasks.CommandInterpreter.join(CommandInterpreter.java:195)
at hudson.tasks.CommandInterpreter.perform(CommandInterpreter.java:145)
at hudson.tasks.CommandInterpreter.perform(CommandInterpreter.java:92)
at hudson.tasks.BuildStepMonitor$1.perform(BuildStepMonitor.java:20)
at hudson.model.AbstractBuild$AbstractBuildExecution.perform(AbstractBuild.java:818)
at hudson.model.Build$BuildExecution.build(Build.java:199)
at hudson.model.Build$BuildExecution.doRun(Build.java:164)
at hudson.model.AbstractBuild$AbstractBuildExecution.run(AbstractBuild.java:526)
at hudson.model.Run.execute(Run.java:1841)
at hudson.model.FreeStyleBuild.run(FreeStyleBuild.java:44)
at hudson.model.ResourceController.execute(ResourceController.java:101)
at hudson.model.Executor.run(Executor.java:442)
FATAL: Unable to delete script file /tmp/jenkins4319938952939971974.sh
java.io.EOFException
at java.base/java.io.ObjectInputStream$PeekInputStream.readFully(ObjectInputStream.java:2911)
at java.base/java.io.ObjectInputStream$BlockDataInputStream.readShort(ObjectInputStream.java:3406)
at java.base/java.io.ObjectInputStream.readStreamHeader(ObjectInputStream.java:932)
at java.base/java.io.ObjectInputStream.<init>(ObjectInputStream.java:375)
at hudson.remoting.ObjectInputStreamEx.<init>(ObjectInputStreamEx.java:49)
at hudson.remoting.Command.readFrom(Command.java:142)
at hudson.remoting.Command.readFrom(Command.java:128)
at hudson.remoting.AbstractSynchronousByteArrayCommandTransport.read(AbstractSynchronousByteArrayCommandTransport.java:35)
at hudson.remoting.SynchronousCommandTransport$ReaderThread.run(SynchronousCommandTransport.java:61)
Caused: java.io.IOException: Unexpected termination of the channel
at hudson.remoting.SynchronousCommandTransport$ReaderThread.run(SynchronousCommandTransport.java:75)
Caused: hudson.remoting.ChannelClosedException: Channel "hudson.remoting.Channel@743254e3:jenkins-s390x-6": Remote call on jenkins-s390x-6 failed. The channel is closing down or has closed down
at hudson.remoting.Channel.call(Channel.java:996)
at hudson.FilePath.act(FilePath.java:1230)
at hudson.FilePath.act(FilePath.java:1219)
at hudson.FilePath.delete(FilePath.java:1766)
at hudson.tasks.CommandInterpreter.perform(CommandInterpreter.java:163)
at hudson.tasks.CommandInterpreter.perform(CommandInterpreter.java:92)
at hudson.tasks.BuildStepMonitor$1.perform(BuildStepMonitor.java:20)
at hudson.model.AbstractBuild$AbstractBuildExecution.perform(AbstractBuild.java:818)
at hudson.model.Build$BuildExecution.build(Build.java:199)
at hudson.model.Build$BuildExecution.doRun(Build.java:164)
at hudson.model.AbstractBuild$AbstractBuildExecution.run(AbstractBuild.java:526)
at hudson.model.Run.execute(Run.java:1841)
at hudson.model.FreeStyleBuild.run(FreeStyleBuild.java:44)
at hudson.model.ResourceController.execute(ResourceController.java:101)
at hudson.model.Executor.run(Executor.java:442)
Build step 'Execute shell' marked build as failure
ERROR: Step ‘Archive the artifacts’ failed: no workspace for HBase-Nightly-s390x #603
ERROR: Step ‘Publish JUnit test result report’ failed: no workspace for HBase-Nightly-s390x #603
Jenkins build is still unstable: HBase-Nightly-s390x #602
Posted by Apache Jenkins Server <je...@builds.apache.org>.
See <https://ci-hbase.apache.org/job/HBase-Nightly-s390x/602/display/redirect>
Jenkins build is unstable: HBase-Nightly-s390x #601
Posted by Apache Jenkins Server <je...@builds.apache.org>.
See <https://ci-hbase.apache.org/job/HBase-Nightly-s390x/601/display/redirect>
Build failed in Jenkins: HBase-Nightly-s390x #600
Posted by Apache Jenkins Server <je...@builds.apache.org>.
See <https://ci-hbase.apache.org/job/HBase-Nightly-s390x/600/display/redirect?page=changes>
Changes:
[noreply] HBASE-28806 ExportSnapshot failed if reference file present (#6461)
------------------------------------------
[...truncated 2.83 MB...]
[INFO] Tests run: 2, Failures: 0, Errors: 0, Skipped: 0, Time elapsed: 6.401 s - in org.apache.hadoop.hbase.client.TestFromClientSideNoCodec
WARNING: A terminally deprecated method in java.lang.System has been called
WARNING: System::setSecurityManager has been called by org.apache.hadoop.hbase.SystemExitRule (file:/home/jenkins/jenkins-home/70ad3735/workspace/HBase-Nightly-s390x/hbase-common/target/test-classes/)
WARNING: Please consider reporting this to the maintainers of org.apache.hadoop.hbase.SystemExitRule
WARNING: System::setSecurityManager will be removed in a future release
[INFO] Running org.apache.hadoop.hbase.client.TestAsyncDecommissionAdminApi
WARNING: A terminally deprecated method in java.lang.System has been called
WARNING: System::setSecurityManager has been called by org.apache.hadoop.hbase.SystemExitRule$1 (file:/home/jenkins/jenkins-home/70ad3735/workspace/HBase-Nightly-s390x/hbase-common/target/test-classes/)
WARNING: Please consider reporting this to the maintainers of org.apache.hadoop.hbase.SystemExitRule$1
WARNING: System::setSecurityManager will be removed in a future release
[INFO] Tests run: 2, Failures: 0, Errors: 0, Skipped: 0, Time elapsed: 22.058 s - in org.apache.hadoop.hbase.client.TestAsyncDecommissionAdminApi
WARNING: A terminally deprecated method in java.lang.System has been called
WARNING: System::setSecurityManager has been called by org.apache.hadoop.hbase.SystemExitRule (file:/home/jenkins/jenkins-home/70ad3735/workspace/HBase-Nightly-s390x/hbase-common/target/test-classes/)
WARNING: Please consider reporting this to the maintainers of org.apache.hadoop.hbase.SystemExitRule
WARNING: System::setSecurityManager will be removed in a future release
[INFO] Running org.apache.hadoop.hbase.client.TestFlushFromClient
WARNING: A terminally deprecated method in java.lang.System has been called
WARNING: System::setSecurityManager has been called by org.apache.hadoop.hbase.SystemExitRule$1 (file:/home/jenkins/jenkins-home/70ad3735/workspace/HBase-Nightly-s390x/hbase-common/target/test-classes/)
WARNING: Please consider reporting this to the maintainers of org.apache.hadoop.hbase.SystemExitRule$1
WARNING: System::setSecurityManager will be removed in a future release
[INFO] Tests run: 12, Failures: 0, Errors: 0, Skipped: 0, Time elapsed: 59.821 s - in org.apache.hadoop.hbase.client.TestFlushFromClient
WARNING: A terminally deprecated method in java.lang.System has been called
WARNING: System::setSecurityManager has been called by org.apache.hadoop.hbase.SystemExitRule (file:/home/jenkins/jenkins-home/70ad3735/workspace/HBase-Nightly-s390x/hbase-common/target/test-classes/)
WARNING: Please consider reporting this to the maintainers of org.apache.hadoop.hbase.SystemExitRule
WARNING: System::setSecurityManager will be removed in a future release
[INFO] Running org.apache.hadoop.hbase.client.TestMalformedCellFromClient
WARNING: A terminally deprecated method in java.lang.System has been called
WARNING: System::setSecurityManager has been called by org.apache.hadoop.hbase.SystemExitRule$1 (file:/home/jenkins/jenkins-home/70ad3735/workspace/HBase-Nightly-s390x/hbase-common/target/test-classes/)
WARNING: Please consider reporting this to the maintainers of org.apache.hadoop.hbase.SystemExitRule$1
WARNING: System::setSecurityManager will be removed in a future release
[INFO] Tests run: 5, Failures: 0, Errors: 0, Skipped: 0, Time elapsed: 16.171 s - in org.apache.hadoop.hbase.client.TestMalformedCellFromClient
WARNING: A terminally deprecated method in java.lang.System has been called
WARNING: System::setSecurityManager has been called by org.apache.hadoop.hbase.SystemExitRule (file:/home/jenkins/jenkins-home/70ad3735/workspace/HBase-Nightly-s390x/hbase-common/target/test-classes/)
WARNING: Please consider reporting this to the maintainers of org.apache.hadoop.hbase.SystemExitRule
WARNING: System::setSecurityManager will be removed in a future release
[INFO] Running org.apache.hadoop.hbase.client.TestSnapshotCloneIndependence
WARNING: A terminally deprecated method in java.lang.System has been called
WARNING: System::setSecurityManager has been called by org.apache.hadoop.hbase.SystemExitRule$1 (file:/home/jenkins/jenkins-home/70ad3735/workspace/HBase-Nightly-s390x/hbase-common/target/test-classes/)
WARNING: Please consider reporting this to the maintainers of org.apache.hadoop.hbase.SystemExitRule$1
WARNING: System::setSecurityManager will be removed in a future release
[INFO] Tests run: 8, Failures: 0, Errors: 0, Skipped: 0, Time elapsed: 72.448 s - in org.apache.hadoop.hbase.client.TestSnapshotCloneIndependence
WARNING: A terminally deprecated method in java.lang.System has been called
WARNING: System::setSecurityManager has been called by org.apache.hadoop.hbase.SystemExitRule (file:/home/jenkins/jenkins-home/70ad3735/workspace/HBase-Nightly-s390x/hbase-common/target/test-classes/)
WARNING: Please consider reporting this to the maintainers of org.apache.hadoop.hbase.SystemExitRule
WARNING: System::setSecurityManager will be removed in a future release
[INFO] Running org.apache.hadoop.hbase.client.TestCheckAndMutate
WARNING: A terminally deprecated method in java.lang.System has been called
WARNING: System::setSecurityManager has been called by org.apache.hadoop.hbase.SystemExitRule$1 (file:/home/jenkins/jenkins-home/70ad3735/workspace/HBase-Nightly-s390x/hbase-common/target/test-classes/)
WARNING: Please consider reporting this to the maintainers of org.apache.hadoop.hbase.SystemExitRule$1
WARNING: System::setSecurityManager will be removed in a future release
[INFO] Tests run: 23, Failures: 0, Errors: 0, Skipped: 0, Time elapsed: 39.066 s - in org.apache.hadoop.hbase.client.TestCheckAndMutate
WARNING: A terminally deprecated method in java.lang.System has been called
WARNING: System::setSecurityManager has been called by org.apache.hadoop.hbase.SystemExitRule (file:/home/jenkins/jenkins-home/70ad3735/workspace/HBase-Nightly-s390x/hbase-common/target/test-classes/)
WARNING: Please consider reporting this to the maintainers of org.apache.hadoop.hbase.SystemExitRule
WARNING: System::setSecurityManager will be removed in a future release
[INFO] Running org.apache.hadoop.hbase.client.TestAsyncAdminBuilder
WARNING: A terminally deprecated method in java.lang.System has been called
WARNING: System::setSecurityManager has been called by org.apache.hadoop.hbase.SystemExitRule$1 (file:/home/jenkins/jenkins-home/70ad3735/workspace/HBase-Nightly-s390x/hbase-common/target/test-classes/)
WARNING: Please consider reporting this to the maintainers of org.apache.hadoop.hbase.SystemExitRule$1
WARNING: System::setSecurityManager will be removed in a future release
[INFO] Tests run: 6, Failures: 0, Errors: 0, Skipped: 0, Time elapsed: 142.426 s - in org.apache.hadoop.hbase.client.TestAsyncAdminBuilder
WARNING: A terminally deprecated method in java.lang.System has been called
WARNING: System::setSecurityManager has been called by org.apache.hadoop.hbase.SystemExitRule (file:/home/jenkins/jenkins-home/70ad3735/workspace/HBase-Nightly-s390x/hbase-common/target/test-classes/)
WARNING: Please consider reporting this to the maintainers of org.apache.hadoop.hbase.SystemExitRule
WARNING: System::setSecurityManager will be removed in a future release
[INFO] Running org.apache.hadoop.hbase.client.TestSnapshotWithAcl
WARNING: A terminally deprecated method in java.lang.System has been called
WARNING: System::setSecurityManager has been called by org.apache.hadoop.hbase.SystemExitRule$1 (file:/home/jenkins/jenkins-home/70ad3735/workspace/HBase-Nightly-s390x/hbase-common/target/test-classes/)
WARNING: Please consider reporting this to the maintainers of org.apache.hadoop.hbase.SystemExitRule$1
WARNING: System::setSecurityManager will be removed in a future release
[INFO] Tests run: 2, Failures: 0, Errors: 0, Skipped: 0, Time elapsed: 310.257 s - in org.apache.hadoop.hbase.client.TestSnapshotWithAcl
WARNING: A terminally deprecated method in java.lang.System has been called
WARNING: System::setSecurityManager has been called by org.apache.hadoop.hbase.SystemExitRule (file:/home/jenkins/jenkins-home/70ad3735/workspace/HBase-Nightly-s390x/hbase-common/target/test-classes/)
WARNING: Please consider reporting this to the maintainers of org.apache.hadoop.hbase.SystemExitRule
WARNING: System::setSecurityManager will be removed in a future release
[INFO] Running org.apache.hadoop.hbase.client.TestGetProcedureResult
WARNING: A terminally deprecated method in java.lang.System has been called
WARNING: System::setSecurityManager has been called by org.apache.hadoop.hbase.SystemExitRule$1 (file:/home/jenkins/jenkins-home/70ad3735/workspace/HBase-Nightly-s390x/hbase-common/target/test-classes/)
WARNING: Please consider reporting this to the maintainers of org.apache.hadoop.hbase.SystemExitRule$1
WARNING: System::setSecurityManager will be removed in a future release
[INFO] Tests run: 1, Failures: 0, Errors: 0, Skipped: 0, Time elapsed: 2.581 s - in org.apache.hadoop.hbase.client.TestGetProcedureResult
WARNING: A terminally deprecated method in java.lang.System has been called
WARNING: System::setSecurityManager has been called by org.apache.hadoop.hbase.SystemExitRule (file:/home/jenkins/jenkins-home/70ad3735/workspace/HBase-Nightly-s390x/hbase-common/target/test-classes/)
WARNING: Please consider reporting this to the maintainers of org.apache.hadoop.hbase.SystemExitRule
WARNING: System::setSecurityManager will be removed in a future release
[INFO] Running org.apache.hadoop.hbase.client.TestConnection
WARNING: A terminally deprecated method in java.lang.System has been called
WARNING: System::setSecurityManager has been called by org.apache.hadoop.hbase.SystemExitRule$1 (file:/home/jenkins/jenkins-home/70ad3735/workspace/HBase-Nightly-s390x/hbase-common/target/test-classes/)
WARNING: Please consider reporting this to the maintainers of org.apache.hadoop.hbase.SystemExitRule$1
WARNING: System::setSecurityManager will be removed in a future release
[INFO] Tests run: 9, Failures: 0, Errors: 0, Skipped: 0, Time elapsed: 69.801 s - in org.apache.hadoop.hbase.client.TestConnection
WARNING: A terminally deprecated method in java.lang.System has been called
WARNING: System::setSecurityManager has been called by org.apache.hadoop.hbase.SystemExitRule (file:/home/jenkins/jenkins-home/70ad3735/workspace/HBase-Nightly-s390x/hbase-common/target/test-classes/)
WARNING: Please consider reporting this to the maintainers of org.apache.hadoop.hbase.SystemExitRule
WARNING: System::setSecurityManager will be removed in a future release
[INFO] Running org.apache.hadoop.hbase.client.TestMultiRespectsLimits
WARNING: A terminally deprecated method in java.lang.System has been called
WARNING: System::setSecurityManager has been called by org.apache.hadoop.hbase.SystemExitRule$1 (file:/home/jenkins/jenkins-home/70ad3735/workspace/HBase-Nightly-s390x/hbase-common/target/test-classes/)
WARNING: Please consider reporting this to the maintainers of org.apache.hadoop.hbase.SystemExitRule$1
WARNING: System::setSecurityManager will be removed in a future release
[INFO] Tests run: 2, Failures: 0, Errors: 0, Skipped: 0, Time elapsed: 11.652 s - in org.apache.hadoop.hbase.client.TestMultiRespectsLimits
WARNING: A terminally deprecated method in java.lang.System has been called
WARNING: System::setSecurityManager has been called by org.apache.hadoop.hbase.SystemExitRule (file:/home/jenkins/jenkins-home/70ad3735/workspace/HBase-Nightly-s390x/hbase-common/target/test-classes/)
WARNING: Please consider reporting this to the maintainers of org.apache.hadoop.hbase.SystemExitRule
WARNING: System::setSecurityManager will be removed in a future release
[INFO] Running org.apache.hadoop.hbase.client.TestAsyncReplicationAdminApiWithClusters
WARNING: A terminally deprecated method in java.lang.System has been called
WARNING: System::setSecurityManager has been called by org.apache.hadoop.hbase.SystemExitRule$1 (file:/home/jenkins/jenkins-home/70ad3735/workspace/HBase-Nightly-s390x/hbase-common/target/test-classes/)
WARNING: Please consider reporting this to the maintainers of org.apache.hadoop.hbase.SystemExitRule$1
WARNING: System::setSecurityManager will be removed in a future release
[INFO] Tests run: 16, Failures: 0, Errors: 0, Skipped: 0, Time elapsed: 82.555 s - in org.apache.hadoop.hbase.client.TestAsyncReplicationAdminApiWithClusters
WARNING: A terminally deprecated method in java.lang.System has been called
WARNING: System::setSecurityManager has been called by org.apache.hadoop.hbase.SystemExitRule (file:/home/jenkins/jenkins-home/70ad3735/workspace/HBase-Nightly-s390x/hbase-common/target/test-classes/)
WARNING: Please consider reporting this to the maintainers of org.apache.hadoop.hbase.SystemExitRule
WARNING: System::setSecurityManager will be removed in a future release
[INFO] Running org.apache.hadoop.hbase.client.TestAsyncTableAdminApi
WARNING: A terminally deprecated method in java.lang.System has been called
WARNING: System::setSecurityManager has been called by org.apache.hadoop.hbase.SystemExitRule$1 (file:/home/jenkins/jenkins-home/70ad3735/workspace/HBase-Nightly-s390x/hbase-common/target/test-classes/)
WARNING: Please consider reporting this to the maintainers of org.apache.hadoop.hbase.SystemExitRule$1
WARNING: System::setSecurityManager will be removed in a future release
[INFO] Tests run: 26, Failures: 0, Errors: 0, Skipped: 0, Time elapsed: 138.232 s - in org.apache.hadoop.hbase.client.TestAsyncTableAdminApi
WARNING: A terminally deprecated method in java.lang.System has been called
WARNING: System::setSecurityManager has been called by org.apache.hadoop.hbase.SystemExitRule (file:/home/jenkins/jenkins-home/70ad3735/workspace/HBase-Nightly-s390x/hbase-common/target/test-classes/)
WARNING: Please consider reporting this to the maintainers of org.apache.hadoop.hbase.SystemExitRule
WARNING: System::setSecurityManager will be removed in a future release
[INFO] Running org.apache.hadoop.hbase.client.TestAsyncNonMetaRegionLocator
WARNING: A terminally deprecated method in java.lang.System has been called
WARNING: System::setSecurityManager has been called by org.apache.hadoop.hbase.SystemExitRule$1 (file:/home/jenkins/jenkins-home/70ad3735/workspace/HBase-Nightly-s390x/hbase-common/target/test-classes/)
WARNING: Please consider reporting this to the maintainers of org.apache.hadoop.hbase.SystemExitRule$1
WARNING: System::setSecurityManager will be removed in a future release
[INFO] Tests run: 28, Failures: 0, Errors: 0, Skipped: 0, Time elapsed: 120.802 s - in org.apache.hadoop.hbase.client.TestAsyncNonMetaRegionLocator
WARNING: A terminally deprecated method in java.lang.System has been called
WARNING: System::setSecurityManager has been called by org.apache.hadoop.hbase.SystemExitRule (file:/home/jenkins/jenkins-home/70ad3735/workspace/HBase-Nightly-s390x/hbase-common/target/test-classes/)
WARNING: Please consider reporting this to the maintainers of org.apache.hadoop.hbase.SystemExitRule
WARNING: System::setSecurityManager will be removed in a future release
[INFO] Running org.apache.hadoop.hbase.client.TestMvccConsistentScanner
WARNING: A terminally deprecated method in java.lang.System has been called
WARNING: System::setSecurityManager has been called by org.apache.hadoop.hbase.SystemExitRule$1 (file:/home/jenkins/jenkins-home/70ad3735/workspace/HBase-Nightly-s390x/hbase-common/target/test-classes/)
WARNING: Please consider reporting this to the maintainers of org.apache.hadoop.hbase.SystemExitRule$1
WARNING: System::setSecurityManager will be removed in a future release
[INFO] Tests run: 2, Failures: 0, Errors: 0, Skipped: 0, Time elapsed: 7.453 s - in org.apache.hadoop.hbase.client.TestMvccConsistentScanner
WARNING: A terminally deprecated method in java.lang.System has been called
WARNING: System::setSecurityManager has been called by org.apache.hadoop.hbase.SystemExitRule (file:/home/jenkins/jenkins-home/70ad3735/workspace/HBase-Nightly-s390x/hbase-common/target/test-classes/)
WARNING: Please consider reporting this to the maintainers of org.apache.hadoop.hbase.SystemExitRule
WARNING: System::setSecurityManager will be removed in a future release
[INFO] Running org.apache.hadoop.hbase.client.TestRawAsyncTableScan
WARNING: A terminally deprecated method in java.lang.System has been called
WARNING: System::setSecurityManager has been called by org.apache.hadoop.hbase.SystemExitRule$1 (file:/home/jenkins/jenkins-home/70ad3735/workspace/HBase-Nightly-s390x/hbase-common/target/test-classes/)
WARNING: Please consider reporting this to the maintainers of org.apache.hadoop.hbase.SystemExitRule$1
WARNING: System::setSecurityManager will be removed in a future release
[INFO] Tests run: 56, Failures: 0, Errors: 0, Skipped: 0, Time elapsed: 152.703 s - in org.apache.hadoop.hbase.client.TestRawAsyncTableScan
WARNING: A terminally deprecated method in java.lang.System has been called
WARNING: System::setSecurityManager has been called by org.apache.hadoop.hbase.SystemExitRule (file:/home/jenkins/jenkins-home/70ad3735/workspace/HBase-Nightly-s390x/hbase-common/target/test-classes/)
WARNING: Please consider reporting this to the maintainers of org.apache.hadoop.hbase.SystemExitRule
WARNING: System::setSecurityManager will be removed in a future release
[INFO] Running org.apache.hadoop.hbase.client.TestAsyncTableScannerCloseWhileSuspending
WARNING: A terminally deprecated method in java.lang.System has been called
WARNING: System::setSecurityManager has been called by org.apache.hadoop.hbase.SystemExitRule$1 (file:/home/jenkins/jenkins-home/70ad3735/workspace/HBase-Nightly-s390x/hbase-common/target/test-classes/)
WARNING: Please consider reporting this to the maintainers of org.apache.hadoop.hbase.SystemExitRule$1
WARNING: System::setSecurityManager will be removed in a future release
[INFO] Tests run: 1, Failures: 0, Errors: 0, Skipped: 0, Time elapsed: 3.847 s - in org.apache.hadoop.hbase.client.TestAsyncTableScannerCloseWhileSuspending
WARNING: A terminally deprecated method in java.lang.System has been called
WARNING: System::setSecurityManager has been called by org.apache.hadoop.hbase.SystemExitRule (file:/home/jenkins/jenkins-home/70ad3735/workspace/HBase-Nightly-s390x/hbase-common/target/test-classes/)
WARNING: Please consider reporting this to the maintainers of org.apache.hadoop.hbase.SystemExitRule
WARNING: System::setSecurityManager will be removed in a future release
[INFO] Running org.apache.hadoop.hbase.client.TestMobRestoreSnapshotFromClientGetCompactionState
WARNING: A terminally deprecated method in java.lang.System has been called
WARNING: System::setSecurityManager has been called by org.apache.hadoop.hbase.SystemExitRule$1 (file:/home/jenkins/jenkins-home/70ad3735/workspace/HBase-Nightly-s390x/hbase-common/target/test-classes/)
WARNING: Please consider reporting this to the maintainers of org.apache.hadoop.hbase.SystemExitRule$1
WARNING: System::setSecurityManager will be removed in a future release
[INFO] Tests run: 1, Failures: 0, Errors: 0, Skipped: 0, Time elapsed: 53.828 s - in org.apache.hadoop.hbase.client.TestMobRestoreSnapshotFromClientGetCompactionState
WARNING: A terminally deprecated method in java.lang.System has been called
WARNING: System::setSecurityManager has been called by org.apache.hadoop.hbase.SystemExitRule (file:/home/jenkins/jenkins-home/70ad3735/workspace/HBase-Nightly-s390x/hbase-common/target/test-classes/)
WARNING: Please consider reporting this to the maintainers of org.apache.hadoop.hbase.SystemExitRule
WARNING: System::setSecurityManager will be removed in a future release
[INFO] Running org.apache.hadoop.hbase.client.TestMetaTableAccessorNoCluster
[INFO] Tests run: 1, Failures: 0, Errors: 0, Skipped: 0, Time elapsed: 0.412 s - in org.apache.hadoop.hbase.client.TestMetaTableAccessorNoCluster
WARNING: A terminally deprecated method in java.lang.System has been called
WARNING: System::setSecurityManager has been called by org.apache.hadoop.hbase.SystemExitRule$1 (file:/home/jenkins/jenkins-home/70ad3735/workspace/HBase-Nightly-s390x/hbase-common/target/test-classes/)
WARNING: Please consider reporting this to the maintainers of org.apache.hadoop.hbase.SystemExitRule$1
WARNING: System::setSecurityManager will be removed in a future release
WARNING: A terminally deprecated method in java.lang.System has been called
WARNING: System::setSecurityManager has been called by org.apache.hadoop.hbase.SystemExitRule (file:/home/jenkins/jenkins-home/70ad3735/workspace/HBase-Nightly-s390x/hbase-common/target/test-classes/)
WARNING: Please consider reporting this to the maintainers of org.apache.hadoop.hbase.SystemExitRule
WARNING: System::setSecurityManager will be removed in a future release
[INFO] Running org.apache.hadoop.hbase.client.TestFromClientSideWithCoprocessor5
FATAL: command execution failed
java.io.EOFException
at java.base/java.io.ObjectInputStream$PeekInputStream.readFully(ObjectInputStream.java:2911)
at java.base/java.io.ObjectInputStream$BlockDataInputStream.readShort(ObjectInputStream.java:3406)
at java.base/java.io.ObjectInputStream.readStreamHeader(ObjectInputStream.java:932)
at java.base/java.io.ObjectInputStream.<init>(ObjectInputStream.java:375)
at hudson.remoting.ObjectInputStreamEx.<init>(ObjectInputStreamEx.java:49)
at hudson.remoting.Command.readFrom(Command.java:142)
at hudson.remoting.Command.readFrom(Command.java:128)
at hudson.remoting.AbstractSynchronousByteArrayCommandTransport.read(AbstractSynchronousByteArrayCommandTransport.java:35)
at hudson.remoting.SynchronousCommandTransport$ReaderThread.run(SynchronousCommandTransport.java:61)
Caused: java.io.IOException: Unexpected termination of the channel
at hudson.remoting.SynchronousCommandTransport$ReaderThread.run(SynchronousCommandTransport.java:75)
Caused: java.io.IOException: Backing channel 'jenkins-s390x-3' is disconnected.
at hudson.remoting.RemoteInvocationHandler.channelOrFail(RemoteInvocationHandler.java:215)
at hudson.remoting.RemoteInvocationHandler.invoke(RemoteInvocationHandler.java:285)
at com.sun.proxy.$Proxy112.isAlive(Unknown Source)
at hudson.Launcher$RemoteLauncher$ProcImpl.isAlive(Launcher.java:1212)
at hudson.Launcher$RemoteLauncher$ProcImpl.join(Launcher.java:1204)
at hudson.tasks.CommandInterpreter.join(CommandInterpreter.java:195)
at hudson.tasks.CommandInterpreter.perform(CommandInterpreter.java:145)
at hudson.tasks.CommandInterpreter.perform(CommandInterpreter.java:92)
at hudson.tasks.BuildStepMonitor$1.perform(BuildStepMonitor.java:20)
at hudson.model.AbstractBuild$AbstractBuildExecution.perform(AbstractBuild.java:818)
at hudson.model.Build$BuildExecution.build(Build.java:199)
at hudson.model.Build$BuildExecution.doRun(Build.java:164)
at hudson.model.AbstractBuild$AbstractBuildExecution.run(AbstractBuild.java:526)
at hudson.model.Run.execute(Run.java:1841)
at hudson.model.FreeStyleBuild.run(FreeStyleBuild.java:44)
at hudson.model.ResourceController.execute(ResourceController.java:101)
at hudson.model.Executor.run(Executor.java:442)
FATAL: Unable to delete script file /tmp/jenkins12391195029634830143.sh
java.io.EOFException
at java.base/java.io.ObjectInputStream$PeekInputStream.readFully(ObjectInputStream.java:2911)
at java.base/java.io.ObjectInputStream$BlockDataInputStream.readShort(ObjectInputStream.java:3406)
at java.base/java.io.ObjectInputStream.readStreamHeader(ObjectInputStream.java:932)
at java.base/java.io.ObjectInputStream.<init>(ObjectInputStream.java:375)
at hudson.remoting.ObjectInputStreamEx.<init>(ObjectInputStreamEx.java:49)
at hudson.remoting.Command.readFrom(Command.java:142)
at hudson.remoting.Command.readFrom(Command.java:128)
at hudson.remoting.AbstractSynchronousByteArrayCommandTransport.read(AbstractSynchronousByteArrayCommandTransport.java:35)
at hudson.remoting.SynchronousCommandTransport$ReaderThread.run(SynchronousCommandTransport.java:61)
Caused: java.io.IOException: Unexpected termination of the channel
at hudson.remoting.SynchronousCommandTransport$ReaderThread.run(SynchronousCommandTransport.java:75)
Caused: hudson.remoting.ChannelClosedException: Channel "hudson.remoting.Channel@2a889bc7:jenkins-s390x-3": Remote call on jenkins-s390x-3 failed. The channel is closing down or has closed down
at hudson.remoting.Channel.call(Channel.java:996)
at hudson.FilePath.act(FilePath.java:1230)
at hudson.FilePath.act(FilePath.java:1219)
at hudson.FilePath.delete(FilePath.java:1766)
at hudson.tasks.CommandInterpreter.perform(CommandInterpreter.java:163)
at hudson.tasks.CommandInterpreter.perform(CommandInterpreter.java:92)
at hudson.tasks.BuildStepMonitor$1.perform(BuildStepMonitor.java:20)
at hudson.model.AbstractBuild$AbstractBuildExecution.perform(AbstractBuild.java:818)
at hudson.model.Build$BuildExecution.build(Build.java:199)
at hudson.model.Build$BuildExecution.doRun(Build.java:164)
at hudson.model.AbstractBuild$AbstractBuildExecution.run(AbstractBuild.java:526)
at hudson.model.Run.execute(Run.java:1841)
at hudson.model.FreeStyleBuild.run(FreeStyleBuild.java:44)
at hudson.model.ResourceController.execute(ResourceController.java:101)
at hudson.model.Executor.run(Executor.java:442)
Build step 'Execute shell' marked build as failure
ERROR: Step ‘Archive the artifacts’ failed: no workspace for HBase-Nightly-s390x #600
ERROR: Step ‘Publish JUnit test result report’ failed: no workspace for HBase-Nightly-s390x #600
Jenkins build is still unstable: HBase-Nightly-s390x #599
Posted by Apache Jenkins Server <je...@builds.apache.org>.
See <https://ci-hbase.apache.org/job/HBase-Nightly-s390x/599/display/redirect?page=changes>
Jenkins build is still unstable: HBase-Nightly-s390x #598
Posted by Apache Jenkins Server <je...@builds.apache.org>.
See <https://ci-hbase.apache.org/job/HBase-Nightly-s390x/598/display/redirect>
Jenkins build is still unstable: HBase-Nightly-s390x #597
Posted by Apache Jenkins Server <je...@builds.apache.org>.
See <https://ci-hbase.apache.org/job/HBase-Nightly-s390x/597/display/redirect>
Jenkins build is still unstable: HBase-Nightly-s390x #596
Posted by Apache Jenkins Server <je...@builds.apache.org>.
See <https://ci-hbase.apache.org/job/HBase-Nightly-s390x/596/display/redirect>
Jenkins build is still unstable: HBase-Nightly-s390x #595
Posted by Apache Jenkins Server <je...@builds.apache.org>.
See <https://ci-hbase.apache.org/job/HBase-Nightly-s390x/595/display/redirect>
Jenkins build is unstable: HBase-Nightly-s390x #594
Posted by Apache Jenkins Server <je...@builds.apache.org>.
See <https://ci-hbase.apache.org/job/HBase-Nightly-s390x/594/display/redirect>
Build failed in Jenkins: HBase-Nightly-s390x #593
Posted by Apache Jenkins Server <je...@builds.apache.org>.
See <https://ci-hbase.apache.org/job/HBase-Nightly-s390x/593/display/redirect?page=changes>
Changes:
[noreply] HBASE-28976 Fix UT flakeyness in TestBucketCache.testBlockAdditionWaitWhenCache and TestVerifyBucketCacheFile.testRetrieveFromFile (#6463)
------------------------------------------
[...truncated 3.11 MB...]
WARNING: Please consider reporting this to the maintainers of org.apache.hadoop.hbase.SystemExitRule
WARNING: System::setSecurityManager will be removed in a future release
[INFO] Running org.apache.hadoop.hbase.rest.TestTableResource
WARNING: A terminally deprecated method in java.lang.System has been called
WARNING: System::setSecurityManager has been called by org.apache.hadoop.hbase.SystemExitRule$1 (file:/home/jenkins/jenkins-home/70ad3735/workspace/HBase-Nightly-s390x/hbase-common/target/test-classes/)
WARNING: Please consider reporting this to the maintainers of org.apache.hadoop.hbase.SystemExitRule$1
WARNING: System::setSecurityManager will be removed in a future release
[INFO] Tests run: 9, Failures: 0, Errors: 0, Skipped: 0, Time elapsed: 4.972 s - in org.apache.hadoop.hbase.rest.TestTableResource
WARNING: A terminally deprecated method in java.lang.System has been called
WARNING: System::setSecurityManager has been called by org.apache.hadoop.hbase.SystemExitRule (file:/home/jenkins/jenkins-home/70ad3735/workspace/HBase-Nightly-s390x/hbase-common/target/test-classes/)
WARNING: Please consider reporting this to the maintainers of org.apache.hadoop.hbase.SystemExitRule
WARNING: System::setSecurityManager will be removed in a future release
[INFO] Running org.apache.hadoop.hbase.rest.client.TestRemoteTable
WARNING: A terminally deprecated method in java.lang.System has been called
WARNING: System::setSecurityManager has been called by org.apache.hadoop.hbase.SystemExitRule$1 (file:/home/jenkins/jenkins-home/70ad3735/workspace/HBase-Nightly-s390x/hbase-common/target/test-classes/)
WARNING: Please consider reporting this to the maintainers of org.apache.hadoop.hbase.SystemExitRule$1
WARNING: System::setSecurityManager will be removed in a future release
[INFO] Tests run: 11, Failures: 0, Errors: 0, Skipped: 0, Time elapsed: 66.371 s - in org.apache.hadoop.hbase.rest.client.TestRemoteTable
[INFO]
[INFO] Results:
[INFO]
[WARNING] Tests run: 137, Failures: 0, Errors: 0, Skipped: 1
[INFO]
[INFO]
[INFO] ------------------< org.apache.hbase:hbase-examples >-------------------
[INFO] Building Apache HBase - Examples 4.0.0-alpha-1-SNAPSHOT [29/52]
[INFO] from hbase-examples/pom.xml
[INFO] --------------------------------[ jar ]---------------------------------
[INFO]
[INFO] --- build-helper:3.0.0:bsh-property (negate-license-bundles-property) @ hbase-examples ---
[INFO]
[INFO] --- build-helper:3.0.0:regex-property (create-license-file-path-property) @ hbase-examples ---
[INFO] No match to regex '\\' found in '/home/jenkins/jenkins-home/70ad3735/workspace/HBase-Nightly-s390x/hbase-examples/target/maven-shared-archive-resources/META-INF/LICENSE'. The initial value '/home/jenkins/jenkins-home/70ad3735/workspace/HBase-Nightly-s390x/hbase-examples/target/maven-shared-archive-resources/META-INF/LICENSE' is left as-is...
[INFO]
[INFO] --- enforcer:3.0.0:enforce (enforce-maven-version) @ hbase-examples ---
[INFO]
[INFO] --- enforcer:3.0.0:enforce (hadoop-profile-min-maven-min-java-banned-xerces) @ hbase-examples ---
[INFO]
[INFO] --- enforcer:3.0.0:enforce (banned-jsr305) @ hbase-examples ---
[INFO]
[INFO] --- enforcer:3.0.0:enforce (banned-scala) @ hbase-examples ---
[INFO]
[INFO] --- enforcer:3.0.0:enforce (banned-commons-logging) @ hbase-examples ---
[INFO]
[INFO] --- enforcer:3.0.0:enforce (banned-other-logging-framework) @ hbase-examples ---
[INFO]
[INFO] --- enforcer:3.0.0:enforce (banned-jetty) @ hbase-examples ---
[INFO]
[INFO] --- enforcer:3.0.0:enforce (banned-jersey) @ hbase-examples ---
[INFO]
[INFO] --- enforcer:3.0.0:enforce (banned-htrace) @ hbase-examples ---
[INFO]
[INFO] --- enforcer:3.0.0:enforce (banned-bouncycastle-jdk15on) @ hbase-examples ---
[INFO]
[INFO] --- buildnumber:1.4:create-timestamp (default) @ hbase-examples ---
[INFO]
[INFO] --- protobuf:0.6.1:compile (compile-protoc) @ hbase-examples ---
[INFO] Skipping compilation because target directory newer than sources.
[INFO]
[INFO] --- enforcer:3.0.0:enforce (banned-illegal-imports) @ hbase-examples ---
[INFO]
[INFO] --- replacer:1.5.3:replace (default) @ hbase-examples ---
[INFO] Replacement run on 4 files.
[INFO]
[INFO] --- remote-resources:1.7.0:process (process-resource-bundles) @ hbase-examples ---
[INFO] Preparing remote bundle org.apache:apache-jar-resource-bundle:1.4
[INFO] Copying 3 resources from 1 bundle.
[INFO]
[INFO] --- resources:3.1.0:resources (default-resources) @ hbase-examples ---
[INFO] Using 'UTF-8' encoding to copy filtered resources.
[INFO] Copying 1 resource
[INFO] Copying 4 resources
[INFO] Copying 3 resources
[INFO]
[INFO] --- flatten:1.3.0:flatten (flatten) @ hbase-examples ---
[INFO] Generating flattened POM of project org.apache.hbase:hbase-examples:jar:4.0.0-alpha-1-SNAPSHOT...
[INFO]
[INFO] --- enforcer:3.0.0:enforce (check-aggregate-license) @ hbase-examples ---
[INFO] Skipping Rule Enforcement.
[INFO]
[INFO] --- compiler:3.8.1:compile (default-compile) @ hbase-examples ---
[INFO] Compiling 4 source files to /home/jenkins/jenkins-home/70ad3735/workspace/HBase-Nightly-s390x/hbase-examples/target/classes
[INFO]
[INFO] --- dependency:3.1.1:build-classpath (create-mrapp-generated-classpath) @ hbase-examples ---
[INFO] Wrote classpath file '/home/jenkins/jenkins-home/70ad3735/workspace/HBase-Nightly-s390x/hbase-examples/target/test-classes/mrapp-generated-classpath'.
[INFO]
[INFO] --- resources:3.1.0:testResources (default-testResources) @ hbase-examples ---
[INFO] Using 'UTF-8' encoding to copy filtered resources.
[INFO] Copying 2 resources
[INFO] Copying 3 resources
[INFO]
[INFO] --- compiler:3.8.1:testCompile (default-testCompile) @ hbase-examples ---
[INFO] Nothing to compile - all classes are up to date
[INFO]
[INFO] --- warbucks:1.1.0:check (run-warbucks) @ hbase-examples ---
[INFO] Rule 0: Class Matches: 31
[INFO] Rule 0: Class Failures: 0
[INFO] Total class failures: 0
[INFO]
[INFO] --- surefire:3.1.0:test (default-test) @ hbase-examples ---
[INFO] Using configured provider org.apache.maven.surefire.junitcore.JUnitCoreProvider
[INFO]
[INFO] -------------------------------------------------------
[INFO] T E S T S
[INFO] -------------------------------------------------------
WARNING: A terminally deprecated method in java.lang.System has been called
WARNING: System::setSecurityManager has been called by org.apache.hadoop.hbase.SystemExitRule (file:/home/jenkins/jenkins-home/70ad3735/workspace/HBase-Nightly-s390x/hbase-common/target/test-classes/)
WARNING: Please consider reporting this to the maintainers of org.apache.hadoop.hbase.SystemExitRule
WARNING: System::setSecurityManager will be removed in a future release
[INFO] Running org.apache.hadoop.hbase.types.TestPBCell
WARNING: A terminally deprecated method in java.lang.System has been called
WARNING: System::setSecurityManager has been called by org.apache.hadoop.hbase.SystemExitRule$1 (file:/home/jenkins/jenkins-home/70ad3735/workspace/HBase-Nightly-s390x/hbase-common/target/test-classes/)
WARNING: Please consider reporting this to the maintainers of org.apache.hadoop.hbase.SystemExitRule$1
WARNING: System::setSecurityManager will be removed in a future release
[INFO] Tests run: 1, Failures: 0, Errors: 0, Skipped: 0, Time elapsed: 0.373 s - in org.apache.hadoop.hbase.types.TestPBCell
[INFO]
[INFO] Results:
[INFO]
[INFO] Tests run: 1, Failures: 0, Errors: 0, Skipped: 0
[INFO]
[INFO]
[INFO] --- surefire:3.1.0:test (secondPartTestsExecution) @ hbase-examples ---
[INFO] Using configured provider org.apache.maven.surefire.junitcore.JUnitCoreProvider
[INFO]
[INFO] -------------------------------------------------------
[INFO] T E S T S
[INFO] -------------------------------------------------------
WARNING: A terminally deprecated method in java.lang.System has been called
WARNING: System::setSecurityManager has been called by org.apache.hadoop.hbase.SystemExitRule (file:/home/jenkins/jenkins-home/70ad3735/workspace/HBase-Nightly-s390x/hbase-common/target/test-classes/)
WARNING: Please consider reporting this to the maintainers of org.apache.hadoop.hbase.SystemExitRule
WARNING: System::setSecurityManager will be removed in a future release
[INFO] Running org.apache.hadoop.hbase.mapreduce.TestMapReduceExamples
WARNING: A terminally deprecated method in java.lang.System has been called
WARNING: System::setSecurityManager has been called by org.apache.hadoop.hbase.mapreduce.TestMapReduceExamples (file:/home/jenkins/jenkins-home/70ad3735/workspace/HBase-Nightly-s390x/hbase-examples/target/test-classes/)
WARNING: Please consider reporting this to the maintainers of org.apache.hadoop.hbase.mapreduce.TestMapReduceExamples
WARNING: System::setSecurityManager will be removed in a future release
WARNING: A terminally deprecated method in java.lang.System has been called
WARNING: System::setSecurityManager has been called by org.apache.hadoop.hbase.SystemExitRule$1 (file:/home/jenkins/jenkins-home/70ad3735/workspace/HBase-Nightly-s390x/hbase-common/target/test-classes/)
WARNING: Please consider reporting this to the maintainers of org.apache.hadoop.hbase.SystemExitRule$1
WARNING: System::setSecurityManager will be removed in a future release
[INFO] Tests run: 4, Failures: 0, Errors: 0, Skipped: 0, Time elapsed: 4.921 s - in org.apache.hadoop.hbase.mapreduce.TestMapReduceExamples
WARNING: A terminally deprecated method in java.lang.System has been called
WARNING: System::setSecurityManager has been called by org.apache.hadoop.hbase.SystemExitRule (file:/home/jenkins/jenkins-home/70ad3735/workspace/HBase-Nightly-s390x/hbase-common/target/test-classes/)
WARNING: Please consider reporting this to the maintainers of org.apache.hadoop.hbase.SystemExitRule
WARNING: System::setSecurityManager will be removed in a future release
[INFO] Running org.apache.hadoop.hbase.coprocessor.example.TestValueReplacingCompaction
WARNING: A terminally deprecated method in java.lang.System has been called
WARNING: System::setSecurityManager has been called by org.apache.hadoop.hbase.SystemExitRule$1 (file:/home/jenkins/jenkins-home/70ad3735/workspace/HBase-Nightly-s390x/hbase-common/target/test-classes/)
WARNING: Please consider reporting this to the maintainers of org.apache.hadoop.hbase.SystemExitRule$1
WARNING: System::setSecurityManager will be removed in a future release
[INFO] Tests run: 1, Failures: 0, Errors: 0, Skipped: 0, Time elapsed: 3.881 s - in org.apache.hadoop.hbase.coprocessor.example.TestValueReplacingCompaction
WARNING: A terminally deprecated method in java.lang.System has been called
WARNING: System::setSecurityManager has been called by org.apache.hadoop.hbase.SystemExitRule (file:/home/jenkins/jenkins-home/70ad3735/workspace/HBase-Nightly-s390x/hbase-common/target/test-classes/)
WARNING: Please consider reporting this to the maintainers of org.apache.hadoop.hbase.SystemExitRule
WARNING: System::setSecurityManager will be removed in a future release
[INFO] Running org.apache.hadoop.hbase.coprocessor.example.TestWriteHeavyIncrementObserverWithMemStoreCompaction
WARNING: A terminally deprecated method in java.lang.System has been called
WARNING: System::setSecurityManager has been called by org.apache.hadoop.hbase.SystemExitRule$1 (file:/home/jenkins/jenkins-home/70ad3735/workspace/HBase-Nightly-s390x/hbase-common/target/test-classes/)
WARNING: Please consider reporting this to the maintainers of org.apache.hadoop.hbase.SystemExitRule$1
WARNING: System::setSecurityManager will be removed in a future release
[INFO] Tests run: 1, Failures: 0, Errors: 0, Skipped: 0, Time elapsed: 38.534 s - in org.apache.hadoop.hbase.coprocessor.example.TestWriteHeavyIncrementObserverWithMemStoreCompaction
WARNING: A terminally deprecated method in java.lang.System has been called
WARNING: System::setSecurityManager has been called by org.apache.hadoop.hbase.SystemExitRule (file:/home/jenkins/jenkins-home/70ad3735/workspace/HBase-Nightly-s390x/hbase-common/target/test-classes/)
WARNING: Please consider reporting this to the maintainers of org.apache.hadoop.hbase.SystemExitRule
WARNING: System::setSecurityManager will be removed in a future release
[INFO] Running org.apache.hadoop.hbase.coprocessor.example.TestZooKeeperScanPolicyObserver
WARNING: A terminally deprecated method in java.lang.System has been called
WARNING: System::setSecurityManager has been called by org.apache.hadoop.hbase.SystemExitRule$1 (file:/home/jenkins/jenkins-home/70ad3735/workspace/HBase-Nightly-s390x/hbase-common/target/test-classes/)
WARNING: Please consider reporting this to the maintainers of org.apache.hadoop.hbase.SystemExitRule$1
WARNING: System::setSecurityManager will be removed in a future release
[INFO] Tests run: 1, Failures: 0, Errors: 0, Skipped: 0, Time elapsed: 22.13 s - in org.apache.hadoop.hbase.coprocessor.example.TestZooKeeperScanPolicyObserver
WARNING: A terminally deprecated method in java.lang.System has been called
WARNING: System::setSecurityManager has been called by org.apache.hadoop.hbase.SystemExitRule (file:/home/jenkins/jenkins-home/70ad3735/workspace/HBase-Nightly-s390x/hbase-common/target/test-classes/)
WARNING: Please consider reporting this to the maintainers of org.apache.hadoop.hbase.SystemExitRule
WARNING: System::setSecurityManager will be removed in a future release
[INFO] Running org.apache.hadoop.hbase.coprocessor.example.TestScanModifyingObserver
WARNING: A terminally deprecated method in java.lang.System has been called
WARNING: System::setSecurityManager has been called by org.apache.hadoop.hbase.SystemExitRule$1 (file:/home/jenkins/jenkins-home/70ad3735/workspace/HBase-Nightly-s390x/hbase-common/target/test-classes/)
WARNING: Please consider reporting this to the maintainers of org.apache.hadoop.hbase.SystemExitRule$1
WARNING: System::setSecurityManager will be removed in a future release
[INFO] Tests run: 1, Failures: 0, Errors: 0, Skipped: 0, Time elapsed: 4.107 s - in org.apache.hadoop.hbase.coprocessor.example.TestScanModifyingObserver
WARNING: A terminally deprecated method in java.lang.System has been called
WARNING: System::setSecurityManager has been called by org.apache.hadoop.hbase.SystemExitRule (file:/home/jenkins/jenkins-home/70ad3735/workspace/HBase-Nightly-s390x/hbase-common/target/test-classes/)
WARNING: Please consider reporting this to the maintainers of org.apache.hadoop.hbase.SystemExitRule
WARNING: System::setSecurityManager will be removed in a future release
[INFO] Running org.apache.hadoop.hbase.coprocessor.example.TestRefreshHFilesEndpoint
FATAL: command execution failed
java.io.EOFException
at java.base/java.io.ObjectInputStream$PeekInputStream.readFully(ObjectInputStream.java:2911)
at java.base/java.io.ObjectInputStream$BlockDataInputStream.readShort(ObjectInputStream.java:3406)
at java.base/java.io.ObjectInputStream.readStreamHeader(ObjectInputStream.java:932)
at java.base/java.io.ObjectInputStream.<init>(ObjectInputStream.java:375)
at hudson.remoting.ObjectInputStreamEx.<init>(ObjectInputStreamEx.java:49)
at hudson.remoting.Command.readFrom(Command.java:142)
at hudson.remoting.Command.readFrom(Command.java:128)
at hudson.remoting.AbstractSynchronousByteArrayCommandTransport.read(AbstractSynchronousByteArrayCommandTransport.java:35)
at hudson.remoting.SynchronousCommandTransport$ReaderThread.run(SynchronousCommandTransport.java:61)
Caused: java.io.IOException: Unexpected termination of the channel
at hudson.remoting.SynchronousCommandTransport$ReaderThread.run(SynchronousCommandTransport.java:75)
Caused: java.io.IOException: Backing channel 'jenkins-s390x-6' is disconnected.
at hudson.remoting.RemoteInvocationHandler.channelOrFail(RemoteInvocationHandler.java:215)
at hudson.remoting.RemoteInvocationHandler.invoke(RemoteInvocationHandler.java:285)
at com.sun.proxy.$Proxy112.isAlive(Unknown Source)
at hudson.Launcher$RemoteLauncher$ProcImpl.isAlive(Launcher.java:1212)
at hudson.Launcher$RemoteLauncher$ProcImpl.join(Launcher.java:1204)
at hudson.tasks.CommandInterpreter.join(CommandInterpreter.java:195)
at hudson.tasks.CommandInterpreter.perform(CommandInterpreter.java:145)
at hudson.tasks.CommandInterpreter.perform(CommandInterpreter.java:92)
at hudson.tasks.BuildStepMonitor$1.perform(BuildStepMonitor.java:20)
at hudson.model.AbstractBuild$AbstractBuildExecution.perform(AbstractBuild.java:818)
at hudson.model.Build$BuildExecution.build(Build.java:199)
at hudson.model.Build$BuildExecution.doRun(Build.java:164)
at hudson.model.AbstractBuild$AbstractBuildExecution.run(AbstractBuild.java:526)
at hudson.model.Run.execute(Run.java:1841)
at hudson.model.FreeStyleBuild.run(FreeStyleBuild.java:44)
at hudson.model.ResourceController.execute(ResourceController.java:101)
at hudson.model.Executor.run(Executor.java:442)
FATAL: Unable to delete script file /tmp/jenkins1902379104350626019.sh
java.io.EOFException
at java.base/java.io.ObjectInputStream$PeekInputStream.readFully(ObjectInputStream.java:2911)
at java.base/java.io.ObjectInputStream$BlockDataInputStream.readShort(ObjectInputStream.java:3406)
at java.base/java.io.ObjectInputStream.readStreamHeader(ObjectInputStream.java:932)
at java.base/java.io.ObjectInputStream.<init>(ObjectInputStream.java:375)
at hudson.remoting.ObjectInputStreamEx.<init>(ObjectInputStreamEx.java:49)
at hudson.remoting.Command.readFrom(Command.java:142)
at hudson.remoting.Command.readFrom(Command.java:128)
at hudson.remoting.AbstractSynchronousByteArrayCommandTransport.read(AbstractSynchronousByteArrayCommandTransport.java:35)
at hudson.remoting.SynchronousCommandTransport$ReaderThread.run(SynchronousCommandTransport.java:61)
Caused: java.io.IOException: Unexpected termination of the channel
at hudson.remoting.SynchronousCommandTransport$ReaderThread.run(SynchronousCommandTransport.java:75)
Caused: hudson.remoting.ChannelClosedException: Channel "hudson.remoting.Channel@648151ba:jenkins-s390x-6": Remote call on jenkins-s390x-6 failed. The channel is closing down or has closed down
at hudson.remoting.Channel.call(Channel.java:996)
at hudson.FilePath.act(FilePath.java:1230)
at hudson.FilePath.act(FilePath.java:1219)
at hudson.FilePath.delete(FilePath.java:1766)
at hudson.tasks.CommandInterpreter.perform(CommandInterpreter.java:163)
at hudson.tasks.CommandInterpreter.perform(CommandInterpreter.java:92)
at hudson.tasks.BuildStepMonitor$1.perform(BuildStepMonitor.java:20)
at hudson.model.AbstractBuild$AbstractBuildExecution.perform(AbstractBuild.java:818)
at hudson.model.Build$BuildExecution.build(Build.java:199)
at hudson.model.Build$BuildExecution.doRun(Build.java:164)
at hudson.model.AbstractBuild$AbstractBuildExecution.run(AbstractBuild.java:526)
at hudson.model.Run.execute(Run.java:1841)
at hudson.model.FreeStyleBuild.run(FreeStyleBuild.java:44)
at hudson.model.ResourceController.execute(ResourceController.java:101)
at hudson.model.Executor.run(Executor.java:442)
Build step 'Execute shell' marked build as failure
ERROR: Step ‘Archive the artifacts’ failed: no workspace for HBase-Nightly-s390x #593
ERROR: Step ‘Publish JUnit test result report’ failed: no workspace for HBase-Nightly-s390x #593
Jenkins build is still unstable: HBase-Nightly-s390x #592
Posted by Apache Jenkins Server <je...@builds.apache.org>.
See <https://ci-hbase.apache.org/job/HBase-Nightly-s390x/592/display/redirect?page=changes>
Jenkins build is still unstable: HBase-Nightly-s390x #591
Posted by Apache Jenkins Server <je...@builds.apache.org>.
See <https://ci-hbase.apache.org/job/HBase-Nightly-s390x/591/display/redirect?page=changes>
Jenkins build is still unstable: HBase-Nightly-s390x #590
Posted by Apache Jenkins Server <je...@builds.apache.org>.
See <https://ci-hbase.apache.org/job/HBase-Nightly-s390x/590/display/redirect?page=changes>
Jenkins build is still unstable: HBase-Nightly-s390x #589
Posted by Apache Jenkins Server <je...@builds.apache.org>.
See <https://ci-hbase.apache.org/job/HBase-Nightly-s390x/589/display/redirect?page=changes>
Jenkins build is still unstable: HBase-Nightly-s390x #588
Posted by Apache Jenkins Server <je...@builds.apache.org>.
See <https://ci-hbase.apache.org/job/HBase-Nightly-s390x/588/display/redirect>
Jenkins build is still unstable: HBase-Nightly-s390x #587
Posted by Apache Jenkins Server <je...@builds.apache.org>.
See <https://ci-hbase.apache.org/job/HBase-Nightly-s390x/587/display/redirect?page=changes>
Jenkins build is still unstable: HBase-Nightly-s390x #586
Posted by Apache Jenkins Server <je...@builds.apache.org>.
See <https://ci-hbase.apache.org/job/HBase-Nightly-s390x/586/display/redirect?page=changes>
Jenkins build is still unstable: HBase-Nightly-s390x #585
Posted by Apache Jenkins Server <je...@builds.apache.org>.
See <https://ci-hbase.apache.org/job/HBase-Nightly-s390x/585/display/redirect?page=changes>
Jenkins build is still unstable: HBase-Nightly-s390x #584
Posted by Apache Jenkins Server <je...@builds.apache.org>.
See <https://ci-hbase.apache.org/job/HBase-Nightly-s390x/584/display/redirect?page=changes>
Jenkins build is still unstable: HBase-Nightly-s390x #583
Posted by Apache Jenkins Server <je...@builds.apache.org>.
See <https://ci-hbase.apache.org/job/HBase-Nightly-s390x/583/display/redirect?page=changes>
Jenkins build is still unstable: HBase-Nightly-s390x #582
Posted by Apache Jenkins Server <je...@builds.apache.org>.
See <https://ci-hbase.apache.org/job/HBase-Nightly-s390x/582/display/redirect?page=changes>
Jenkins build is still unstable: HBase-Nightly-s390x #581
Posted by Apache Jenkins Server <je...@builds.apache.org>.
See <https://ci-hbase.apache.org/job/HBase-Nightly-s390x/581/display/redirect?page=changes>
Jenkins build is still unstable: HBase-Nightly-s390x #580
Posted by Apache Jenkins Server <je...@builds.apache.org>.
See <https://ci-hbase.apache.org/job/HBase-Nightly-s390x/580/display/redirect?page=changes>
Jenkins build is still unstable: HBase-Nightly-s390x #579
Posted by Apache Jenkins Server <je...@builds.apache.org>.
See <https://ci-hbase.apache.org/job/HBase-Nightly-s390x/579/display/redirect?page=changes>
Jenkins build is still unstable: HBase-Nightly-s390x #578
Posted by Apache Jenkins Server <je...@builds.apache.org>.
See <https://ci-hbase.apache.org/job/HBase-Nightly-s390x/578/display/redirect?page=changes>
Jenkins build is still unstable: HBase-Nightly-s390x #577
Posted by Apache Jenkins Server <je...@builds.apache.org>.
See <https://ci-hbase.apache.org/job/HBase-Nightly-s390x/577/display/redirect?page=changes>
Jenkins build is still unstable: HBase-Nightly-s390x #576
Posted by Apache Jenkins Server <je...@builds.apache.org>.
See <https://ci-hbase.apache.org/job/HBase-Nightly-s390x/576/display/redirect?page=changes>
Jenkins build is still unstable: HBase-Nightly-s390x #575
Posted by Apache Jenkins Server <je...@builds.apache.org>.
See <https://ci-hbase.apache.org/job/HBase-Nightly-s390x/575/display/redirect?page=changes>
Jenkins build is still unstable: HBase-Nightly-s390x #574
Posted by Apache Jenkins Server <je...@builds.apache.org>.
See <https://ci-hbase.apache.org/job/HBase-Nightly-s390x/574/display/redirect?page=changes>
Jenkins build is still unstable: HBase-Nightly-s390x #573
Posted by Apache Jenkins Server <je...@builds.apache.org>.
See <https://ci-hbase.apache.org/job/HBase-Nightly-s390x/573/display/redirect?page=changes>
Jenkins build is still unstable: HBase-Nightly-s390x #572
Posted by Apache Jenkins Server <je...@builds.apache.org>.
See <https://ci-hbase.apache.org/job/HBase-Nightly-s390x/572/display/redirect?page=changes>
Jenkins build is still unstable: HBase-Nightly-s390x #571
Posted by Apache Jenkins Server <je...@builds.apache.org>.
See <https://ci-hbase.apache.org/job/HBase-Nightly-s390x/571/display/redirect?page=changes>
Jenkins build is still unstable: HBase-Nightly-s390x #570
Posted by Apache Jenkins Server <je...@builds.apache.org>.
See <https://ci-hbase.apache.org/job/HBase-Nightly-s390x/570/display/redirect?page=changes>
Jenkins build is still unstable: HBase-Nightly-s390x #569
Posted by Apache Jenkins Server <je...@builds.apache.org>.
See <https://ci-hbase.apache.org/job/HBase-Nightly-s390x/569/display/redirect?page=changes>
Jenkins build is still unstable: HBase-Nightly-s390x #568
Posted by Apache Jenkins Server <je...@builds.apache.org>.
See <https://ci-hbase.apache.org/job/HBase-Nightly-s390x/568/display/redirect?page=changes>
Jenkins build is still unstable: HBase-Nightly-s390x #567
Posted by Apache Jenkins Server <je...@builds.apache.org>.
See <https://ci-hbase.apache.org/job/HBase-Nightly-s390x/567/display/redirect?page=changes>
Jenkins build is still unstable: HBase-Nightly-s390x #566
Posted by Apache Jenkins Server <je...@builds.apache.org>.
See <https://ci-hbase.apache.org/job/HBase-Nightly-s390x/566/display/redirect?page=changes>
Jenkins build is still unstable: HBase-Nightly-s390x #565
Posted by Apache Jenkins Server <je...@builds.apache.org>.
See <https://ci-hbase.apache.org/job/HBase-Nightly-s390x/565/display/redirect?page=changes>
Jenkins build is unstable: HBase-Nightly-s390x #564
Posted by Apache Jenkins Server <je...@builds.apache.org>.
See <https://ci-hbase.apache.org/job/HBase-Nightly-s390x/564/display/redirect?page=changes>
Build failed in Jenkins: HBase-Nightly-s390x #563
Posted by Apache Jenkins Server <je...@builds.apache.org>.
See <https://ci-hbase.apache.org/job/HBase-Nightly-s390x/563/display/redirect?page=changes>
Changes:
[noreply] HBASE-28432 Refactor tools which are under test packaging to a new module hbase-diagnostics (#6258)
------------------------------------------
[...truncated 2.58 MB...]
[INFO] Tests run: 8, Failures: 0, Errors: 0, Skipped: 0, Time elapsed: 15.971 s - in org.apache.hadoop.hbase.client.TestMultipleTimestamps
WARNING: A terminally deprecated method in java.lang.System has been called
WARNING: System::setSecurityManager has been called by org.apache.hadoop.hbase.SystemExitRule (file:/home/jenkins/jenkins-home/70ad3735/workspace/HBase-Nightly-s390x/hbase-common/target/test-classes/)
WARNING: Please consider reporting this to the maintainers of org.apache.hadoop.hbase.SystemExitRule
WARNING: System::setSecurityManager will be removed in a future release
[INFO] Running org.apache.hadoop.hbase.client.TestCIDeleteRpcTimeout
WARNING: A terminally deprecated method in java.lang.System has been called
WARNING: System::setSecurityManager has been called by org.apache.hadoop.hbase.SystemExitRule$1 (file:/home/jenkins/jenkins-home/70ad3735/workspace/HBase-Nightly-s390x/hbase-common/target/test-classes/)
WARNING: Please consider reporting this to the maintainers of org.apache.hadoop.hbase.SystemExitRule$1
WARNING: System::setSecurityManager will be removed in a future release
[INFO] Tests run: 1, Failures: 0, Errors: 0, Skipped: 0, Time elapsed: 38.423 s - in org.apache.hadoop.hbase.client.TestCIDeleteRpcTimeout
WARNING: A terminally deprecated method in java.lang.System has been called
WARNING: System::setSecurityManager has been called by org.apache.hadoop.hbase.SystemExitRule (file:/home/jenkins/jenkins-home/70ad3735/workspace/HBase-Nightly-s390x/hbase-common/target/test-classes/)
WARNING: Please consider reporting this to the maintainers of org.apache.hadoop.hbase.SystemExitRule
WARNING: System::setSecurityManager will be removed in a future release
[INFO] Running org.apache.hadoop.hbase.client.TestSnapshotFromClient
WARNING: A terminally deprecated method in java.lang.System has been called
WARNING: System::setSecurityManager has been called by org.apache.hadoop.hbase.SystemExitRule$1 (file:/home/jenkins/jenkins-home/70ad3735/workspace/HBase-Nightly-s390x/hbase-common/target/test-classes/)
WARNING: Please consider reporting this to the maintainers of org.apache.hadoop.hbase.SystemExitRule$1
WARNING: System::setSecurityManager will be removed in a future release
[INFO] Tests run: 18, Failures: 0, Errors: 0, Skipped: 0, Time elapsed: 60.214 s - in org.apache.hadoop.hbase.client.TestSnapshotFromClient
WARNING: A terminally deprecated method in java.lang.System has been called
WARNING: System::setSecurityManager has been called by org.apache.hadoop.hbase.SystemExitRule (file:/home/jenkins/jenkins-home/70ad3735/workspace/HBase-Nightly-s390x/hbase-common/target/test-classes/)
WARNING: Please consider reporting this to the maintainers of org.apache.hadoop.hbase.SystemExitRule
WARNING: System::setSecurityManager will be removed in a future release
[INFO] Running org.apache.hadoop.hbase.client.TestResultFromCoprocessor
WARNING: A terminally deprecated method in java.lang.System has been called
WARNING: System::setSecurityManager has been called by org.apache.hadoop.hbase.SystemExitRule$1 (file:/home/jenkins/jenkins-home/70ad3735/workspace/HBase-Nightly-s390x/hbase-common/target/test-classes/)
WARNING: Please consider reporting this to the maintainers of org.apache.hadoop.hbase.SystemExitRule$1
WARNING: System::setSecurityManager will be removed in a future release
[INFO] Tests run: 2, Failures: 0, Errors: 0, Skipped: 0, Time elapsed: 1.847 s - in org.apache.hadoop.hbase.client.TestResultFromCoprocessor
WARNING: A terminally deprecated method in java.lang.System has been called
WARNING: System::setSecurityManager has been called by org.apache.hadoop.hbase.SystemExitRule (file:/home/jenkins/jenkins-home/70ad3735/workspace/HBase-Nightly-s390x/hbase-common/target/test-classes/)
WARNING: Please consider reporting this to the maintainers of org.apache.hadoop.hbase.SystemExitRule
WARNING: System::setSecurityManager will be removed in a future release
[INFO] Running org.apache.hadoop.hbase.client.TestSplitOrMergeAtTableLevel
WARNING: A terminally deprecated method in java.lang.System has been called
WARNING: System::setSecurityManager has been called by org.apache.hadoop.hbase.SystemExitRule$1 (file:/home/jenkins/jenkins-home/70ad3735/workspace/HBase-Nightly-s390x/hbase-common/target/test-classes/)
WARNING: Please consider reporting this to the maintainers of org.apache.hadoop.hbase.SystemExitRule$1
WARNING: System::setSecurityManager will be removed in a future release
[INFO] Tests run: 4, Failures: 0, Errors: 0, Skipped: 0, Time elapsed: 24.687 s - in org.apache.hadoop.hbase.client.TestSplitOrMergeAtTableLevel
WARNING: A terminally deprecated method in java.lang.System has been called
WARNING: System::setSecurityManager has been called by org.apache.hadoop.hbase.SystemExitRule (file:/home/jenkins/jenkins-home/70ad3735/workspace/HBase-Nightly-s390x/hbase-common/target/test-classes/)
WARNING: Please consider reporting this to the maintainers of org.apache.hadoop.hbase.SystemExitRule
WARNING: System::setSecurityManager will be removed in a future release
[INFO] Running org.apache.hadoop.hbase.client.TestConnectionAttributes
WARNING: A terminally deprecated method in java.lang.System has been called
WARNING: System::setSecurityManager has been called by org.apache.hadoop.hbase.SystemExitRule$1 (file:/home/jenkins/jenkins-home/70ad3735/workspace/HBase-Nightly-s390x/hbase-common/target/test-classes/)
WARNING: Please consider reporting this to the maintainers of org.apache.hadoop.hbase.SystemExitRule$1
WARNING: System::setSecurityManager will be removed in a future release
[INFO] Tests run: 1, Failures: 0, Errors: 0, Skipped: 0, Time elapsed: 2.625 s - in org.apache.hadoop.hbase.client.TestConnectionAttributes
WARNING: A terminally deprecated method in java.lang.System has been called
WARNING: System::setSecurityManager has been called by org.apache.hadoop.hbase.SystemExitRule (file:/home/jenkins/jenkins-home/70ad3735/workspace/HBase-Nightly-s390x/hbase-common/target/test-classes/)
WARNING: Please consider reporting this to the maintainers of org.apache.hadoop.hbase.SystemExitRule
WARNING: System::setSecurityManager will be removed in a future release
[INFO] Running org.apache.hadoop.hbase.client.TestSnapshotMetadata
WARNING: A terminally deprecated method in java.lang.System has been called
WARNING: System::setSecurityManager has been called by org.apache.hadoop.hbase.SystemExitRule$1 (file:/home/jenkins/jenkins-home/70ad3735/workspace/HBase-Nightly-s390x/hbase-common/target/test-classes/)
WARNING: Please consider reporting this to the maintainers of org.apache.hadoop.hbase.SystemExitRule$1
WARNING: System::setSecurityManager will be removed in a future release
[INFO] Tests run: 4, Failures: 0, Errors: 0, Skipped: 0, Time elapsed: 20.177 s - in org.apache.hadoop.hbase.client.TestSnapshotMetadata
WARNING: A terminally deprecated method in java.lang.System has been called
WARNING: System::setSecurityManager has been called by org.apache.hadoop.hbase.SystemExitRule (file:/home/jenkins/jenkins-home/70ad3735/workspace/HBase-Nightly-s390x/hbase-common/target/test-classes/)
WARNING: Please consider reporting this to the maintainers of org.apache.hadoop.hbase.SystemExitRule
WARNING: System::setSecurityManager will be removed in a future release
[INFO] Running org.apache.hadoop.hbase.client.TestAsyncTableRSCrashPublish
WARNING: A terminally deprecated method in java.lang.System has been called
WARNING: System::setSecurityManager has been called by org.apache.hadoop.hbase.SystemExitRule$1 (file:/home/jenkins/jenkins-home/70ad3735/workspace/HBase-Nightly-s390x/hbase-common/target/test-classes/)
WARNING: Please consider reporting this to the maintainers of org.apache.hadoop.hbase.SystemExitRule$1
WARNING: System::setSecurityManager will be removed in a future release
[INFO] Tests run: 1, Failures: 0, Errors: 0, Skipped: 0, Time elapsed: 7.69 s - in org.apache.hadoop.hbase.client.TestAsyncTableRSCrashPublish
WARNING: A terminally deprecated method in java.lang.System has been called
WARNING: System::setSecurityManager has been called by org.apache.hadoop.hbase.SystemExitRule (file:/home/jenkins/jenkins-home/70ad3735/workspace/HBase-Nightly-s390x/hbase-common/target/test-classes/)
WARNING: Please consider reporting this to the maintainers of org.apache.hadoop.hbase.SystemExitRule
WARNING: System::setSecurityManager will be removed in a future release
[INFO] Running org.apache.hadoop.hbase.client.TestScannerTimeout
WARNING: A terminally deprecated method in java.lang.System has been called
WARNING: System::setSecurityManager has been called by org.apache.hadoop.hbase.SystemExitRule$1 (file:/home/jenkins/jenkins-home/70ad3735/workspace/HBase-Nightly-s390x/hbase-common/target/test-classes/)
WARNING: Please consider reporting this to the maintainers of org.apache.hadoop.hbase.SystemExitRule$1
WARNING: System::setSecurityManager will be removed in a future release
[INFO] Tests run: 3, Failures: 0, Errors: 0, Skipped: 0, Time elapsed: 23.225 s - in org.apache.hadoop.hbase.client.TestScannerTimeout
WARNING: A terminally deprecated method in java.lang.System has been called
WARNING: System::setSecurityManager has been called by org.apache.hadoop.hbase.SystemExitRule (file:/home/jenkins/jenkins-home/70ad3735/workspace/HBase-Nightly-s390x/hbase-common/target/test-classes/)
WARNING: Please consider reporting this to the maintainers of org.apache.hadoop.hbase.SystemExitRule
WARNING: System::setSecurityManager will be removed in a future release
[INFO] Running org.apache.hadoop.hbase.client.TestCatalogReplicaLoadBalanceSimpleSelector
WARNING: A terminally deprecated method in java.lang.System has been called
WARNING: System::setSecurityManager has been called by org.apache.hadoop.hbase.SystemExitRule$1 (file:/home/jenkins/jenkins-home/70ad3735/workspace/HBase-Nightly-s390x/hbase-common/target/test-classes/)
WARNING: Please consider reporting this to the maintainers of org.apache.hadoop.hbase.SystemExitRule$1
WARNING: System::setSecurityManager will be removed in a future release
[INFO] Tests run: 1, Failures: 0, Errors: 0, Skipped: 0, Time elapsed: 1.741 s - in org.apache.hadoop.hbase.client.TestCatalogReplicaLoadBalanceSimpleSelector
WARNING: A terminally deprecated method in java.lang.System has been called
WARNING: System::setSecurityManager has been called by org.apache.hadoop.hbase.SystemExitRule (file:/home/jenkins/jenkins-home/70ad3735/workspace/HBase-Nightly-s390x/hbase-common/target/test-classes/)
WARNING: Please consider reporting this to the maintainers of org.apache.hadoop.hbase.SystemExitRule
WARNING: System::setSecurityManager will be removed in a future release
[INFO] Running org.apache.hadoop.hbase.client.TestMobCloneSnapshotFromClientCloneLinksAfterDelete
WARNING: A terminally deprecated method in java.lang.System has been called
WARNING: System::setSecurityManager has been called by org.apache.hadoop.hbase.SystemExitRule$1 (file:/home/jenkins/jenkins-home/70ad3735/workspace/HBase-Nightly-s390x/hbase-common/target/test-classes/)
WARNING: Please consider reporting this to the maintainers of org.apache.hadoop.hbase.SystemExitRule$1
WARNING: System::setSecurityManager will be removed in a future release
[INFO] Tests run: 1, Failures: 0, Errors: 0, Skipped: 0, Time elapsed: 25.029 s - in org.apache.hadoop.hbase.client.TestMobCloneSnapshotFromClientCloneLinksAfterDelete
WARNING: A terminally deprecated method in java.lang.System has been called
WARNING: System::setSecurityManager has been called by org.apache.hadoop.hbase.SystemExitRule (file:/home/jenkins/jenkins-home/70ad3735/workspace/HBase-Nightly-s390x/hbase-common/target/test-classes/)
WARNING: Please consider reporting this to the maintainers of org.apache.hadoop.hbase.SystemExitRule
WARNING: System::setSecurityManager will be removed in a future release
[INFO] Running org.apache.hadoop.hbase.client.TestHbck
WARNING: A terminally deprecated method in java.lang.System has been called
WARNING: System::setSecurityManager has been called by org.apache.hadoop.hbase.SystemExitRule$1 (file:/home/jenkins/jenkins-home/70ad3735/workspace/HBase-Nightly-s390x/hbase-common/target/test-classes/)
WARNING: Please consider reporting this to the maintainers of org.apache.hadoop.hbase.SystemExitRule$1
WARNING: System::setSecurityManager will be removed in a future release
[INFO] Tests run: 12, Failures: 0, Errors: 0, Skipped: 0, Time elapsed: 23.964 s - in org.apache.hadoop.hbase.client.TestHbck
WARNING: A terminally deprecated method in java.lang.System has been called
WARNING: System::setSecurityManager has been called by org.apache.hadoop.hbase.SystemExitRule (file:/home/jenkins/jenkins-home/70ad3735/workspace/HBase-Nightly-s390x/hbase-common/target/test-classes/)
WARNING: Please consider reporting this to the maintainers of org.apache.hadoop.hbase.SystemExitRule
WARNING: System::setSecurityManager will be removed in a future release
[INFO] Running org.apache.hadoop.hbase.client.TestMetaCache
WARNING: A terminally deprecated method in java.lang.System has been called
WARNING: System::setSecurityManager has been called by org.apache.hadoop.hbase.SystemExitRule$1 (file:/home/jenkins/jenkins-home/70ad3735/workspace/HBase-Nightly-s390x/hbase-common/target/test-classes/)
WARNING: Please consider reporting this to the maintainers of org.apache.hadoop.hbase.SystemExitRule$1
WARNING: System::setSecurityManager will be removed in a future release
[INFO] Tests run: 4, Failures: 0, Errors: 0, Skipped: 0, Time elapsed: 20.794 s - in org.apache.hadoop.hbase.client.TestMetaCache
WARNING: A terminally deprecated method in java.lang.System has been called
WARNING: System::setSecurityManager has been called by org.apache.hadoop.hbase.SystemExitRule (file:/home/jenkins/jenkins-home/70ad3735/workspace/HBase-Nightly-s390x/hbase-common/target/test-classes/)
WARNING: Please consider reporting this to the maintainers of org.apache.hadoop.hbase.SystemExitRule
WARNING: System::setSecurityManager will be removed in a future release
[INFO] Running org.apache.hadoop.hbase.client.TestAsyncTableRegionReplicasGet
WARNING: A terminally deprecated method in java.lang.System has been called
WARNING: System::setSecurityManager has been called by org.apache.hadoop.hbase.SystemExitRule$1 (file:/home/jenkins/jenkins-home/70ad3735/workspace/HBase-Nightly-s390x/hbase-common/target/test-classes/)
WARNING: Please consider reporting this to the maintainers of org.apache.hadoop.hbase.SystemExitRule$1
WARNING: System::setSecurityManager will be removed in a future release
[INFO] Tests run: 6, Failures: 0, Errors: 0, Skipped: 0, Time elapsed: 40.828 s - in org.apache.hadoop.hbase.client.TestAsyncTableRegionReplicasGet
WARNING: A terminally deprecated method in java.lang.System has been called
WARNING: System::setSecurityManager has been called by org.apache.hadoop.hbase.SystemExitRule (file:/home/jenkins/jenkins-home/70ad3735/workspace/HBase-Nightly-s390x/hbase-common/target/test-classes/)
WARNING: Please consider reporting this to the maintainers of org.apache.hadoop.hbase.SystemExitRule
WARNING: System::setSecurityManager will be removed in a future release
[INFO] Running org.apache.hadoop.hbase.client.TestMetaWithReplicasShutdownHandling
WARNING: A terminally deprecated method in java.lang.System has been called
WARNING: System::setSecurityManager has been called by org.apache.hadoop.hbase.SystemExitRule$1 (file:/home/jenkins/jenkins-home/70ad3735/workspace/HBase-Nightly-s390x/hbase-common/target/test-classes/)
WARNING: Please consider reporting this to the maintainers of org.apache.hadoop.hbase.SystemExitRule$1
WARNING: System::setSecurityManager will be removed in a future release
[INFO] Tests run: 1, Failures: 0, Errors: 0, Skipped: 0, Time elapsed: 15.232 s - in org.apache.hadoop.hbase.client.TestMetaWithReplicasShutdownHandling
WARNING: A terminally deprecated method in java.lang.System has been called
WARNING: System::setSecurityManager has been called by org.apache.hadoop.hbase.SystemExitRule (file:/home/jenkins/jenkins-home/70ad3735/workspace/HBase-Nightly-s390x/hbase-common/target/test-classes/)
WARNING: Please consider reporting this to the maintainers of org.apache.hadoop.hbase.SystemExitRule
WARNING: System::setSecurityManager will be removed in a future release
[INFO] Running org.apache.hadoop.hbase.client.TestAdmin1
WARNING: A terminally deprecated method in java.lang.System has been called
WARNING: System::setSecurityManager has been called by org.apache.hadoop.hbase.SystemExitRule$1 (file:/home/jenkins/jenkins-home/70ad3735/workspace/HBase-Nightly-s390x/hbase-common/target/test-classes/)
WARNING: Please consider reporting this to the maintainers of org.apache.hadoop.hbase.SystemExitRule$1
WARNING: System::setSecurityManager will be removed in a future release
[INFO] Tests run: 13, Failures: 0, Errors: 0, Skipped: 0, Time elapsed: 42.171 s - in org.apache.hadoop.hbase.client.TestAdmin1
WARNING: A terminally deprecated method in java.lang.System has been called
WARNING: System::setSecurityManager has been called by org.apache.hadoop.hbase.SystemExitRule (file:/home/jenkins/jenkins-home/70ad3735/workspace/HBase-Nightly-s390x/hbase-common/target/test-classes/)
WARNING: Please consider reporting this to the maintainers of org.apache.hadoop.hbase.SystemExitRule
WARNING: System::setSecurityManager will be removed in a future release
[INFO] Running org.apache.hadoop.hbase.client.TestSnapshotDFSTemporaryDirectory
WARNING: A terminally deprecated method in java.lang.System has been called
WARNING: System::setSecurityManager has been called by org.apache.hadoop.hbase.SystemExitRule$1 (file:/home/jenkins/jenkins-home/70ad3735/workspace/HBase-Nightly-s390x/hbase-common/target/test-classes/)
WARNING: Please consider reporting this to the maintainers of org.apache.hadoop.hbase.SystemExitRule$1
WARNING: System::setSecurityManager will be removed in a future release
[INFO] Tests run: 12, Failures: 0, Errors: 0, Skipped: 0, Time elapsed: 90.865 s - in org.apache.hadoop.hbase.client.TestSnapshotDFSTemporaryDirectory
WARNING: A terminally deprecated method in java.lang.System has been called
WARNING: System::setSecurityManager has been called by org.apache.hadoop.hbase.SystemExitRule (file:/home/jenkins/jenkins-home/70ad3735/workspace/HBase-Nightly-s390x/hbase-common/target/test-classes/)
WARNING: Please consider reporting this to the maintainers of org.apache.hadoop.hbase.SystemExitRule
WARNING: System::setSecurityManager will be removed in a future release
[INFO] Running org.apache.hadoop.hbase.client.TestCloneSnapshotFromClientCloneLinksAfterDelete
WARNING: A terminally deprecated method in java.lang.System has been called
WARNING: System::setSecurityManager has been called by org.apache.hadoop.hbase.SystemExitRule$1 (file:/home/jenkins/jenkins-home/70ad3735/workspace/HBase-Nightly-s390x/hbase-common/target/test-classes/)
WARNING: Please consider reporting this to the maintainers of org.apache.hadoop.hbase.SystemExitRule$1
WARNING: System::setSecurityManager will be removed in a future release
[INFO] Tests run: 2, Failures: 0, Errors: 0, Skipped: 0, Time elapsed: 37.575 s - in org.apache.hadoop.hbase.client.TestCloneSnapshotFromClientCloneLinksAfterDelete
WARNING: A terminally deprecated method in java.lang.System has been called
WARNING: System::setSecurityManager has been called by org.apache.hadoop.hbase.SystemExitRule (file:/home/jenkins/jenkins-home/70ad3735/workspace/HBase-Nightly-s390x/hbase-common/target/test-classes/)
WARNING: Please consider reporting this to the maintainers of org.apache.hadoop.hbase.SystemExitRule
WARNING: System::setSecurityManager will be removed in a future release
[INFO] Running org.apache.hadoop.hbase.client.TestResultSizeEstimation
WARNING: A terminally deprecated method in java.lang.System has been called
WARNING: System::setSecurityManager has been called by org.apache.hadoop.hbase.SystemExitRule$1 (file:/home/jenkins/jenkins-home/70ad3735/workspace/HBase-Nightly-s390x/hbase-common/target/test-classes/)
WARNING: Please consider reporting this to the maintainers of org.apache.hadoop.hbase.SystemExitRule$1
WARNING: System::setSecurityManager will be removed in a future release
[INFO] Tests run: 2, Failures: 0, Errors: 0, Skipped: 0, Time elapsed: 6.35 s - in org.apache.hadoop.hbase.client.TestResultSizeEstimation
WARNING: A terminally deprecated method in java.lang.System has been called
WARNING: System::setSecurityManager has been called by org.apache.hadoop.hbase.SystemExitRule (file:/home/jenkins/jenkins-home/70ad3735/workspace/HBase-Nightly-s390x/hbase-common/target/test-classes/)
WARNING: Please consider reporting this to the maintainers of org.apache.hadoop.hbase.SystemExitRule
WARNING: System::setSecurityManager will be removed in a future release
[INFO] Running org.apache.hadoop.hbase.client.TestAsyncAdminModifyStoreFileTracker
FATAL: command execution failed
java.io.EOFException
at java.base/java.io.ObjectInputStream$PeekInputStream.readFully(ObjectInputStream.java:2911)
at java.base/java.io.ObjectInputStream$BlockDataInputStream.readShort(ObjectInputStream.java:3406)
at java.base/java.io.ObjectInputStream.readStreamHeader(ObjectInputStream.java:932)
at java.base/java.io.ObjectInputStream.<init>(ObjectInputStream.java:375)
at hudson.remoting.ObjectInputStreamEx.<init>(ObjectInputStreamEx.java:49)
at hudson.remoting.Command.readFrom(Command.java:142)
at hudson.remoting.Command.readFrom(Command.java:128)
at hudson.remoting.AbstractSynchronousByteArrayCommandTransport.read(AbstractSynchronousByteArrayCommandTransport.java:35)
at hudson.remoting.SynchronousCommandTransport$ReaderThread.run(SynchronousCommandTransport.java:61)
Caused: java.io.IOException: Unexpected termination of the channel
at hudson.remoting.SynchronousCommandTransport$ReaderThread.run(SynchronousCommandTransport.java:75)
Caused: java.io.IOException: Backing channel 'jenkins-s390x-5' is disconnected.
at hudson.remoting.RemoteInvocationHandler.channelOrFail(RemoteInvocationHandler.java:215)
at hudson.remoting.RemoteInvocationHandler.invoke(RemoteInvocationHandler.java:285)
at com.sun.proxy.$Proxy112.isAlive(Unknown Source)
at hudson.Launcher$RemoteLauncher$ProcImpl.isAlive(Launcher.java:1212)
at hudson.Launcher$RemoteLauncher$ProcImpl.join(Launcher.java:1204)
at hudson.tasks.CommandInterpreter.join(CommandInterpreter.java:195)
at hudson.tasks.CommandInterpreter.perform(CommandInterpreter.java:145)
at hudson.tasks.CommandInterpreter.perform(CommandInterpreter.java:92)
at hudson.tasks.BuildStepMonitor$1.perform(BuildStepMonitor.java:20)
at hudson.model.AbstractBuild$AbstractBuildExecution.perform(AbstractBuild.java:818)
at hudson.model.Build$BuildExecution.build(Build.java:199)
at hudson.model.Build$BuildExecution.doRun(Build.java:164)
at hudson.model.AbstractBuild$AbstractBuildExecution.run(AbstractBuild.java:526)
at hudson.model.Run.execute(Run.java:1841)
at hudson.model.FreeStyleBuild.run(FreeStyleBuild.java:44)
at hudson.model.ResourceController.execute(ResourceController.java:101)
at hudson.model.Executor.run(Executor.java:442)
FATAL: Unable to delete script file /tmp/jenkins2057155751838344528.sh
java.io.EOFException
at java.base/java.io.ObjectInputStream$PeekInputStream.readFully(ObjectInputStream.java:2911)
at java.base/java.io.ObjectInputStream$BlockDataInputStream.readShort(ObjectInputStream.java:3406)
at java.base/java.io.ObjectInputStream.readStreamHeader(ObjectInputStream.java:932)
at java.base/java.io.ObjectInputStream.<init>(ObjectInputStream.java:375)
at hudson.remoting.ObjectInputStreamEx.<init>(ObjectInputStreamEx.java:49)
at hudson.remoting.Command.readFrom(Command.java:142)
at hudson.remoting.Command.readFrom(Command.java:128)
at hudson.remoting.AbstractSynchronousByteArrayCommandTransport.read(AbstractSynchronousByteArrayCommandTransport.java:35)
at hudson.remoting.SynchronousCommandTransport$ReaderThread.run(SynchronousCommandTransport.java:61)
Caused: java.io.IOException: Unexpected termination of the channel
at hudson.remoting.SynchronousCommandTransport$ReaderThread.run(SynchronousCommandTransport.java:75)
Caused: hudson.remoting.ChannelClosedException: Channel "hudson.remoting.Channel@56b05d34:jenkins-s390x-5": Remote call on jenkins-s390x-5 failed. The channel is closing down or has closed down
at hudson.remoting.Channel.call(Channel.java:996)
at hudson.FilePath.act(FilePath.java:1230)
at hudson.FilePath.act(FilePath.java:1219)
at hudson.FilePath.delete(FilePath.java:1766)
at hudson.tasks.CommandInterpreter.perform(CommandInterpreter.java:163)
at hudson.tasks.CommandInterpreter.perform(CommandInterpreter.java:92)
at hudson.tasks.BuildStepMonitor$1.perform(BuildStepMonitor.java:20)
at hudson.model.AbstractBuild$AbstractBuildExecution.perform(AbstractBuild.java:818)
at hudson.model.Build$BuildExecution.build(Build.java:199)
at hudson.model.Build$BuildExecution.doRun(Build.java:164)
at hudson.model.AbstractBuild$AbstractBuildExecution.run(AbstractBuild.java:526)
at hudson.model.Run.execute(Run.java:1841)
at hudson.model.FreeStyleBuild.run(FreeStyleBuild.java:44)
at hudson.model.ResourceController.execute(ResourceController.java:101)
at hudson.model.Executor.run(Executor.java:442)
Build step 'Execute shell' marked build as failure
ERROR: Step ‘Archive the artifacts’ failed: no workspace for HBase-Nightly-s390x #563
ERROR: Step ‘Publish JUnit test result report’ failed: no workspace for HBase-Nightly-s390x #563
Jenkins build is still unstable: HBase-Nightly-s390x #562
Posted by Apache Jenkins Server <je...@builds.apache.org>.
See <https://ci-hbase.apache.org/job/HBase-Nightly-s390x/562/display/redirect?page=changes>
Jenkins build is still unstable: HBase-Nightly-s390x #561
Posted by Apache Jenkins Server <je...@builds.apache.org>.
See <https://ci-hbase.apache.org/job/HBase-Nightly-s390x/561/display/redirect?page=changes>
Jenkins build is still unstable: HBase-Nightly-s390x #560
Posted by Apache Jenkins Server <je...@builds.apache.org>.
See <https://ci-hbase.apache.org/job/HBase-Nightly-s390x/560/display/redirect>
Jenkins build is still unstable: HBase-Nightly-s390x #559
Posted by Apache Jenkins Server <je...@builds.apache.org>.
See <https://ci-hbase.apache.org/job/HBase-Nightly-s390x/559/display/redirect>
Jenkins build is still unstable: HBase-Nightly-s390x #558
Posted by Apache Jenkins Server <je...@builds.apache.org>.
See <https://ci-hbase.apache.org/job/HBase-Nightly-s390x/558/display/redirect?page=changes>
Jenkins build is still unstable: HBase-Nightly-s390x #557
Posted by Apache Jenkins Server <je...@builds.apache.org>.
See <https://ci-hbase.apache.org/job/HBase-Nightly-s390x/557/display/redirect?page=changes>
Jenkins build is still unstable: HBase-Nightly-s390x #556
Posted by Apache Jenkins Server <je...@builds.apache.org>.
See <https://ci-hbase.apache.org/job/HBase-Nightly-s390x/556/display/redirect?page=changes>
Jenkins build is still unstable: HBase-Nightly-s390x #555
Posted by Apache Jenkins Server <je...@builds.apache.org>.
See <https://ci-hbase.apache.org/job/HBase-Nightly-s390x/555/display/redirect?page=changes>
Jenkins build is still unstable: HBase-Nightly-s390x #554
Posted by Apache Jenkins Server <je...@builds.apache.org>.
See <https://ci-hbase.apache.org/job/HBase-Nightly-s390x/554/display/redirect>
Jenkins build is still unstable: HBase-Nightly-s390x #553
Posted by Apache Jenkins Server <je...@builds.apache.org>.
See <https://ci-hbase.apache.org/job/HBase-Nightly-s390x/553/display/redirect>
Jenkins build is still unstable: HBase-Nightly-s390x #552
Posted by Apache Jenkins Server <je...@builds.apache.org>.
See <https://ci-hbase.apache.org/job/HBase-Nightly-s390x/552/display/redirect>
Jenkins build is still unstable: HBase-Nightly-s390x #551
Posted by Apache Jenkins Server <je...@builds.apache.org>.
See <https://ci-hbase.apache.org/job/HBase-Nightly-s390x/551/display/redirect>
Jenkins build is still unstable: HBase-Nightly-s390x #550
Posted by Apache Jenkins Server <je...@builds.apache.org>.
See <https://ci-hbase.apache.org/job/HBase-Nightly-s390x/550/display/redirect?page=changes>
Jenkins build is still unstable: HBase-Nightly-s390x #549
Posted by Apache Jenkins Server <je...@builds.apache.org>.
See <https://ci-hbase.apache.org/job/HBase-Nightly-s390x/549/display/redirect?page=changes>
Jenkins build is still unstable: HBase-Nightly-s390x #548
Posted by Apache Jenkins Server <je...@builds.apache.org>.
See <https://ci-hbase.apache.org/job/HBase-Nightly-s390x/548/display/redirect?page=changes>
Jenkins build is still unstable: HBase-Nightly-s390x #547
Posted by Apache Jenkins Server <je...@builds.apache.org>.
See <https://ci-hbase.apache.org/job/HBase-Nightly-s390x/547/display/redirect?page=changes>
Jenkins build is still unstable: HBase-Nightly-s390x #546
Posted by Apache Jenkins Server <je...@builds.apache.org>.
See <https://ci-hbase.apache.org/job/HBase-Nightly-s390x/546/display/redirect?page=changes>
Jenkins build is still unstable: HBase-Nightly-s390x #545
Posted by Apache Jenkins Server <je...@builds.apache.org>.
See <https://ci-hbase.apache.org/job/HBase-Nightly-s390x/545/display/redirect?page=changes>
Jenkins build is still unstable: HBase-Nightly-s390x #544
Posted by Apache Jenkins Server <je...@builds.apache.org>.
See <https://ci-hbase.apache.org/job/HBase-Nightly-s390x/544/display/redirect?page=changes>
Jenkins build is still unstable: HBase-Nightly-s390x #543
Posted by Apache Jenkins Server <je...@builds.apache.org>.
See <https://ci-hbase.apache.org/job/HBase-Nightly-s390x/543/display/redirect?page=changes>
Jenkins build is still unstable: HBase-Nightly-s390x #542
Posted by Apache Jenkins Server <je...@builds.apache.org>.
See <https://ci-hbase.apache.org/job/HBase-Nightly-s390x/542/display/redirect?page=changes>
Jenkins build is still unstable: HBase-Nightly-s390x #541
Posted by Apache Jenkins Server <je...@builds.apache.org>.
See <https://ci-hbase.apache.org/job/HBase-Nightly-s390x/541/display/redirect?page=changes>
Jenkins build is still unstable: HBase-Nightly-s390x #540
Posted by Apache Jenkins Server <je...@builds.apache.org>.
See <https://ci-hbase.apache.org/job/HBase-Nightly-s390x/540/display/redirect?page=changes>
Jenkins build is still unstable: HBase-Nightly-s390x #539
Posted by Apache Jenkins Server <je...@builds.apache.org>.
See <https://ci-hbase.apache.org/job/HBase-Nightly-s390x/539/display/redirect?page=changes>
Jenkins build is still unstable: HBase-Nightly-s390x #538
Posted by Apache Jenkins Server <je...@builds.apache.org>.
See <https://ci-hbase.apache.org/job/HBase-Nightly-s390x/538/display/redirect>
Jenkins build is still unstable: HBase-Nightly-s390x #537
Posted by Apache Jenkins Server <je...@builds.apache.org>.
See <https://ci-hbase.apache.org/job/HBase-Nightly-s390x/537/display/redirect?page=changes>
Jenkins build is still unstable: HBase-Nightly-s390x #536
Posted by Apache Jenkins Server <je...@builds.apache.org>.
See <https://ci-hbase.apache.org/job/HBase-Nightly-s390x/536/display/redirect?page=changes>
Jenkins build is still unstable: HBase-Nightly-s390x #535
Posted by Apache Jenkins Server <je...@builds.apache.org>.
See <https://ci-hbase.apache.org/job/HBase-Nightly-s390x/535/display/redirect?page=changes>
Jenkins build is still unstable: HBase-Nightly-s390x #534
Posted by Apache Jenkins Server <je...@builds.apache.org>.
See <https://ci-hbase.apache.org/job/HBase-Nightly-s390x/534/display/redirect?page=changes>
Jenkins build is still unstable: HBase-Nightly-s390x #533
Posted by Apache Jenkins Server <je...@builds.apache.org>.
See <https://ci-hbase.apache.org/job/HBase-Nightly-s390x/533/display/redirect?page=changes>
Jenkins build is still unstable: HBase-Nightly-s390x #532
Posted by Apache Jenkins Server <je...@builds.apache.org>.
See <https://ci-hbase.apache.org/job/HBase-Nightly-s390x/532/display/redirect>
Jenkins build is still unstable: HBase-Nightly-s390x #531
Posted by Apache Jenkins Server <je...@builds.apache.org>.
See <https://ci-hbase.apache.org/job/HBase-Nightly-s390x/531/display/redirect?page=changes>
Jenkins build is still unstable: HBase-Nightly-s390x #530
Posted by Apache Jenkins Server <je...@builds.apache.org>.
See <https://ci-hbase.apache.org/job/HBase-Nightly-s390x/530/display/redirect?page=changes>
Jenkins build is still unstable: HBase-Nightly-s390x #529
Posted by Apache Jenkins Server <je...@builds.apache.org>.
See <https://ci-hbase.apache.org/job/HBase-Nightly-s390x/529/display/redirect?page=changes>
Jenkins build is still unstable: HBase-Nightly-s390x #528
Posted by Apache Jenkins Server <je...@builds.apache.org>.
See <https://ci-hbase.apache.org/job/HBase-Nightly-s390x/528/display/redirect?page=changes>
Jenkins build is still unstable: HBase-Nightly-s390x #527
Posted by Apache Jenkins Server <je...@builds.apache.org>.
See <https://ci-hbase.apache.org/job/HBase-Nightly-s390x/527/display/redirect?page=changes>
Jenkins build is still unstable: HBase-Nightly-s390x #526
Posted by Apache Jenkins Server <je...@builds.apache.org>.
See <https://ci-hbase.apache.org/job/HBase-Nightly-s390x/526/display/redirect?page=changes>
Jenkins build is still unstable: HBase-Nightly-s390x #525
Posted by Apache Jenkins Server <je...@builds.apache.org>.
See <https://ci-hbase.apache.org/job/HBase-Nightly-s390x/525/display/redirect?page=changes>
Jenkins build is still unstable: HBase-Nightly-s390x #524
Posted by Apache Jenkins Server <je...@builds.apache.org>.
See <https://ci-hbase.apache.org/job/HBase-Nightly-s390x/524/display/redirect?page=changes>
Jenkins build is still unstable: HBase-Nightly-s390x #523
Posted by Apache Jenkins Server <je...@builds.apache.org>.
See <https://ci-hbase.apache.org/job/HBase-Nightly-s390x/523/display/redirect?page=changes>
Jenkins build is still unstable: HBase-Nightly-s390x #522
Posted by Apache Jenkins Server <je...@builds.apache.org>.
See <https://ci-hbase.apache.org/job/HBase-Nightly-s390x/522/display/redirect?page=changes>
Jenkins build is still unstable: HBase-Nightly-s390x #521
Posted by Apache Jenkins Server <je...@builds.apache.org>.
See <https://ci-hbase.apache.org/job/HBase-Nightly-s390x/521/display/redirect?page=changes>
Jenkins build is still unstable: HBase-Nightly-s390x #520
Posted by Apache Jenkins Server <je...@builds.apache.org>.
See <https://ci-hbase.apache.org/job/HBase-Nightly-s390x/520/display/redirect?page=changes>
Jenkins build is still unstable: HBase-Nightly-s390x #519
Posted by Apache Jenkins Server <je...@builds.apache.org>.
See <https://ci-hbase.apache.org/job/HBase-Nightly-s390x/519/display/redirect?page=changes>
Jenkins build is unstable: HBase-Nightly-s390x #518
Posted by Apache Jenkins Server <je...@builds.apache.org>.
See <https://ci-hbase.apache.org/job/HBase-Nightly-s390x/518/display/redirect?page=changes>
Build failed in Jenkins: HBase-Nightly-s390x #517
Posted by Apache Jenkins Server <je...@builds.apache.org>.
See <https://ci-hbase.apache.org/job/HBase-Nightly-s390x/517/display/redirect?page=changes>
Changes:
[noreply] HBASE-27903 Skip submitting Split/Merge procedure when split/merge is disabled at table level (#6169)
------------------------------------------
[...truncated 2.19 MB...]
[INFO] Tests run: 10, Failures: 0, Errors: 0, Skipped: 0, Time elapsed: 44.65 s - in org.apache.hadoop.hbase.io.hfile.TestPrefetch
WARNING: A terminally deprecated method in java.lang.System has been called
WARNING: System::setSecurityManager has been called by org.apache.hadoop.hbase.SystemExitRule (file:/home/jenkins/jenkins-home/70ad3735/workspace/HBase-Nightly-s390x/hbase-common/target/test-classes/)
WARNING: Please consider reporting this to the maintainers of org.apache.hadoop.hbase.SystemExitRule
WARNING: System::setSecurityManager will be removed in a future release
[INFO] Running org.apache.hadoop.hbase.io.hfile.TestScannerSelectionUsingTTL
WARNING: A terminally deprecated method in java.lang.System has been called
WARNING: System::setSecurityManager has been called by org.apache.hadoop.hbase.SystemExitRule$1 (file:/home/jenkins/jenkins-home/70ad3735/workspace/HBase-Nightly-s390x/hbase-common/target/test-classes/)
WARNING: Please consider reporting this to the maintainers of org.apache.hadoop.hbase.SystemExitRule$1
WARNING: System::setSecurityManager will be removed in a future release
[INFO] Tests run: 3, Failures: 0, Errors: 0, Skipped: 0, Time elapsed: 38.144 s - in org.apache.hadoop.hbase.io.hfile.TestScannerSelectionUsingTTL
WARNING: A terminally deprecated method in java.lang.System has been called
WARNING: System::setSecurityManager has been called by org.apache.hadoop.hbase.SystemExitRule (file:/home/jenkins/jenkins-home/70ad3735/workspace/HBase-Nightly-s390x/hbase-common/target/test-classes/)
WARNING: Please consider reporting this to the maintainers of org.apache.hadoop.hbase.SystemExitRule
WARNING: System::setSecurityManager will be removed in a future release
[INFO] Running org.apache.hadoop.hbase.io.hfile.TestCacheConfig
WARNING: A terminally deprecated method in java.lang.System has been called
WARNING: System::setSecurityManager has been called by org.apache.hadoop.hbase.SystemExitRule$1 (file:/home/jenkins/jenkins-home/70ad3735/workspace/HBase-Nightly-s390x/hbase-common/target/test-classes/)
WARNING: Please consider reporting this to the maintainers of org.apache.hadoop.hbase.SystemExitRule$1
WARNING: System::setSecurityManager will be removed in a future release
[INFO] Tests run: 8, Failures: 0, Errors: 0, Skipped: 0, Time elapsed: 1.956 s - in org.apache.hadoop.hbase.io.hfile.TestCacheConfig
WARNING: A terminally deprecated method in java.lang.System has been called
WARNING: System::setSecurityManager has been called by org.apache.hadoop.hbase.SystemExitRule (file:/home/jenkins/jenkins-home/70ad3735/workspace/HBase-Nightly-s390x/hbase-common/target/test-classes/)
WARNING: Please consider reporting this to the maintainers of org.apache.hadoop.hbase.SystemExitRule
WARNING: System::setSecurityManager will be removed in a future release
[INFO] Running org.apache.hadoop.hbase.io.hfile.TestHFileBlockUnpack
WARNING: A terminally deprecated method in java.lang.System has been called
WARNING: System::setSecurityManager has been called by org.apache.hadoop.hbase.SystemExitRule$1 (file:/home/jenkins/jenkins-home/70ad3735/workspace/HBase-Nightly-s390x/hbase-common/target/test-classes/)
WARNING: Please consider reporting this to the maintainers of org.apache.hadoop.hbase.SystemExitRule$1
WARNING: System::setSecurityManager will be removed in a future release
[INFO] Tests run: 2, Failures: 0, Errors: 0, Skipped: 0, Time elapsed: 2.394 s - in org.apache.hadoop.hbase.io.hfile.TestHFileBlockUnpack
WARNING: A terminally deprecated method in java.lang.System has been called
WARNING: System::setSecurityManager has been called by org.apache.hadoop.hbase.SystemExitRule (file:/home/jenkins/jenkins-home/70ad3735/workspace/HBase-Nightly-s390x/hbase-common/target/test-classes/)
WARNING: Please consider reporting this to the maintainers of org.apache.hadoop.hbase.SystemExitRule
WARNING: System::setSecurityManager will be removed in a future release
[INFO] Running org.apache.hadoop.hbase.io.hfile.TestForceCacheImportantBlocks
WARNING: A terminally deprecated method in java.lang.System has been called
WARNING: System::setSecurityManager has been called by org.apache.hadoop.hbase.SystemExitRule$1 (file:/home/jenkins/jenkins-home/70ad3735/workspace/HBase-Nightly-s390x/hbase-common/target/test-classes/)
WARNING: Please consider reporting this to the maintainers of org.apache.hadoop.hbase.SystemExitRule$1
WARNING: System::setSecurityManager will be removed in a future release
[INFO] Tests run: 2, Failures: 0, Errors: 0, Skipped: 0, Time elapsed: 19.899 s - in org.apache.hadoop.hbase.io.hfile.TestForceCacheImportantBlocks
WARNING: A terminally deprecated method in java.lang.System has been called
WARNING: System::setSecurityManager has been called by org.apache.hadoop.hbase.SystemExitRule (file:/home/jenkins/jenkins-home/70ad3735/workspace/HBase-Nightly-s390x/hbase-common/target/test-classes/)
WARNING: Please consider reporting this to the maintainers of org.apache.hadoop.hbase.SystemExitRule
WARNING: System::setSecurityManager will be removed in a future release
[INFO] Running org.apache.hadoop.hbase.io.hfile.TestHFileBlockIndex
WARNING: A terminally deprecated method in java.lang.System has been called
WARNING: System::setSecurityManager has been called by org.apache.hadoop.hbase.SystemExitRule$1 (file:/home/jenkins/jenkins-home/70ad3735/workspace/HBase-Nightly-s390x/hbase-common/target/test-classes/)
WARNING: Please consider reporting this to the maintainers of org.apache.hadoop.hbase.SystemExitRule$1
WARNING: System::setSecurityManager will be removed in a future release
[INFO] Tests run: 18, Failures: 0, Errors: 0, Skipped: 0, Time elapsed: 9.029 s - in org.apache.hadoop.hbase.io.hfile.TestHFileBlockIndex
WARNING: A terminally deprecated method in java.lang.System has been called
WARNING: System::setSecurityManager has been called by org.apache.hadoop.hbase.SystemExitRule (file:/home/jenkins/jenkins-home/70ad3735/workspace/HBase-Nightly-s390x/hbase-common/target/test-classes/)
WARNING: Please consider reporting this to the maintainers of org.apache.hadoop.hbase.SystemExitRule
WARNING: System::setSecurityManager will be removed in a future release
[INFO] Running org.apache.hadoop.hbase.io.hfile.TestPrefetchWithBucketCache
WARNING: A terminally deprecated method in java.lang.System has been called
WARNING: System::setSecurityManager has been called by org.apache.hadoop.hbase.SystemExitRule$1 (file:/home/jenkins/jenkins-home/70ad3735/workspace/HBase-Nightly-s390x/hbase-common/target/test-classes/)
WARNING: Please consider reporting this to the maintainers of org.apache.hadoop.hbase.SystemExitRule$1
WARNING: System::setSecurityManager will be removed in a future release
[INFO] Tests run: 5, Failures: 0, Errors: 0, Skipped: 0, Time elapsed: 16.277 s - in org.apache.hadoop.hbase.io.hfile.TestPrefetchWithBucketCache
WARNING: A terminally deprecated method in java.lang.System has been called
WARNING: System::setSecurityManager has been called by org.apache.hadoop.hbase.SystemExitRule (file:/home/jenkins/jenkins-home/70ad3735/workspace/HBase-Nightly-s390x/hbase-common/target/test-classes/)
WARNING: Please consider reporting this to the maintainers of org.apache.hadoop.hbase.SystemExitRule
WARNING: System::setSecurityManager will be removed in a future release
[INFO] Running org.apache.hadoop.hbase.io.hfile.TestBlockEvictionOnRegionMovement
WARNING: A terminally deprecated method in java.lang.System has been called
WARNING: System::setSecurityManager has been called by org.apache.hadoop.hbase.SystemExitRule$1 (file:/home/jenkins/jenkins-home/70ad3735/workspace/HBase-Nightly-s390x/hbase-common/target/test-classes/)
WARNING: Please consider reporting this to the maintainers of org.apache.hadoop.hbase.SystemExitRule$1
WARNING: System::setSecurityManager will be removed in a future release
[INFO] Tests run: 2, Failures: 0, Errors: 0, Skipped: 0, Time elapsed: 21.834 s - in org.apache.hadoop.hbase.io.hfile.TestBlockEvictionOnRegionMovement
WARNING: A terminally deprecated method in java.lang.System has been called
WARNING: System::setSecurityManager has been called by org.apache.hadoop.hbase.SystemExitRule (file:/home/jenkins/jenkins-home/70ad3735/workspace/HBase-Nightly-s390x/hbase-common/target/test-classes/)
WARNING: Please consider reporting this to the maintainers of org.apache.hadoop.hbase.SystemExitRule
WARNING: System::setSecurityManager will be removed in a future release
[INFO] Running org.apache.hadoop.hbase.io.hfile.TestRowIndexV1DataEncoder
WARNING: A terminally deprecated method in java.lang.System has been called
WARNING: System::setSecurityManager has been called by org.apache.hadoop.hbase.SystemExitRule$1 (file:/home/jenkins/jenkins-home/70ad3735/workspace/HBase-Nightly-s390x/hbase-common/target/test-classes/)
WARNING: Please consider reporting this to the maintainers of org.apache.hadoop.hbase.SystemExitRule$1
WARNING: System::setSecurityManager will be removed in a future release
[INFO] Tests run: 1, Failures: 0, Errors: 0, Skipped: 0, Time elapsed: 1.149 s - in org.apache.hadoop.hbase.io.hfile.TestRowIndexV1DataEncoder
WARNING: A terminally deprecated method in java.lang.System has been called
WARNING: System::setSecurityManager has been called by org.apache.hadoop.hbase.SystemExitRule (file:/home/jenkins/jenkins-home/70ad3735/workspace/HBase-Nightly-s390x/hbase-common/target/test-classes/)
WARNING: Please consider reporting this to the maintainers of org.apache.hadoop.hbase.SystemExitRule
WARNING: System::setSecurityManager will be removed in a future release
[INFO] Running org.apache.hadoop.hbase.io.hfile.TestHFileWriterV3WithDataEncoders
WARNING: A terminally deprecated method in java.lang.System has been called
WARNING: System::setSecurityManager has been called by org.apache.hadoop.hbase.SystemExitRule$1 (file:/home/jenkins/jenkins-home/70ad3735/workspace/HBase-Nightly-s390x/hbase-common/target/test-classes/)
WARNING: Please consider reporting this to the maintainers of org.apache.hadoop.hbase.SystemExitRule$1
WARNING: System::setSecurityManager will be removed in a future release
[INFO] Tests run: 16, Failures: 0, Errors: 0, Skipped: 0, Time elapsed: 9.323 s - in org.apache.hadoop.hbase.io.hfile.TestHFileWriterV3WithDataEncoders
WARNING: A terminally deprecated method in java.lang.System has been called
WARNING: System::setSecurityManager has been called by org.apache.hadoop.hbase.SystemExitRule (file:/home/jenkins/jenkins-home/70ad3735/workspace/HBase-Nightly-s390x/hbase-common/target/test-classes/)
WARNING: Please consider reporting this to the maintainers of org.apache.hadoop.hbase.SystemExitRule
WARNING: System::setSecurityManager will be removed in a future release
[INFO] Running org.apache.hadoop.hbase.io.hfile.bucket.TestBucketCachePersister
WARNING: A terminally deprecated method in java.lang.System has been called
WARNING: System::setSecurityManager has been called by org.apache.hadoop.hbase.SystemExitRule$1 (file:/home/jenkins/jenkins-home/70ad3735/workspace/HBase-Nightly-s390x/hbase-common/target/test-classes/)
WARNING: Please consider reporting this to the maintainers of org.apache.hadoop.hbase.SystemExitRule$1
WARNING: System::setSecurityManager will be removed in a future release
[INFO] Tests run: 4, Failures: 0, Errors: 0, Skipped: 0, Time elapsed: 14.242 s - in org.apache.hadoop.hbase.io.hfile.bucket.TestBucketCachePersister
WARNING: A terminally deprecated method in java.lang.System has been called
WARNING: System::setSecurityManager has been called by org.apache.hadoop.hbase.SystemExitRule (file:/home/jenkins/jenkins-home/70ad3735/workspace/HBase-Nightly-s390x/hbase-common/target/test-classes/)
WARNING: Please consider reporting this to the maintainers of org.apache.hadoop.hbase.SystemExitRule
WARNING: System::setSecurityManager will be removed in a future release
[INFO] Running org.apache.hadoop.hbase.io.hfile.bucket.TestBucketCache
WARNING: A terminally deprecated method in java.lang.System has been called
WARNING: System::setSecurityManager has been called by org.apache.hadoop.hbase.SystemExitRule$1 (file:/home/jenkins/jenkins-home/70ad3735/workspace/HBase-Nightly-s390x/hbase-common/target/test-classes/)
WARNING: Please consider reporting this to the maintainers of org.apache.hadoop.hbase.SystemExitRule$1
WARNING: System::setSecurityManager will be removed in a future release
[INFO] Tests run: 56, Failures: 0, Errors: 0, Skipped: 0, Time elapsed: 51.379 s - in org.apache.hadoop.hbase.io.hfile.bucket.TestBucketCache
WARNING: A terminally deprecated method in java.lang.System has been called
WARNING: System::setSecurityManager has been called by org.apache.hadoop.hbase.SystemExitRule (file:/home/jenkins/jenkins-home/70ad3735/workspace/HBase-Nightly-s390x/hbase-common/target/test-classes/)
WARNING: Please consider reporting this to the maintainers of org.apache.hadoop.hbase.SystemExitRule
WARNING: System::setSecurityManager will be removed in a future release
[INFO] Running org.apache.hadoop.hbase.io.hfile.bucket.TestPrefetchPersistence
WARNING: A terminally deprecated method in java.lang.System has been called
WARNING: System::setSecurityManager has been called by org.apache.hadoop.hbase.SystemExitRule$1 (file:/home/jenkins/jenkins-home/70ad3735/workspace/HBase-Nightly-s390x/hbase-common/target/test-classes/)
WARNING: Please consider reporting this to the maintainers of org.apache.hadoop.hbase.SystemExitRule$1
WARNING: System::setSecurityManager will be removed in a future release
[INFO] Tests run: 1, Failures: 0, Errors: 0, Skipped: 0, Time elapsed: 5.297 s - in org.apache.hadoop.hbase.io.hfile.bucket.TestPrefetchPersistence
WARNING: A terminally deprecated method in java.lang.System has been called
WARNING: System::setSecurityManager has been called by org.apache.hadoop.hbase.SystemExitRule (file:/home/jenkins/jenkins-home/70ad3735/workspace/HBase-Nightly-s390x/hbase-common/target/test-classes/)
WARNING: Please consider reporting this to the maintainers of org.apache.hadoop.hbase.SystemExitRule
WARNING: System::setSecurityManager will be removed in a future release
[INFO] Running org.apache.hadoop.hbase.io.hfile.TestHFileScannerImplReferenceCount
WARNING: A terminally deprecated method in java.lang.System has been called
WARNING: System::setSecurityManager has been called by org.apache.hadoop.hbase.SystemExitRule$1 (file:/home/jenkins/jenkins-home/70ad3735/workspace/HBase-Nightly-s390x/hbase-common/target/test-classes/)
WARNING: Please consider reporting this to the maintainers of org.apache.hadoop.hbase.SystemExitRule$1
WARNING: System::setSecurityManager will be removed in a future release
[INFO] Tests run: 28, Failures: 0, Errors: 0, Skipped: 0, Time elapsed: 67.269 s - in org.apache.hadoop.hbase.io.hfile.TestHFileScannerImplReferenceCount
WARNING: A terminally deprecated method in java.lang.System has been called
WARNING: System::setSecurityManager has been called by org.apache.hadoop.hbase.SystemExitRule (file:/home/jenkins/jenkins-home/70ad3735/workspace/HBase-Nightly-s390x/hbase-common/target/test-classes/)
WARNING: Please consider reporting this to the maintainers of org.apache.hadoop.hbase.SystemExitRule
WARNING: System::setSecurityManager will be removed in a future release
[INFO] Running org.apache.hadoop.hbase.io.hfile.TestHFileBlock
WARNING: A terminally deprecated method in java.lang.System has been called
WARNING: System::setSecurityManager has been called by org.apache.hadoop.hbase.SystemExitRule$1 (file:/home/jenkins/jenkins-home/70ad3735/workspace/HBase-Nightly-s390x/hbase-common/target/test-classes/)
WARNING: Please consider reporting this to the maintainers of org.apache.hadoop.hbase.SystemExitRule$1
WARNING: System::setSecurityManager will be removed in a future release
[INFO] Tests run: 64, Failures: 0, Errors: 0, Skipped: 0, Time elapsed: 209.782 s - in org.apache.hadoop.hbase.io.hfile.TestHFileBlock
WARNING: A terminally deprecated method in java.lang.System has been called
WARNING: System::setSecurityManager has been called by org.apache.hadoop.hbase.SystemExitRule (file:/home/jenkins/jenkins-home/70ad3735/workspace/HBase-Nightly-s390x/hbase-common/target/test-classes/)
WARNING: Please consider reporting this to the maintainers of org.apache.hadoop.hbase.SystemExitRule
WARNING: System::setSecurityManager will be removed in a future release
[INFO] Running org.apache.hadoop.hbase.io.encoding.TestLoadAndSwitchEncodeOnDisk
WARNING: A terminally deprecated method in java.lang.System has been called
WARNING: System::setSecurityManager has been called by org.apache.hadoop.hbase.SystemExitRule$1 (file:/home/jenkins/jenkins-home/70ad3735/workspace/HBase-Nightly-s390x/hbase-common/target/test-classes/)
WARNING: Please consider reporting this to the maintainers of org.apache.hadoop.hbase.SystemExitRule$1
WARNING: System::setSecurityManager will be removed in a future release
[INFO] Tests run: 1, Failures: 0, Errors: 0, Skipped: 0, Time elapsed: 69.145 s - in org.apache.hadoop.hbase.io.encoding.TestLoadAndSwitchEncodeOnDisk
WARNING: A terminally deprecated method in java.lang.System has been called
WARNING: System::setSecurityManager has been called by org.apache.hadoop.hbase.SystemExitRule (file:/home/jenkins/jenkins-home/70ad3735/workspace/HBase-Nightly-s390x/hbase-common/target/test-classes/)
WARNING: Please consider reporting this to the maintainers of org.apache.hadoop.hbase.SystemExitRule
WARNING: System::setSecurityManager will be removed in a future release
[INFO] Running org.apache.hadoop.hbase.io.encoding.TestDataBlockEncoders
WARNING: A terminally deprecated method in java.lang.System has been called
WARNING: System::setSecurityManager has been called by org.apache.hadoop.hbase.SystemExitRule$1 (file:/home/jenkins/jenkins-home/70ad3735/workspace/HBase-Nightly-s390x/hbase-common/target/test-classes/)
WARNING: Please consider reporting this to the maintainers of org.apache.hadoop.hbase.SystemExitRule$1
WARNING: System::setSecurityManager will be removed in a future release
[INFO] Tests run: 72, Failures: 0, Errors: 0, Skipped: 0, Time elapsed: 82.889 s - in org.apache.hadoop.hbase.io.encoding.TestDataBlockEncoders
WARNING: A terminally deprecated method in java.lang.System has been called
WARNING: System::setSecurityManager has been called by org.apache.hadoop.hbase.SystemExitRule (file:/home/jenkins/jenkins-home/70ad3735/workspace/HBase-Nightly-s390x/hbase-common/target/test-classes/)
WARNING: Please consider reporting this to the maintainers of org.apache.hadoop.hbase.SystemExitRule
WARNING: System::setSecurityManager will be removed in a future release
[INFO] Running org.apache.hadoop.hbase.io.encoding.TestBufferedDataBlockEncoder
WARNING: A terminally deprecated method in java.lang.System has been called
WARNING: System::setSecurityManager has been called by org.apache.hadoop.hbase.SystemExitRule$1 (file:/home/jenkins/jenkins-home/70ad3735/workspace/HBase-Nightly-s390x/hbase-common/target/test-classes/)
WARNING: Please consider reporting this to the maintainers of org.apache.hadoop.hbase.SystemExitRule$1
WARNING: System::setSecurityManager will be removed in a future release
[INFO] Tests run: 3, Failures: 0, Errors: 0, Skipped: 0, Time elapsed: 9.94 s - in org.apache.hadoop.hbase.io.encoding.TestBufferedDataBlockEncoder
WARNING: A terminally deprecated method in java.lang.System has been called
WARNING: System::setSecurityManager has been called by org.apache.hadoop.hbase.SystemExitRule (file:/home/jenkins/jenkins-home/70ad3735/workspace/HBase-Nightly-s390x/hbase-common/target/test-classes/)
WARNING: Please consider reporting this to the maintainers of org.apache.hadoop.hbase.SystemExitRule
WARNING: System::setSecurityManager will be removed in a future release
[INFO] Running org.apache.hadoop.hbase.io.encoding.TestEncodedSeekers
WARNING: A terminally deprecated method in java.lang.System has been called
WARNING: System::setSecurityManager has been called by org.apache.hadoop.hbase.SystemExitRule$1 (file:/home/jenkins/jenkins-home/70ad3735/workspace/HBase-Nightly-s390x/hbase-common/target/test-classes/)
WARNING: Please consider reporting this to the maintainers of org.apache.hadoop.hbase.SystemExitRule$1
WARNING: System::setSecurityManager will be removed in a future release
[INFO] Tests run: 20, Failures: 0, Errors: 0, Skipped: 0, Time elapsed: 288.619 s - in org.apache.hadoop.hbase.io.encoding.TestEncodedSeekers
WARNING: A terminally deprecated method in java.lang.System has been called
WARNING: System::setSecurityManager has been called by org.apache.hadoop.hbase.SystemExitRule (file:/home/jenkins/jenkins-home/70ad3735/workspace/HBase-Nightly-s390x/hbase-common/target/test-classes/)
WARNING: Please consider reporting this to the maintainers of org.apache.hadoop.hbase.SystemExitRule
WARNING: System::setSecurityManager will be removed in a future release
[INFO] Running org.apache.hadoop.hbase.io.encoding.TestChangingEncoding
FATAL: command execution failed
java.io.EOFException
at java.base/java.io.ObjectInputStream$PeekInputStream.readFully(ObjectInputStream.java:2911)
at java.base/java.io.ObjectInputStream$BlockDataInputStream.readShort(ObjectInputStream.java:3406)
at java.base/java.io.ObjectInputStream.readStreamHeader(ObjectInputStream.java:932)
at java.base/java.io.ObjectInputStream.<init>(ObjectInputStream.java:375)
at hudson.remoting.ObjectInputStreamEx.<init>(ObjectInputStreamEx.java:49)
at hudson.remoting.Command.readFrom(Command.java:142)
at hudson.remoting.Command.readFrom(Command.java:128)
at hudson.remoting.AbstractSynchronousByteArrayCommandTransport.read(AbstractSynchronousByteArrayCommandTransport.java:35)
at hudson.remoting.SynchronousCommandTransport$ReaderThread.run(SynchronousCommandTransport.java:61)
Caused: java.io.IOException: Unexpected termination of the channel
at hudson.remoting.SynchronousCommandTransport$ReaderThread.run(SynchronousCommandTransport.java:75)
Caused: java.io.IOException: Backing channel 'jenkins-s390x-3' is disconnected.
at hudson.remoting.RemoteInvocationHandler.channelOrFail(RemoteInvocationHandler.java:215)
at hudson.remoting.RemoteInvocationHandler.invoke(RemoteInvocationHandler.java:285)
at com.sun.proxy.$Proxy112.isAlive(Unknown Source)
at hudson.Launcher$RemoteLauncher$ProcImpl.isAlive(Launcher.java:1212)
at hudson.Launcher$RemoteLauncher$ProcImpl.join(Launcher.java:1204)
at hudson.tasks.CommandInterpreter.join(CommandInterpreter.java:195)
at hudson.tasks.CommandInterpreter.perform(CommandInterpreter.java:145)
at hudson.tasks.CommandInterpreter.perform(CommandInterpreter.java:92)
at hudson.tasks.BuildStepMonitor$1.perform(BuildStepMonitor.java:20)
at hudson.model.AbstractBuild$AbstractBuildExecution.perform(AbstractBuild.java:818)
at hudson.model.Build$BuildExecution.build(Build.java:199)
at hudson.model.Build$BuildExecution.doRun(Build.java:164)
at hudson.model.AbstractBuild$AbstractBuildExecution.run(AbstractBuild.java:526)
at hudson.model.Run.execute(Run.java:1841)
at hudson.model.FreeStyleBuild.run(FreeStyleBuild.java:44)
at hudson.model.ResourceController.execute(ResourceController.java:101)
at hudson.model.Executor.run(Executor.java:442)
FATAL: Unable to delete script file /tmp/jenkins18190769463645632929.sh
java.io.EOFException
at java.base/java.io.ObjectInputStream$PeekInputStream.readFully(ObjectInputStream.java:2911)
at java.base/java.io.ObjectInputStream$BlockDataInputStream.readShort(ObjectInputStream.java:3406)
at java.base/java.io.ObjectInputStream.readStreamHeader(ObjectInputStream.java:932)
at java.base/java.io.ObjectInputStream.<init>(ObjectInputStream.java:375)
at hudson.remoting.ObjectInputStreamEx.<init>(ObjectInputStreamEx.java:49)
at hudson.remoting.Command.readFrom(Command.java:142)
at hudson.remoting.Command.readFrom(Command.java:128)
at hudson.remoting.AbstractSynchronousByteArrayCommandTransport.read(AbstractSynchronousByteArrayCommandTransport.java:35)
at hudson.remoting.SynchronousCommandTransport$ReaderThread.run(SynchronousCommandTransport.java:61)
Caused: java.io.IOException: Unexpected termination of the channel
at hudson.remoting.SynchronousCommandTransport$ReaderThread.run(SynchronousCommandTransport.java:75)
Caused: hudson.remoting.ChannelClosedException: Channel "hudson.remoting.Channel@714e7e16:jenkins-s390x-3": Remote call on jenkins-s390x-3 failed. The channel is closing down or has closed down
at hudson.remoting.Channel.call(Channel.java:996)
at hudson.FilePath.act(FilePath.java:1230)
at hudson.FilePath.act(FilePath.java:1219)
at hudson.FilePath.delete(FilePath.java:1766)
at hudson.tasks.CommandInterpreter.perform(CommandInterpreter.java:163)
at hudson.tasks.CommandInterpreter.perform(CommandInterpreter.java:92)
at hudson.tasks.BuildStepMonitor$1.perform(BuildStepMonitor.java:20)
at hudson.model.AbstractBuild$AbstractBuildExecution.perform(AbstractBuild.java:818)
at hudson.model.Build$BuildExecution.build(Build.java:199)
at hudson.model.Build$BuildExecution.doRun(Build.java:164)
at hudson.model.AbstractBuild$AbstractBuildExecution.run(AbstractBuild.java:526)
at hudson.model.Run.execute(Run.java:1841)
at hudson.model.FreeStyleBuild.run(FreeStyleBuild.java:44)
at hudson.model.ResourceController.execute(ResourceController.java:101)
at hudson.model.Executor.run(Executor.java:442)
Build step 'Execute shell' marked build as failure
ERROR: Step ‘Archive the artifacts’ failed: no workspace for HBase-Nightly-s390x #517
ERROR: Step ‘Publish JUnit test result report’ failed: no workspace for HBase-Nightly-s390x #517
Jenkins build is still unstable: HBase-Nightly-s390x #516
Posted by Apache Jenkins Server <je...@builds.apache.org>.
See <https://ci-hbase.apache.org/job/HBase-Nightly-s390x/516/display/redirect?page=changes>
Jenkins build is still unstable: HBase-Nightly-s390x #515
Posted by Apache Jenkins Server <je...@builds.apache.org>.
See <https://ci-hbase.apache.org/job/HBase-Nightly-s390x/515/display/redirect?page=changes>
Jenkins build is still unstable: HBase-Nightly-s390x #514
Posted by Apache Jenkins Server <je...@builds.apache.org>.
See <https://ci-hbase.apache.org/job/HBase-Nightly-s390x/514/display/redirect>
Jenkins build is still unstable: HBase-Nightly-s390x #513
Posted by Apache Jenkins Server <je...@builds.apache.org>.
See <https://ci-hbase.apache.org/job/HBase-Nightly-s390x/513/display/redirect?page=changes>
Jenkins build is still unstable: HBase-Nightly-s390x #512
Posted by Apache Jenkins Server <je...@builds.apache.org>.
See <https://ci-hbase.apache.org/job/HBase-Nightly-s390x/512/display/redirect?page=changes>
Jenkins build is still unstable: HBase-Nightly-s390x #511
Posted by Apache Jenkins Server <je...@builds.apache.org>.
See <https://ci-hbase.apache.org/job/HBase-Nightly-s390x/511/display/redirect>
Jenkins build is still unstable: HBase-Nightly-s390x #510
Posted by Apache Jenkins Server <je...@builds.apache.org>.
See <https://ci-hbase.apache.org/job/HBase-Nightly-s390x/510/display/redirect>
Jenkins build is still unstable: HBase-Nightly-s390x #509
Posted by Apache Jenkins Server <je...@builds.apache.org>.
See <https://ci-hbase.apache.org/job/HBase-Nightly-s390x/509/display/redirect?page=changes>
Jenkins build is still unstable: HBase-Nightly-s390x #508
Posted by Apache Jenkins Server <je...@builds.apache.org>.
See <https://ci-hbase.apache.org/job/HBase-Nightly-s390x/508/display/redirect?page=changes>
Jenkins build is still unstable: HBase-Nightly-s390x #507
Posted by Apache Jenkins Server <je...@builds.apache.org>.
See <https://ci-hbase.apache.org/job/HBase-Nightly-s390x/507/display/redirect>
Jenkins build is still unstable: HBase-Nightly-s390x #506
Posted by Apache Jenkins Server <je...@builds.apache.org>.
See <https://ci-hbase.apache.org/job/HBase-Nightly-s390x/506/display/redirect>
Jenkins build is still unstable: HBase-Nightly-s390x #505
Posted by Apache Jenkins Server <je...@builds.apache.org>.
See <https://ci-hbase.apache.org/job/HBase-Nightly-s390x/505/display/redirect?page=changes>
Jenkins build is still unstable: HBase-Nightly-s390x #504
Posted by Apache Jenkins Server <je...@builds.apache.org>.
See <https://ci-hbase.apache.org/job/HBase-Nightly-s390x/504/display/redirect?page=changes>
Jenkins build is still unstable: HBase-Nightly-s390x #503
Posted by Apache Jenkins Server <je...@builds.apache.org>.
See <https://ci-hbase.apache.org/job/HBase-Nightly-s390x/503/display/redirect?page=changes>
Jenkins build is still unstable: HBase-Nightly-s390x #502
Posted by Apache Jenkins Server <je...@builds.apache.org>.
See <https://ci-hbase.apache.org/job/HBase-Nightly-s390x/502/display/redirect?page=changes>