You are viewing a plain text version of this content. The canonical link for it is here.
Posted to dev@lucene.apache.org by Policeman Jenkins Server <je...@thetaphi.de> on 2015/10/14 00:38:16 UTC

[JENKINS] Lucene-Solr-5.x-Linux (64bit/jdk1.8.0_60) - Build # 14229 - Still Failing!

Build: http://jenkins.thetaphi.de/job/Lucene-Solr-5.x-Linux/14229/
Java: 64bit/jdk1.8.0_60 -XX:-UseCompressedOops -XX:+UseParallelGC

1 tests failed.
FAILED:  org.apache.solr.cloud.SolrCloudExampleTest.testLoadDocsIntoGettingStartedCollection

Error Message:
Delete action failed!

Stack Trace:
java.lang.AssertionError: Delete action failed!
	at __randomizedtesting.SeedInfo.seed([F2489A32244E4281:E12BA85D1521FB27]:0)
	at org.junit.Assert.fail(Assert.java:93)
	at org.junit.Assert.assertTrue(Assert.java:43)
	at org.apache.solr.cloud.SolrCloudExampleTest.doTestDeleteAction(SolrCloudExampleTest.java:169)
	at org.apache.solr.cloud.SolrCloudExampleTest.testLoadDocsIntoGettingStartedCollection(SolrCloudExampleTest.java:145)
	at sun.reflect.NativeMethodAccessorImpl.invoke0(Native Method)
	at sun.reflect.NativeMethodAccessorImpl.invoke(NativeMethodAccessorImpl.java:62)
	at sun.reflect.DelegatingMethodAccessorImpl.invoke(DelegatingMethodAccessorImpl.java:43)
	at java.lang.reflect.Method.invoke(Method.java:497)
	at com.carrotsearch.randomizedtesting.RandomizedRunner.invoke(RandomizedRunner.java:1665)
	at com.carrotsearch.randomizedtesting.RandomizedRunner$8.evaluate(RandomizedRunner.java:864)
	at com.carrotsearch.randomizedtesting.RandomizedRunner$9.evaluate(RandomizedRunner.java:900)
	at com.carrotsearch.randomizedtesting.RandomizedRunner$10.evaluate(RandomizedRunner.java:914)
	at org.apache.solr.BaseDistributedSearchTestCase$ShardsRepeatRule$ShardsFixedStatement.callStatement(BaseDistributedSearchTestCase.java:963)
	at org.apache.solr.BaseDistributedSearchTestCase$ShardsRepeatRule$ShardsStatement.evaluate(BaseDistributedSearchTestCase.java:938)
	at com.carrotsearch.randomizedtesting.rules.SystemPropertiesRestoreRule$1.evaluate(SystemPropertiesRestoreRule.java:57)
	at org.apache.lucene.util.TestRuleSetupTeardownChained$1.evaluate(TestRuleSetupTeardownChained.java:50)
	at org.apache.lucene.util.AbstractBeforeAfterRule$1.evaluate(AbstractBeforeAfterRule.java:46)
	at org.apache.lucene.util.TestRuleThreadAndTestName$1.evaluate(TestRuleThreadAndTestName.java:49)
	at org.apache.lucene.util.TestRuleIgnoreAfterMaxFailures$1.evaluate(TestRuleIgnoreAfterMaxFailures.java:65)
	at org.apache.lucene.util.TestRuleMarkFailure$1.evaluate(TestRuleMarkFailure.java:48)
	at com.carrotsearch.randomizedtesting.rules.StatementAdapter.evaluate(StatementAdapter.java:36)
	at com.carrotsearch.randomizedtesting.ThreadLeakControl$StatementRunner.run(ThreadLeakControl.java:367)
	at com.carrotsearch.randomizedtesting.ThreadLeakControl.forkTimeoutingTask(ThreadLeakControl.java:809)
	at com.carrotsearch.randomizedtesting.ThreadLeakControl$3.evaluate(ThreadLeakControl.java:460)
	at com.carrotsearch.randomizedtesting.RandomizedRunner.runSingleTest(RandomizedRunner.java:873)
	at com.carrotsearch.randomizedtesting.RandomizedRunner$5.evaluate(RandomizedRunner.java:775)
	at com.carrotsearch.randomizedtesting.RandomizedRunner$6.evaluate(RandomizedRunner.java:809)
	at com.carrotsearch.randomizedtesting.RandomizedRunner$7.evaluate(RandomizedRunner.java:820)
	at com.carrotsearch.randomizedtesting.rules.StatementAdapter.evaluate(StatementAdapter.java:36)
	at com.carrotsearch.randomizedtesting.rules.SystemPropertiesRestoreRule$1.evaluate(SystemPropertiesRestoreRule.java:57)
	at org.apache.lucene.util.AbstractBeforeAfterRule$1.evaluate(AbstractBeforeAfterRule.java:46)
	at com.carrotsearch.randomizedtesting.rules.StatementAdapter.evaluate(StatementAdapter.java:36)
	at org.apache.lucene.util.TestRuleStoreClassName$1.evaluate(TestRuleStoreClassName.java:42)
	at com.carrotsearch.randomizedtesting.rules.NoShadowingOrOverridesOnMethodsRule$1.evaluate(NoShadowingOrOverridesOnMethodsRule.java:39)
	at com.carrotsearch.randomizedtesting.rules.NoShadowingOrOverridesOnMethodsRule$1.evaluate(NoShadowingOrOverridesOnMethodsRule.java:39)
	at com.carrotsearch.randomizedtesting.rules.StatementAdapter.evaluate(StatementAdapter.java:36)
	at com.carrotsearch.randomizedtesting.rules.StatementAdapter.evaluate(StatementAdapter.java:36)
	at com.carrotsearch.randomizedtesting.rules.StatementAdapter.evaluate(StatementAdapter.java:36)
	at org.apache.lucene.util.TestRuleAssertionsRequired$1.evaluate(TestRuleAssertionsRequired.java:54)
	at org.apache.lucene.util.TestRuleMarkFailure$1.evaluate(TestRuleMarkFailure.java:48)
	at org.apache.lucene.util.TestRuleIgnoreAfterMaxFailures$1.evaluate(TestRuleIgnoreAfterMaxFailures.java:65)
	at org.apache.lucene.util.TestRuleIgnoreTestSuites$1.evaluate(TestRuleIgnoreTestSuites.java:55)
	at com.carrotsearch.randomizedtesting.rules.StatementAdapter.evaluate(StatementAdapter.java:36)
	at com.carrotsearch.randomizedtesting.ThreadLeakControl$StatementRunner.run(ThreadLeakControl.java:367)
	at java.lang.Thread.run(Thread.java:745)




Build Log:
[...truncated 9935 lines...]
   [junit4] Suite: org.apache.solr.cloud.SolrCloudExampleTest
   [junit4]   2> Creating dataDir: /home/jenkins/workspace/Lucene-Solr-5.x-Linux/solr/build/solr-core/test/J0/temp/solr.cloud.SolrCloudExampleTest_F2489A32244E4281-001/init-core-data-001
   [junit4]   2> 279515 INFO  (SUITE-SolrCloudExampleTest-seed#[F2489A32244E4281]-worker) [    ] o.a.s.SolrTestCaseJ4 Randomized ssl (false) and clientAuth (false)
   [junit4]   2> 279515 INFO  (SUITE-SolrCloudExampleTest-seed#[F2489A32244E4281]-worker) [    ] o.a.s.BaseDistributedSearchTestCase Setting hostContext system property: /
   [junit4]   2> 279516 INFO  (TEST-SolrCloudExampleTest.testLoadDocsIntoGettingStartedCollection-seed#[F2489A32244E4281]) [    ] o.a.s.c.ZkTestServer STARTING ZK TEST SERVER
   [junit4]   2> 279517 INFO  (Thread-1832) [    ] o.a.s.c.ZkTestServer client port:0.0.0.0/0.0.0.0:0
   [junit4]   2> 279517 INFO  (Thread-1832) [    ] o.a.s.c.ZkTestServer Starting server
   [junit4]   2> 279617 INFO  (TEST-SolrCloudExampleTest.testLoadDocsIntoGettingStartedCollection-seed#[F2489A32244E4281]) [    ] o.a.s.c.ZkTestServer start zk server on port:45081
   [junit4]   2> 279617 INFO  (TEST-SolrCloudExampleTest.testLoadDocsIntoGettingStartedCollection-seed#[F2489A32244E4281]) [    ] o.a.s.c.c.SolrZkClient Using default ZkCredentialsProvider
   [junit4]   2> 279617 INFO  (TEST-SolrCloudExampleTest.testLoadDocsIntoGettingStartedCollection-seed#[F2489A32244E4281]) [    ] o.a.s.c.c.ConnectionManager Waiting for client to connect to ZooKeeper
   [junit4]   2> 279619 INFO  (zkCallback-296-thread-1) [    ] o.a.s.c.c.ConnectionManager Watcher org.apache.solr.common.cloud.ConnectionManager@8462d8e name:ZooKeeperConnection Watcher:127.0.0.1:45081 got event WatchedEvent state:SyncConnected type:None path:null path:null type:None
   [junit4]   2> 279619 INFO  (TEST-SolrCloudExampleTest.testLoadDocsIntoGettingStartedCollection-seed#[F2489A32244E4281]) [    ] o.a.s.c.c.ConnectionManager Client is connected to ZooKeeper
   [junit4]   2> 279620 INFO  (TEST-SolrCloudExampleTest.testLoadDocsIntoGettingStartedCollection-seed#[F2489A32244E4281]) [    ] o.a.s.c.c.SolrZkClient Using default ZkACLProvider
   [junit4]   2> 279620 INFO  (TEST-SolrCloudExampleTest.testLoadDocsIntoGettingStartedCollection-seed#[F2489A32244E4281]) [    ] o.a.s.c.c.SolrZkClient makePath: /solr
   [junit4]   2> 279621 INFO  (TEST-SolrCloudExampleTest.testLoadDocsIntoGettingStartedCollection-seed#[F2489A32244E4281]) [    ] o.a.s.c.c.SolrZkClient Using default ZkCredentialsProvider
   [junit4]   2> 279622 INFO  (TEST-SolrCloudExampleTest.testLoadDocsIntoGettingStartedCollection-seed#[F2489A32244E4281]) [    ] o.a.s.c.c.ConnectionManager Waiting for client to connect to ZooKeeper
   [junit4]   2> 279623 INFO  (zkCallback-297-thread-1) [    ] o.a.s.c.c.ConnectionManager Watcher org.apache.solr.common.cloud.ConnectionManager@27bf3221 name:ZooKeeperConnection Watcher:127.0.0.1:45081/solr got event WatchedEvent state:SyncConnected type:None path:null path:null type:None
   [junit4]   2> 279623 INFO  (TEST-SolrCloudExampleTest.testLoadDocsIntoGettingStartedCollection-seed#[F2489A32244E4281]) [    ] o.a.s.c.c.ConnectionManager Client is connected to ZooKeeper
   [junit4]   2> 279623 INFO  (TEST-SolrCloudExampleTest.testLoadDocsIntoGettingStartedCollection-seed#[F2489A32244E4281]) [    ] o.a.s.c.c.SolrZkClient Using default ZkACLProvider
   [junit4]   2> 279623 INFO  (TEST-SolrCloudExampleTest.testLoadDocsIntoGettingStartedCollection-seed#[F2489A32244E4281]) [    ] o.a.s.c.c.SolrZkClient makePath: /collections/collection1
   [junit4]   2> 279624 INFO  (TEST-SolrCloudExampleTest.testLoadDocsIntoGettingStartedCollection-seed#[F2489A32244E4281]) [    ] o.a.s.c.c.SolrZkClient makePath: /collections/collection1/shards
   [junit4]   2> 279624 INFO  (TEST-SolrCloudExampleTest.testLoadDocsIntoGettingStartedCollection-seed#[F2489A32244E4281]) [    ] o.a.s.c.c.SolrZkClient makePath: /collections/control_collection
   [junit4]   2> 279624 INFO  (TEST-SolrCloudExampleTest.testLoadDocsIntoGettingStartedCollection-seed#[F2489A32244E4281]) [    ] o.a.s.c.c.SolrZkClient makePath: /collections/control_collection/shards
   [junit4]   2> 279625 INFO  (TEST-SolrCloudExampleTest.testLoadDocsIntoGettingStartedCollection-seed#[F2489A32244E4281]) [    ] o.a.s.c.AbstractZkTestCase put /home/jenkins/workspace/Lucene-Solr-5.x-Linux/solr/core/src/test-files/solr/collection1/conf/solrconfig-tlog.xml to /configs/conf1/solrconfig.xml
   [junit4]   2> 279625 INFO  (TEST-SolrCloudExampleTest.testLoadDocsIntoGettingStartedCollection-seed#[F2489A32244E4281]) [    ] o.a.s.c.c.SolrZkClient makePath: /configs/conf1/solrconfig.xml
   [junit4]   2> 279626 INFO  (TEST-SolrCloudExampleTest.testLoadDocsIntoGettingStartedCollection-seed#[F2489A32244E4281]) [    ] o.a.s.c.AbstractZkTestCase put /home/jenkins/workspace/Lucene-Solr-5.x-Linux/solr/core/src/test-files/solr/collection1/conf/schema.xml to /configs/conf1/schema.xml
   [junit4]   2> 279626 INFO  (TEST-SolrCloudExampleTest.testLoadDocsIntoGettingStartedCollection-seed#[F2489A32244E4281]) [    ] o.a.s.c.c.SolrZkClient makePath: /configs/conf1/schema.xml
   [junit4]   2> 279627 INFO  (TEST-SolrCloudExampleTest.testLoadDocsIntoGettingStartedCollection-seed#[F2489A32244E4281]) [    ] o.a.s.c.AbstractZkTestCase put /home/jenkins/workspace/Lucene-Solr-5.x-Linux/solr/core/src/test-files/solr/collection1/conf/solrconfig.snippet.randomindexconfig.xml to /configs/conf1/solrconfig.snippet.randomindexconfig.xml
   [junit4]   2> 279627 INFO  (TEST-SolrCloudExampleTest.testLoadDocsIntoGettingStartedCollection-seed#[F2489A32244E4281]) [    ] o.a.s.c.c.SolrZkClient makePath: /configs/conf1/solrconfig.snippet.randomindexconfig.xml
   [junit4]   2> 279627 INFO  (TEST-SolrCloudExampleTest.testLoadDocsIntoGettingStartedCollection-seed#[F2489A32244E4281]) [    ] o.a.s.c.AbstractZkTestCase put /home/jenkins/workspace/Lucene-Solr-5.x-Linux/solr/core/src/test-files/solr/collection1/conf/stopwords.txt to /configs/conf1/stopwords.txt
   [junit4]   2> 279627 INFO  (TEST-SolrCloudExampleTest.testLoadDocsIntoGettingStartedCollection-seed#[F2489A32244E4281]) [    ] o.a.s.c.c.SolrZkClient makePath: /configs/conf1/stopwords.txt
   [junit4]   2> 279628 INFO  (TEST-SolrCloudExampleTest.testLoadDocsIntoGettingStartedCollection-seed#[F2489A32244E4281]) [    ] o.a.s.c.AbstractZkTestCase put /home/jenkins/workspace/Lucene-Solr-5.x-Linux/solr/core/src/test-files/solr/collection1/conf/protwords.txt to /configs/conf1/protwords.txt
   [junit4]   2> 279628 INFO  (TEST-SolrCloudExampleTest.testLoadDocsIntoGettingStartedCollection-seed#[F2489A32244E4281]) [    ] o.a.s.c.c.SolrZkClient makePath: /configs/conf1/protwords.txt
   [junit4]   2> 279628 INFO  (TEST-SolrCloudExampleTest.testLoadDocsIntoGettingStartedCollection-seed#[F2489A32244E4281]) [    ] o.a.s.c.AbstractZkTestCase put /home/jenkins/workspace/Lucene-Solr-5.x-Linux/solr/core/src/test-files/solr/collection1/conf/currency.xml to /configs/conf1/currency.xml
   [junit4]   2> 279629 INFO  (TEST-SolrCloudExampleTest.testLoadDocsIntoGettingStartedCollection-seed#[F2489A32244E4281]) [    ] o.a.s.c.c.SolrZkClient makePath: /configs/conf1/currency.xml
   [junit4]   2> 279629 INFO  (TEST-SolrCloudExampleTest.testLoadDocsIntoGettingStartedCollection-seed#[F2489A32244E4281]) [    ] o.a.s.c.AbstractZkTestCase put /home/jenkins/workspace/Lucene-Solr-5.x-Linux/solr/core/src/test-files/solr/collection1/conf/enumsConfig.xml to /configs/conf1/enumsConfig.xml
   [junit4]   2> 279629 INFO  (TEST-SolrCloudExampleTest.testLoadDocsIntoGettingStartedCollection-seed#[F2489A32244E4281]) [    ] o.a.s.c.c.SolrZkClient makePath: /configs/conf1/enumsConfig.xml
   [junit4]   2> 279630 INFO  (TEST-SolrCloudExampleTest.testLoadDocsIntoGettingStartedCollection-seed#[F2489A32244E4281]) [    ] o.a.s.c.AbstractZkTestCase put /home/jenkins/workspace/Lucene-Solr-5.x-Linux/solr/core/src/test-files/solr/collection1/conf/open-exchange-rates.json to /configs/conf1/open-exchange-rates.json
   [junit4]   2> 279630 INFO  (TEST-SolrCloudExampleTest.testLoadDocsIntoGettingStartedCollection-seed#[F2489A32244E4281]) [    ] o.a.s.c.c.SolrZkClient makePath: /configs/conf1/open-exchange-rates.json
   [junit4]   2> 279630 INFO  (TEST-SolrCloudExampleTest.testLoadDocsIntoGettingStartedCollection-seed#[F2489A32244E4281]) [    ] o.a.s.c.AbstractZkTestCase put /home/jenkins/workspace/Lucene-Solr-5.x-Linux/solr/core/src/test-files/solr/collection1/conf/mapping-ISOLatin1Accent.txt to /configs/conf1/mapping-ISOLatin1Accent.txt
   [junit4]   2> 279630 INFO  (TEST-SolrCloudExampleTest.testLoadDocsIntoGettingStartedCollection-seed#[F2489A32244E4281]) [    ] o.a.s.c.c.SolrZkClient makePath: /configs/conf1/mapping-ISOLatin1Accent.txt
   [junit4]   2> 279631 INFO  (TEST-SolrCloudExampleTest.testLoadDocsIntoGettingStartedCollection-seed#[F2489A32244E4281]) [    ] o.a.s.c.AbstractZkTestCase put /home/jenkins/workspace/Lucene-Solr-5.x-Linux/solr/core/src/test-files/solr/collection1/conf/old_synonyms.txt to /configs/conf1/old_synonyms.txt
   [junit4]   2> 279631 INFO  (TEST-SolrCloudExampleTest.testLoadDocsIntoGettingStartedCollection-seed#[F2489A32244E4281]) [    ] o.a.s.c.c.SolrZkClient makePath: /configs/conf1/old_synonyms.txt
   [junit4]   2> 279632 INFO  (TEST-SolrCloudExampleTest.testLoadDocsIntoGettingStartedCollection-seed#[F2489A32244E4281]) [    ] o.a.s.c.AbstractZkTestCase put /home/jenkins/workspace/Lucene-Solr-5.x-Linux/solr/core/src/test-files/solr/collection1/conf/synonyms.txt to /configs/conf1/synonyms.txt
   [junit4]   2> 279632 INFO  (TEST-SolrCloudExampleTest.testLoadDocsIntoGettingStartedCollection-seed#[F2489A32244E4281]) [    ] o.a.s.c.c.SolrZkClient makePath: /configs/conf1/synonyms.txt
   [junit4]   2> 279702 INFO  (TEST-SolrCloudExampleTest.testLoadDocsIntoGettingStartedCollection-seed#[F2489A32244E4281]) [    ] o.a.s.SolrTestCaseJ4 Writing core.properties file to /home/jenkins/workspace/Lucene-Solr-5.x-Linux/solr/build/solr-core/test/J0/temp/solr.cloud.SolrCloudExampleTest_F2489A32244E4281-001/control-001/cores/collection1
   [junit4]   2> 279704 INFO  (TEST-SolrCloudExampleTest.testLoadDocsIntoGettingStartedCollection-seed#[F2489A32244E4281]) [    ] o.e.j.s.Server jetty-9.2.13.v20150730
   [junit4]   2> 279705 INFO  (TEST-SolrCloudExampleTest.testLoadDocsIntoGettingStartedCollection-seed#[F2489A32244E4281]) [    ] o.e.j.s.h.ContextHandler Started o.e.j.s.ServletContextHandler@4bfb514f{/,null,AVAILABLE}
   [junit4]   2> 279707 INFO  (TEST-SolrCloudExampleTest.testLoadDocsIntoGettingStartedCollection-seed#[F2489A32244E4281]) [    ] o.e.j.s.ServerConnector Started ServerConnector@5ae5b20{HTTP/1.1}{127.0.0.1:57678}
   [junit4]   2> 279707 INFO  (TEST-SolrCloudExampleTest.testLoadDocsIntoGettingStartedCollection-seed#[F2489A32244E4281]) [    ] o.e.j.s.Server Started @281767ms
   [junit4]   2> 279707 INFO  (TEST-SolrCloudExampleTest.testLoadDocsIntoGettingStartedCollection-seed#[F2489A32244E4281]) [    ] o.a.s.c.s.e.JettySolrRunner Jetty properties: {solr.data.dir=/home/jenkins/workspace/Lucene-Solr-5.x-Linux/solr/build/solr-core/test/J0/temp/solr.cloud.SolrCloudExampleTest_F2489A32244E4281-001/tempDir-001/control/data, hostContext=/, hostPort=57678, coreRootDirectory=/home/jenkins/workspace/Lucene-Solr-5.x-Linux/solr/build/solr-core/test/J0/temp/solr.cloud.SolrCloudExampleTest_F2489A32244E4281-001/control-001/cores}
   [junit4]   2> 279707 INFO  (TEST-SolrCloudExampleTest.testLoadDocsIntoGettingStartedCollection-seed#[F2489A32244E4281]) [    ] o.a.s.s.SolrDispatchFilter SolrDispatchFilter.init(): sun.misc.Launcher$AppClassLoader@4e0e2f2a
   [junit4]   2> 279708 INFO  (TEST-SolrCloudExampleTest.testLoadDocsIntoGettingStartedCollection-seed#[F2489A32244E4281]) [    ] o.a.s.c.SolrResourceLoader new SolrResourceLoader for directory: '/home/jenkins/workspace/Lucene-Solr-5.x-Linux/solr/build/solr-core/test/J0/temp/solr.cloud.SolrCloudExampleTest_F2489A32244E4281-001/control-001/'
   [junit4]   2> 279708 INFO  (TEST-SolrCloudExampleTest.testLoadDocsIntoGettingStartedCollection-seed#[F2489A32244E4281]) [    ] o.a.s.c.SolrResourceLoader JNDI not configured for solr (NoInitialContextEx)
   [junit4]   2> 279708 INFO  (TEST-SolrCloudExampleTest.testLoadDocsIntoGettingStartedCollection-seed#[F2489A32244E4281]) [    ] o.a.s.c.SolrResourceLoader solr home defaulted to 'solr/' (could not find system property or JNDI)
   [junit4]   2> 279724 INFO  (TEST-SolrCloudExampleTest.testLoadDocsIntoGettingStartedCollection-seed#[F2489A32244E4281]) [    ] o.a.s.c.c.SolrZkClient Using default ZkCredentialsProvider
   [junit4]   2> 279730 INFO  (TEST-SolrCloudExampleTest.testLoadDocsIntoGettingStartedCollection-seed#[F2489A32244E4281]) [    ] o.a.s.c.c.ConnectionManager Waiting for client to connect to ZooKeeper
   [junit4]   2> 279730 INFO  (zkCallback-298-thread-1) [    ] o.a.s.c.c.ConnectionManager Watcher org.apache.solr.common.cloud.ConnectionManager@39f613f6 name:ZooKeeperConnection Watcher:127.0.0.1:45081/solr got event WatchedEvent state:SyncConnected type:None path:null path:null type:None
   [junit4]   2> 279730 INFO  (TEST-SolrCloudExampleTest.testLoadDocsIntoGettingStartedCollection-seed#[F2489A32244E4281]) [    ] o.a.s.c.c.ConnectionManager Client is connected to ZooKeeper
   [junit4]   2> 279730 INFO  (TEST-SolrCloudExampleTest.testLoadDocsIntoGettingStartedCollection-seed#[F2489A32244E4281]) [    ] o.a.s.c.c.SolrZkClient Using default ZkACLProvider
   [junit4]   2> 279731 INFO  (TEST-SolrCloudExampleTest.testLoadDocsIntoGettingStartedCollection-seed#[F2489A32244E4281]) [    ] o.a.s.s.SolrDispatchFilter Loading solr.xml from SolrHome (not found in ZooKeeper)
   [junit4]   2> 279731 INFO  (TEST-SolrCloudExampleTest.testLoadDocsIntoGettingStartedCollection-seed#[F2489A32244E4281]) [    ] o.a.s.c.SolrXmlConfig Loading container configuration from /home/jenkins/workspace/Lucene-Solr-5.x-Linux/solr/build/solr-core/test/J0/temp/solr.cloud.SolrCloudExampleTest_F2489A32244E4281-001/control-001/solr.xml
   [junit4]   2> 279735 INFO  (TEST-SolrCloudExampleTest.testLoadDocsIntoGettingStartedCollection-seed#[F2489A32244E4281]) [    ] o.a.s.c.CoresLocator Config-defined core root directory: /home/jenkins/workspace/Lucene-Solr-5.x-Linux/solr/build/solr-core/test/J0/temp/solr.cloud.SolrCloudExampleTest_F2489A32244E4281-001/control-001/cores
   [junit4]   2> 279735 INFO  (TEST-SolrCloudExampleTest.testLoadDocsIntoGettingStartedCollection-seed#[F2489A32244E4281]) [    ] o.a.s.c.CoreContainer New CoreContainer 1713436205
   [junit4]   2> 279735 INFO  (TEST-SolrCloudExampleTest.testLoadDocsIntoGettingStartedCollection-seed#[F2489A32244E4281]) [    ] o.a.s.c.CoreContainer Loading cores into CoreContainer [instanceDir=/home/jenkins/workspace/Lucene-Solr-5.x-Linux/solr/build/solr-core/test/J0/temp/solr.cloud.SolrCloudExampleTest_F2489A32244E4281-001/control-001/]
   [junit4]   2> 279735 INFO  (TEST-SolrCloudExampleTest.testLoadDocsIntoGettingStartedCollection-seed#[F2489A32244E4281]) [    ] o.a.s.c.CoreContainer loading shared library: /home/jenkins/workspace/Lucene-Solr-5.x-Linux/solr/build/solr-core/test/J0/temp/solr.cloud.SolrCloudExampleTest_F2489A32244E4281-001/control-001/lib
   [junit4]   2> 279735 WARN  (TEST-SolrCloudExampleTest.testLoadDocsIntoGettingStartedCollection-seed#[F2489A32244E4281]) [    ] o.a.s.c.SolrResourceLoader Can't find (or read) directory to add to classloader: lib (resolved as: /home/jenkins/workspace/Lucene-Solr-5.x-Linux/solr/build/solr-core/test/J0/temp/solr.cloud.SolrCloudExampleTest_F2489A32244E4281-001/control-001/lib).
   [junit4]   2> 279740 INFO  (TEST-SolrCloudExampleTest.testLoadDocsIntoGettingStartedCollection-seed#[F2489A32244E4281]) [    ] o.a.s.h.c.HttpShardHandlerFactory created with socketTimeout : 90000,urlScheme : ,connTimeout : 15000,maxConnectionsPerHost : 20,maxConnections : 10000,corePoolSize : 0,maximumPoolSize : 2147483647,maxThreadIdleTime : 5,sizeOfQueue : -1,fairnessPolicy : false,useRetries : false,
   [junit4]   2> 279740 INFO  (TEST-SolrCloudExampleTest.testLoadDocsIntoGettingStartedCollection-seed#[F2489A32244E4281]) [    ] o.a.s.u.UpdateShardHandler Creating UpdateShardHandler HTTP client with params: socketTimeout=340000&connTimeout=45000&retry=true
   [junit4]   2> 279741 INFO  (TEST-SolrCloudExampleTest.testLoadDocsIntoGettingStartedCollection-seed#[F2489A32244E4281]) [    ] o.a.s.l.LogWatcher SLF4J impl is org.slf4j.impl.Log4jLoggerFactory
   [junit4]   2> 279741 INFO  (TEST-SolrCloudExampleTest.testLoadDocsIntoGettingStartedCollection-seed#[F2489A32244E4281]) [    ] o.a.s.l.LogWatcher Registering Log Listener [Log4j (org.slf4j.impl.Log4jLoggerFactory)]
   [junit4]   2> 279741 INFO  (TEST-SolrCloudExampleTest.testLoadDocsIntoGettingStartedCollection-seed#[F2489A32244E4281]) [    ] o.a.s.c.ZkContainer Zookeeper client=127.0.0.1:45081/solr
   [junit4]   2> 279741 INFO  (TEST-SolrCloudExampleTest.testLoadDocsIntoGettingStartedCollection-seed#[F2489A32244E4281]) [    ] o.a.s.c.ZkController zkHost includes chroot
   [junit4]   2> 279741 INFO  (TEST-SolrCloudExampleTest.testLoadDocsIntoGettingStartedCollection-seed#[F2489A32244E4281]) [    ] o.a.s.c.c.SolrZkClient Using default ZkCredentialsProvider
   [junit4]   2> 279742 INFO  (TEST-SolrCloudExampleTest.testLoadDocsIntoGettingStartedCollection-seed#[F2489A32244E4281]) [    ] o.a.s.c.c.ConnectionManager Waiting for client to connect to ZooKeeper
   [junit4]   2> 279743 INFO  (zkCallback-300-thread-1) [    ] o.a.s.c.c.ConnectionManager Watcher org.apache.solr.common.cloud.ConnectionManager@4f3c434b name:ZooKeeperConnection Watcher:127.0.0.1:45081 got event WatchedEvent state:SyncConnected type:None path:null path:null type:None
   [junit4]   2> 279743 INFO  (TEST-SolrCloudExampleTest.testLoadDocsIntoGettingStartedCollection-seed#[F2489A32244E4281]) [    ] o.a.s.c.c.ConnectionManager Client is connected to ZooKeeper
   [junit4]   2> 279743 INFO  (TEST-SolrCloudExampleTest.testLoadDocsIntoGettingStartedCollection-seed#[F2489A32244E4281]) [    ] o.a.s.c.c.SolrZkClient Using default ZkACLProvider
   [junit4]   2> 279745 INFO  (TEST-SolrCloudExampleTest.testLoadDocsIntoGettingStartedCollection-seed#[F2489A32244E4281]) [n:127.0.0.1:57678_    ] o.a.s.c.c.ConnectionManager Waiting for client to connect to ZooKeeper
   [junit4]   2> 279746 INFO  (zkCallback-301-thread-1-processing-n:127.0.0.1:57678_) [n:127.0.0.1:57678_    ] o.a.s.c.c.ConnectionManager Watcher org.apache.solr.common.cloud.ConnectionManager@5fc009ff name:ZooKeeperConnection Watcher:127.0.0.1:45081/solr got event WatchedEvent state:SyncConnected type:None path:null path:null type:None
   [junit4]   2> 279746 INFO  (TEST-SolrCloudExampleTest.testLoadDocsIntoGettingStartedCollection-seed#[F2489A32244E4281]) [n:127.0.0.1:57678_    ] o.a.s.c.c.ConnectionManager Client is connected to ZooKeeper
   [junit4]   2> 279746 INFO  (TEST-SolrCloudExampleTest.testLoadDocsIntoGettingStartedCollection-seed#[F2489A32244E4281]) [n:127.0.0.1:57678_    ] o.a.s.c.c.SolrZkClient makePath: /overseer/queue
   [junit4]   2> 279747 INFO  (TEST-SolrCloudExampleTest.testLoadDocsIntoGettingStartedCollection-seed#[F2489A32244E4281]) [n:127.0.0.1:57678_    ] o.a.s.c.c.SolrZkClient makePath: /overseer/collection-queue-work
   [junit4]   2> 279748 INFO  (TEST-SolrCloudExampleTest.testLoadDocsIntoGettingStartedCollection-seed#[F2489A32244E4281]) [n:127.0.0.1:57678_    ] o.a.s.c.c.SolrZkClient makePath: /overseer/collection-map-running
   [junit4]   2> 279749 INFO  (TEST-SolrCloudExampleTest.testLoadDocsIntoGettingStartedCollection-seed#[F2489A32244E4281]) [n:127.0.0.1:57678_    ] o.a.s.c.c.SolrZkClient makePath: /overseer/collection-map-completed
   [junit4]   2> 279750 INFO  (TEST-SolrCloudExampleTest.testLoadDocsIntoGettingStartedCollection-seed#[F2489A32244E4281]) [n:127.0.0.1:57678_    ] o.a.s.c.c.SolrZkClient makePath: /overseer/collection-map-failure
   [junit4]   2> 279751 INFO  (TEST-SolrCloudExampleTest.testLoadDocsIntoGettingStartedCollection-seed#[F2489A32244E4281]) [n:127.0.0.1:57678_    ] o.a.s.c.c.SolrZkClient makePath: /live_nodes
   [junit4]   2> 279751 INFO  (TEST-SolrCloudExampleTest.testLoadDocsIntoGettingStartedCollection-seed#[F2489A32244E4281]) [n:127.0.0.1:57678_    ] o.a.s.c.c.SolrZkClient makePath: /aliases.json
   [junit4]   2> 279751 INFO  (TEST-SolrCloudExampleTest.testLoadDocsIntoGettingStartedCollection-seed#[F2489A32244E4281]) [n:127.0.0.1:57678_    ] o.a.s.c.c.SolrZkClient makePath: /clusterstate.json
   [junit4]   2> 279752 INFO  (TEST-SolrCloudExampleTest.testLoadDocsIntoGettingStartedCollection-seed#[F2489A32244E4281]) [n:127.0.0.1:57678_    ] o.a.s.c.c.SolrZkClient makePath: /security.json
   [junit4]   2> 279752 INFO  (TEST-SolrCloudExampleTest.testLoadDocsIntoGettingStartedCollection-seed#[F2489A32244E4281]) [n:127.0.0.1:57678_    ] o.a.s.c.ZkController Register node as live in ZooKeeper:/live_nodes/127.0.0.1:57678_
   [junit4]   2> 279752 INFO  (TEST-SolrCloudExampleTest.testLoadDocsIntoGettingStartedCollection-seed#[F2489A32244E4281]) [n:127.0.0.1:57678_    ] o.a.s.c.c.SolrZkClient makePath: /live_nodes/127.0.0.1:57678_
   [junit4]   2> 279753 INFO  (TEST-SolrCloudExampleTest.testLoadDocsIntoGettingStartedCollection-seed#[F2489A32244E4281]) [n:127.0.0.1:57678_    ] o.a.s.c.c.SolrZkClient makePath: /overseer_elect
   [junit4]   2> 279754 INFO  (TEST-SolrCloudExampleTest.testLoadDocsIntoGettingStartedCollection-seed#[F2489A32244E4281]) [n:127.0.0.1:57678_    ] o.a.s.c.c.SolrZkClient makePath: /overseer_elect/election
   [junit4]   2> 279755 INFO  (TEST-SolrCloudExampleTest.testLoadDocsIntoGettingStartedCollection-seed#[F2489A32244E4281]) [n:127.0.0.1:57678_    ] o.a.s.c.Overseer Overseer (id=null) closing
   [junit4]   2> 279755 INFO  (TEST-SolrCloudExampleTest.testLoadDocsIntoGettingStartedCollection-seed#[F2489A32244E4281]) [n:127.0.0.1:57678_    ] o.a.s.c.LeaderElector Joined leadership election with path: /overseer_elect/election/94684743820902404-127.0.0.1:57678_-n_0000000000
   [junit4]   2> 279755 INFO  (TEST-SolrCloudExampleTest.testLoadDocsIntoGettingStartedCollection-seed#[F2489A32244E4281]) [n:127.0.0.1:57678_    ] o.a.s.c.OverseerElectionContext I am going to be the leader 127.0.0.1:57678_
   [junit4]   2> 279755 INFO  (TEST-SolrCloudExampleTest.testLoadDocsIntoGettingStartedCollection-seed#[F2489A32244E4281]) [n:127.0.0.1:57678_    ] o.a.s.c.c.SolrZkClient makePath: /overseer_elect/leader
   [junit4]   2> 279756 INFO  (TEST-SolrCloudExampleTest.testLoadDocsIntoGettingStartedCollection-seed#[F2489A32244E4281]) [n:127.0.0.1:57678_    ] o.a.s.c.Overseer Overseer (id=94684743820902404-127.0.0.1:57678_-n_0000000000) starting
   [junit4]   2> 279757 INFO  (TEST-SolrCloudExampleTest.testLoadDocsIntoGettingStartedCollection-seed#[F2489A32244E4281]) [n:127.0.0.1:57678_    ] o.a.s.c.c.SolrZkClient makePath: /overseer/queue-work
   [junit4]   2> 279759 INFO  (TEST-SolrCloudExampleTest.testLoadDocsIntoGettingStartedCollection-seed#[F2489A32244E4281]) [n:127.0.0.1:57678_    ] o.a.s.c.OverseerAutoReplicaFailoverThread Starting OverseerAutoReplicaFailoverThread autoReplicaFailoverWorkLoopDelay=10000 autoReplicaFailoverWaitAfterExpiration=30000 autoReplicaFailoverBadNodeExpiration=60000
   [junit4]   2> 279760 INFO  (OverseerStateUpdate-94684743820902404-127.0.0.1:57678_-n_0000000000) [n:127.0.0.1:57678_    ] o.a.s.c.Overseer Starting to work on the main queue
   [junit4]   2> 279760 INFO  (OverseerStateUpdate-94684743820902404-127.0.0.1:57678_-n_0000000000) [n:127.0.0.1:57678_    ] o.a.s.c.c.ZkStateReader Updating cluster state from ZooKeeper... 
   [junit4]   2> 279778 INFO  (TEST-SolrCloudExampleTest.testLoadDocsIntoGettingStartedCollection-seed#[F2489A32244E4281]) [n:127.0.0.1:57678_    ] o.a.s.c.c.ZkStateReader Updating cluster state from ZooKeeper... 
   [junit4]   2> 279778 INFO  (OverseerCollectionConfigSetProcessor-94684743820902404-127.0.0.1:57678_-n_0000000000) [n:127.0.0.1:57678_    ] o.a.s.c.OverseerTaskProcessor Process current queue of overseer operations
   [junit4]   2> 279792 INFO  (TEST-SolrCloudExampleTest.testLoadDocsIntoGettingStartedCollection-seed#[F2489A32244E4281]) [n:127.0.0.1:57678_    ] o.a.s.c.CoreContainer Security conf doesn't exist. Skipping setup for authorization module.
   [junit4]   2> 279792 INFO  (TEST-SolrCloudExampleTest.testLoadDocsIntoGettingStartedCollection-seed#[F2489A32244E4281]) [n:127.0.0.1:57678_    ] o.a.s.c.CoreContainer No authentication plugin used.
   [junit4]   2> 279792 INFO  (TEST-SolrCloudExampleTest.testLoadDocsIntoGettingStartedCollection-seed#[F2489A32244E4281]) [n:127.0.0.1:57678_    ] o.a.s.c.CoresLocator Looking for core definitions underneath /home/jenkins/workspace/Lucene-Solr-5.x-Linux/solr/build/solr-core/test/J0/temp/solr.cloud.SolrCloudExampleTest_F2489A32244E4281-001/control-001/cores
   [junit4]   2> 279793 INFO  (TEST-SolrCloudExampleTest.testLoadDocsIntoGettingStartedCollection-seed#[F2489A32244E4281]) [n:127.0.0.1:57678_    ] o.a.s.c.SolrCore Created CoreDescriptor: {name=collection1, config=solrconfig.xml, transient=false, schema=schema.xml, loadOnStartup=true, configSetProperties=configsetprops.json, instanceDir=/home/jenkins/workspace/Lucene-Solr-5.x-Linux/solr/build/solr-core/test/J0/temp/solr.cloud.SolrCloudExampleTest_F2489A32244E4281-001/control-001/cores/collection1, collection=control_collection, absoluteInstDir=/home/jenkins/workspace/Lucene-Solr-5.x-Linux/solr/build/solr-core/test/J0/temp/solr.cloud.SolrCloudExampleTest_F2489A32244E4281-001/control-001/cores/collection1/, coreNodeName=, dataDir=data/, shard=}
   [junit4]   2> 279793 INFO  (TEST-SolrCloudExampleTest.testLoadDocsIntoGettingStartedCollection-seed#[F2489A32244E4281]) [n:127.0.0.1:57678_    ] o.a.s.c.CoresLocator Found core collection1 in /home/jenkins/workspace/Lucene-Solr-5.x-Linux/solr/build/solr-core/test/J0/temp/solr.cloud.SolrCloudExampleTest_F2489A32244E4281-001/control-001/cores/collection1/
   [junit4]   2> 279793 INFO  (TEST-SolrCloudExampleTest.testLoadDocsIntoGettingStartedCollection-seed#[F2489A32244E4281]) [n:127.0.0.1:57678_    ] o.a.s.c.CoresLocator Found 1 core definitions
   [junit4]   2> 279794 INFO  (TEST-SolrCloudExampleTest.testLoadDocsIntoGettingStartedCollection-seed#[F2489A32244E4281]) [n:127.0.0.1:57678_    ] o.a.s.s.SolrDispatchFilter user.dir=/home/jenkins/workspace/Lucene-Solr-5.x-Linux/solr/build/solr-core/test/J0
   [junit4]   2> 279794 INFO  (TEST-SolrCloudExampleTest.testLoadDocsIntoGettingStartedCollection-seed#[F2489A32244E4281]) [n:127.0.0.1:57678_    ] o.a.s.s.SolrDispatchFilter SolrDispatchFilter.init() done
   [junit4]   2> 279794 INFO  (coreLoadExecutor-2079-thread-1-processing-n:127.0.0.1:57678_) [n:127.0.0.1:57678_ c:control_collection   x:collection1] o.a.s.c.ZkController publishing state=down
   [junit4]   2> 279794 INFO  (coreLoadExecutor-2079-thread-1-processing-n:127.0.0.1:57678_) [n:127.0.0.1:57678_ c:control_collection   x:collection1] o.a.s.c.ZkController numShards not found on descriptor - reading it from system property
   [junit4]   2> 279795 INFO  (OverseerStateUpdate-94684743820902404-127.0.0.1:57678_-n_0000000000) [n:127.0.0.1:57678_    ] o.a.s.c.Overseer processMessage: queueSize: 1, message = {
   [junit4]   2>   "core":"collection1",
   [junit4]   2>   "roles":null,
   [junit4]   2>   "base_url":"http://127.0.0.1:57678",
   [junit4]   2>   "node_name":"127.0.0.1:57678_",
   [junit4]   2>   "numShards":"1",
   [junit4]   2>   "state":"down",
   [junit4]   2>   "shard":null,
   [junit4]   2>   "collection":"control_collection",
   [junit4]   2>   "operation":"state"} current state version: 0
   [junit4]   2> 279795 INFO  (coreLoadExecutor-2079-thread-1-processing-n:127.0.0.1:57678_) [n:127.0.0.1:57678_ c:control_collection   x:collection1] o.a.s.c.ZkController look for our core node name
   [junit4]   2> 279795 INFO  (OverseerStateUpdate-94684743820902404-127.0.0.1:57678_-n_0000000000) [n:127.0.0.1:57678_    ] o.a.s.c.o.ReplicaMutator Update state numShards=1 message={
   [junit4]   2>   "core":"collection1",
   [junit4]   2>   "roles":null,
   [junit4]   2>   "base_url":"http://127.0.0.1:57678",
   [junit4]   2>   "node_name":"127.0.0.1:57678_",
   [junit4]   2>   "numShards":"1",
   [junit4]   2>   "state":"down",
   [junit4]   2>   "shard":null,
   [junit4]   2>   "collection":"control_collection",
   [junit4]   2>   "operation":"state"}
   [junit4]   2> 279795 INFO  (OverseerStateUpdate-94684743820902404-127.0.0.1:57678_-n_0000000000) [n:127.0.0.1:57678_    ] o.a.s.c.o.ClusterStateMutator building a new cName: control_collection
   [junit4]   2> 279795 INFO  (OverseerStateUpdate-94684743820902404-127.0.0.1:57678_-n_0000000000) [n:127.0.0.1:57678_    ] o.a.s.c.o.ReplicaMutator Assigning new node to shard shard=shard1
   [junit4]   2> 279796 INFO  (zkCallback-301-thread-1-processing-n:127.0.0.1:57678_) [n:127.0.0.1:57678_    ] o.a.s.c.c.ZkStateReader A cluster state change: WatchedEvent state:SyncConnected type:NodeDataChanged path:/clusterstate.json, has occurred - updating... (live nodes size: 1)
   [junit4]   2> 279796 INFO  (zkCallback-301-thread-2-processing-n:127.0.0.1:57678_) [n:127.0.0.1:57678_    ] o.a.s.c.c.ZkStateReader A cluster state change: WatchedEvent state:SyncConnected type:NodeDataChanged path:/clusterstate.json, has occurred - updating... (live nodes size: 1)
   [junit4]   2> 280795 INFO  (coreLoadExecutor-2079-thread-1-processing-n:127.0.0.1:57678_) [n:127.0.0.1:57678_ c:control_collection   x:collection1] o.a.s.c.ZkController waiting to find shard id in clusterstate for collection1
   [junit4]   2> 280795 INFO  (coreLoadExecutor-2079-thread-1-processing-n:127.0.0.1:57678_) [n:127.0.0.1:57678_ c:control_collection   x:collection1] o.a.s.c.ZkController Check for collection zkNode:control_collection
   [junit4]   2> 280795 INFO  (coreLoadExecutor-2079-thread-1-processing-n:127.0.0.1:57678_) [n:127.0.0.1:57678_ c:control_collection   x:collection1] o.a.s.c.ZkController Collection zkNode exists
   [junit4]   2> 280795 INFO  (coreLoadExecutor-2079-thread-1-processing-n:127.0.0.1:57678_) [n:127.0.0.1:57678_ c:control_collection   x:collection1] o.a.s.c.c.ZkStateReader Load collection config from:/collections/control_collection
   [junit4]   2> 280796 INFO  (coreLoadExecutor-2079-thread-1-processing-n:127.0.0.1:57678_) [n:127.0.0.1:57678_ c:control_collection   x:collection1] o.a.s.c.c.ZkStateReader path=/collections/control_collection configName=conf1 specified config exists in ZooKeeper
   [junit4]   2> 280796 INFO  (coreLoadExecutor-2079-thread-1-processing-n:127.0.0.1:57678_) [n:127.0.0.1:57678_ c:control_collection   x:collection1] o.a.s.c.SolrResourceLoader new SolrResourceLoader for directory: '/home/jenkins/workspace/Lucene-Solr-5.x-Linux/solr/build/solr-core/test/J0/temp/solr.cloud.SolrCloudExampleTest_F2489A32244E4281-001/control-001/cores/collection1/'
   [junit4]   2> 280796 INFO  (coreLoadExecutor-2079-thread-1-processing-n:127.0.0.1:57678_) [n:127.0.0.1:57678_ c:control_collection   x:collection1] o.a.s.c.SolrResourceLoader JNDI not configured for solr (NoInitialContextEx)
   [junit4]   2> 280796 INFO  (coreLoadExecutor-2079-thread-1-processing-n:127.0.0.1:57678_) [n:127.0.0.1:57678_ c:control_collection   x:collection1] o.a.s.c.SolrResourceLoader solr home defaulted to 'solr/' (could not find system property or JNDI)
   [junit4]   2> 280804 INFO  (coreLoadExecutor-2079-thread-1-processing-n:127.0.0.1:57678_) [n:127.0.0.1:57678_ c:control_collection   x:collection1] o.a.s.c.Config loaded config solrconfig.xml with version 0 
   [junit4]   2> 280807 INFO  (coreLoadExecutor-2079-thread-1-processing-n:127.0.0.1:57678_) [n:127.0.0.1:57678_ c:control_collection   x:collection1] o.a.s.c.SolrConfig current version of requestparams : -1
   [junit4]   2> 280810 INFO  (coreLoadExecutor-2079-thread-1-processing-n:127.0.0.1:57678_) [n:127.0.0.1:57678_ c:control_collection   x:collection1] o.a.s.c.SolrConfig Using Lucene MatchVersion: 5.4.0
   [junit4]   2> 280816 INFO  (coreLoadExecutor-2079-thread-1-processing-n:127.0.0.1:57678_) [n:127.0.0.1:57678_ c:control_collection   x:collection1] o.a.s.c.Config Loaded SolrConfig: solrconfig.xml
   [junit4]   2> 280817 INFO  (coreLoadExecutor-2079-thread-1-processing-n:127.0.0.1:57678_) [n:127.0.0.1:57678_ c:control_collection   x:collection1] o.a.s.s.IndexSchema Reading Solr Schema from /configs/conf1/schema.xml
   [junit4]   2> 280820 INFO  (coreLoadExecutor-2079-thread-1-processing-n:127.0.0.1:57678_) [n:127.0.0.1:57678_ c:control_collection   x:collection1] o.a.s.s.IndexSchema [collection1] Schema name=test
   [junit4]   2> 280891 INFO  (coreLoadExecutor-2079-thread-1-processing-n:127.0.0.1:57678_) [n:127.0.0.1:57678_ c:control_collection   x:collection1] o.a.s.s.OpenExchangeRatesOrgProvider Initialized with rates=open-exchange-rates.json, refreshInterval=1440.
   [junit4]   2> 280895 INFO  (coreLoadExecutor-2079-thread-1-processing-n:127.0.0.1:57678_) [n:127.0.0.1:57678_ c:control_collection   x:collection1] o.a.s.s.IndexSchema default search field in schema is text
   [junit4]   2> 280896 INFO  (coreLoadExecutor-2079-thread-1-processing-n:127.0.0.1:57678_) [n:127.0.0.1:57678_ c:control_collection   x:collection1] o.a.s.s.IndexSchema unique key field: id
   [junit4]   2> 280900 INFO  (coreLoadExecutor-2079-thread-1-processing-n:127.0.0.1:57678_) [n:127.0.0.1:57678_ c:control_collection   x:collection1] o.a.s.s.FileExchangeRateProvider Reloading exchange rates from file currency.xml
   [junit4]   2> 280902 INFO  (coreLoadExecutor-2079-thread-1-processing-n:127.0.0.1:57678_) [n:127.0.0.1:57678_ c:control_collection   x:collection1] o.a.s.s.FileExchangeRateProvider Reloading exchange rates from file currency.xml
   [junit4]   2> 280903 INFO  (coreLoadExecutor-2079-thread-1-processing-n:127.0.0.1:57678_) [n:127.0.0.1:57678_ c:control_collection   x:collection1] o.a.s.s.OpenExchangeRatesOrgProvider Reloading exchange rates from open-exchange-rates.json
   [junit4]   2> 280904 WARN  (coreLoadExecutor-2079-thread-1-processing-n:127.0.0.1:57678_) [n:127.0.0.1:57678_ c:control_collection   x:collection1] o.a.s.s.OpenExchangeRatesOrgProvider Unknown key IMPORTANT NOTE
   [junit4]   2> 280904 WARN  (coreLoadExecutor-2079-thread-1-processing-n:127.0.0.1:57678_) [n:127.0.0.1:57678_ c:control_collection   x:collection1] o.a.s.s.OpenExchangeRatesOrgProvider Expected key, got STRING
   [junit4]   2> 280904 INFO  (coreLoadExecutor-2079-thread-1-processing-n:127.0.0.1:57678_) [n:127.0.0.1:57678_ c:control_collection   x:collection1] o.a.s.s.OpenExchangeRatesOrgProvider Reloading exchange rates from open-exchange-rates.json
   [junit4]   2> 280906 WARN  (coreLoadExecutor-2079-thread-1-processing-n:127.0.0.1:57678_) [n:127.0.0.1:57678_ c:control_collection   x:collection1] o.a.s.s.OpenExchangeRatesOrgProvider Unknown key IMPORTANT NOTE
   [junit4]   2> 280906 WARN  (coreLoadExecutor-2079-thread-1-processing-n:127.0.0.1:57678_) [n:127.0.0.1:57678_ c:control_collection   x:collection1] o.a.s.s.OpenExchangeRatesOrgProvider Expected key, got STRING
   [junit4]   2> 280907 INFO  (coreLoadExecutor-2079-thread-1-processing-n:127.0.0.1:57678_) [n:127.0.0.1:57678_ c:control_collection   x:collection1] o.a.s.c.ConfigSetProperties Did not find ConfigSet properties, assuming default properties: Can't find resource 'configsetprops.json' in classpath or '/configs/conf1', cwd=/home/jenkins/workspace/Lucene-Solr-5.x-Linux/solr/build/solr-core/test/J0
   [junit4]   2> 280907 INFO  (coreLoadExecutor-2079-thread-1-processing-n:127.0.0.1:57678_) [n:127.0.0.1:57678_ c:control_collection   x:collection1] o.a.s.c.CoreContainer Creating SolrCore 'collection1' using configuration from collection control_collection
   [junit4]   2> 280907 INFO  (coreLoadExecutor-2079-thread-1-processing-n:127.0.0.1:57678_) [n:127.0.0.1:57678_ c:control_collection s:shard1 r:core_node1 x:collection1] o.a.s.c.SolrCore org.apache.solr.core.MockDirectoryFactory
   [junit4]   2> 280907 INFO  (coreLoadExecutor-2079-thread-1-processing-n:127.0.0.1:57678_) [n:127.0.0.1:57678_ c:control_collection s:shard1 r:core_node1 x:collection1] o.a.s.c.SolrCore [[collection1] ] Opening new SolrCore at [/home/jenkins/workspace/Lucene-Solr-5.x-Linux/solr/build/solr-core/test/J0/temp/solr.cloud.SolrCloudExampleTest_F2489A32244E4281-001/control-001/cores/collection1/], dataDir=[null]
   [junit4]   2> 280907 INFO  (coreLoadExecutor-2079-thread-1-processing-n:127.0.0.1:57678_) [n:127.0.0.1:57678_ c:control_collection s:shard1 r:core_node1 x:collection1] o.a.s.c.JmxMonitoredMap JMX monitoring is enabled. Adding Solr mbeans to JMX Server: com.sun.jmx.mbeanserver.JmxMBeanServer@2b3daf63
   [junit4]   2> 280908 INFO  (coreLoadExecutor-2079-thread-1-processing-n:127.0.0.1:57678_) [n:127.0.0.1:57678_ c:control_collection s:shard1 r:core_node1 x:collection1] o.a.s.c.CachingDirectoryFactory return new directory for /home/jenkins/workspace/Lucene-Solr-5.x-Linux/solr/build/solr-core/test/J0/temp/solr.cloud.SolrCloudExampleTest_F2489A32244E4281-001/control-001/cores/collection1/data
   [junit4]   2> 280908 INFO  (coreLoadExecutor-2079-thread-1-processing-n:127.0.0.1:57678_) [n:127.0.0.1:57678_ c:control_collection s:shard1 r:core_node1 x:collection1] o.a.s.c.SolrCore New index directory detected: old=null new=/home/jenkins/workspace/Lucene-Solr-5.x-Linux/solr/build/solr-core/test/J0/temp/solr.cloud.SolrCloudExampleTest_F2489A32244E4281-001/control-001/cores/collection1/data/index/
   [junit4]   2> 280908 WARN  (coreLoadExecutor-2079-thread-1-processing-n:127.0.0.1:57678_) [n:127.0.0.1:57678_ c:control_collection s:shard1 r:core_node1 x:collection1] o.a.s.c.SolrCore [collection1] Solr index directory '/home/jenkins/workspace/Lucene-Solr-5.x-Linux/solr/build/solr-core/test/J0/temp/solr.cloud.SolrCloudExampleTest_F2489A32244E4281-001/control-001/cores/collection1/data/index' doesn't exist. Creating new index...
   [junit4]   2> 280908 INFO  (coreLoadExecutor-2079-thread-1-processing-n:127.0.0.1:57678_) [n:127.0.0.1:57678_ c:control_collection s:shard1 r:core_node1 x:collection1] o.a.s.c.CachingDirectoryFactory return new directory for /home/jenkins/workspace/Lucene-Solr-5.x-Linux/solr/build/solr-core/test/J0/temp/solr.cloud.SolrCloudExampleTest_F2489A32244E4281-001/control-001/cores/collection1/data/index
   [junit4]   2> 280908 INFO  (coreLoadExecutor-2079-thread-1-processing-n:127.0.0.1:57678_) [n:127.0.0.1:57678_ c:control_collection s:shard1 r:core_node1 x:collection1] o.a.s.u.RandomMergePolicy RandomMergePolicy wrapping class org.apache.lucene.index.TieredMergePolicy: [TieredMergePolicy: maxMergeAtOnce=34, maxMergeAtOnceExplicit=38, maxMergedSegmentMB=74.525390625, floorSegmentMB=2.0009765625, forceMergeDeletesPctAllowed=12.416682718231083, segmentsPerTier=40.0, maxCFSSegmentSizeMB=8.796093022207999E12, noCFSRatio=1.0
   [junit4]   2> 280908 INFO  (coreLoadExecutor-2079-thread-1-processing-n:127.0.0.1:57678_) [n:127.0.0.1:57678_ c:control_collection s:shard1 r:core_node1 x:collection1] o.a.s.c.SolrCore SolrDeletionPolicy.onCommit: commits: num=1
   [junit4]   2> 	commit{dir=MockDirectoryWrapper(RAMDirectory@ccb06c2 lockFactory=org.apache.lucene.store.SingleInstanceLockFactory@164ae30e),segFN=segments_1,generation=1}
   [junit4]   2> 280908 INFO  (coreLoadExecutor-2079-thread-1-processing-n:127.0.0.1:57678_) [n:127.0.0.1:57678_ c:control_collection s:shard1 r:core_node1 x:collection1] o.a.s.c.SolrCore newest commit generation = 1
   [junit4]   2> 280909 INFO  (OldIndexDirectoryCleanupThreadForCore-collection1) [n:127.0.0.1:57678_ c:control_collection s:shard1 r:core_node1 x:collection1] o.a.s.c.SolrCore Looking for old index directories to cleanup for core collection1 in /home/jenkins/workspace/Lucene-Solr-5.x-Linux/solr/build/solr-core/test/J0/temp/solr.cloud.SolrCloudExampleTest_F2489A32244E4281-001/control-001/cores/collection1/data/
   [junit4]   2> 280909 WARN  (OldIndexDirectoryCleanupThreadForCore-collection1) [n:127.0.0.1:57678_ c:control_collection s:shard1 r:core_node1 x:collection1] o.a.s.c.DirectoryFactory /home/jenkins/workspace/Lucene-Solr-5.x-Linux/solr/build/solr-core/test/J0/temp/solr.cloud.SolrCloudExampleTest_F2489A32244E4281-001/control-001/cores/collection1/data/ does not point to a valid data directory; skipping clean-up of old index directories.
   [junit4]   2> 280911 INFO  (coreLoadExecutor-2079-thread-1-processing-n:127.0.0.1:57678_) [n:127.0.0.1:57678_ c:control_collection s:shard1 r:core_node1 x:collection1] o.a.s.u.p.UpdateRequestProcessorChain creating updateRequestProcessorChain "nodistrib"
   [junit4]   2> 280911 INFO  (coreLoadExecutor-2079-thread-1-processing-n:127.0.0.1:57678_) [n:127.0.0.1:57678_ c:control_collection s:shard1 r:core_node1 x:collection1] o.a.s.u.p.UpdateRequestProcessorChain creating updateRequestProcessorChain "dedupe"
   [junit4]   2> 280911 INFO  (coreLoadExecutor-2079-thread-1-processing-n:127.0.0.1:57678_) [n:127.0.0.1:57678_ c:control_collection s:shard1 r:core_node1 x:collection1] o.a.s.u.p.UpdateRequestProcessorChain inserting DistributedUpdateProcessorFactory into updateRequestProcessorChain "dedupe"
   [junit4]   2> 280911 INFO  (coreLoadExecutor-2079-thread-1-processing-n:127.0.0.1:57678_) [n:127.0.0.1:57678_ c:control_collection s:shard1 r:core_node1 x:collection1] o.a.s.u.p.UpdateRequestProcessorChain creating updateRequestProcessorChain "stored_sig"
   [junit4]   2> 280911 INFO  (coreLoadExecutor-2079-thread-1-processing-n:127.0.0.1:57678_) [n:127.0.0.1:57678_ c:control_collection s:shard1 r:core_node1 x:collection1] o.a.s.u.p.UpdateRequestProcessorChain inserting DistributedUpdateProcessorFactory into updateRequestProcessorChain "stored_sig"
   [junit4]   2> 280911 INFO  (coreLoadExecutor-2079-thread-1-processing-n:127.0.0.1:57678_) [n:127.0.0.1:57678_ c:control_collection s:shard1 r:core_node1 x:collection1] o.a.s.u.p.UpdateRequestProcessorChain creating updateRequestProcessorChain "distrib-dup-test-chain-explicit"
   [junit4]   2> 280911 INFO  (coreLoadExecutor-2079-thread-1-processing-n:127.0.0.1:57678_) [n:127.0.0.1:57678_ c:control_collection s:shard1 r:core_node1 x:collection1] o.a.s.u.p.UpdateRequestProcessorChain creating updateRequestProcessorChain "distrib-dup-test-chain-implicit"
   [junit4]   2> 280911 INFO  (coreLoadExecutor-2079-thread-1-processing-n:127.0.0.1:57678_) [n:127.0.0.1:57678_ c:control_collection s:shard1 r:core_node1 x:collection1] o.a.s.u.p.UpdateRequestProcessorChain inserting DistributedUpdateProcessorFactory into updateRequestProcessorChain "distrib-dup-test-chain-implicit"
   [junit4]   2> 280911 INFO  (coreLoadExecutor-2079-thread-1-processing-n:127.0.0.1:57678_) [n:127.0.0.1:57678_ c:control_collection s:shard1 r:core_node1 x:collection1] o.a.s.c.SolrCore no updateRequestProcessorChain defined as default, creating implicit default
   [junit4]   2> 280913 INFO  (coreLoadExecutor-2079-thread-1-processing-n:127.0.0.1:57678_) [n:127.0.0.1:57678_ c:control_collection s:shard1 r:core_node1 x:collection1] o.a.s.h.l.XMLLoader xsltCacheLifetimeSeconds=60
   [junit4]   2> 280913 INFO  (coreLoadExecutor-2079-thread-1-processing-n:127.0.0.1:57678_) [n:127.0.0.1:57678_ c:control_collection s:shard1 r:core_node1 x:collection1] o.a.s.h.l.XMLLoader xsltCacheLifetimeSeconds=60
   [junit4]   2> 280914 INFO  (coreLoadExecutor-2079-thread-1-processing-n:127.0.0.1:57678_) [n:127.0.0.1:57678_ c:control_collection s:shard1 r:core_node1 x:collection1] o.a.s.h.l.XMLLoader xsltCacheLifetimeSeconds=60
   [junit4]   2> 280914 INFO  (coreLoadExecutor-2079-thread-1-processing-n:127.0.0.1:57678_) [n:127.0.0.1:57678_ c:control_collection s:shard1 r:core_node1 x:collection1] o.a.s.h.l.XMLLoader xsltCacheLifetimeSeconds=60
   [junit4]   2> 280916 INFO  (coreLoadExecutor-2079-thread-1-processing-n:127.0.0.1:57678_) [n:127.0.0.1:57678_ c:control_collection s:shard1 r:core_node1 x:collection1] o.a.s.c.RequestHandlers Registered paths: /admin/mbeans,standard,/update/csv,/update/json/docs,/admin/luke,/admin/segments,/get,/admin/system,/replication,/admin/properties,/config,/schema,/admin/plugins,/admin/logging,/update/json,/admin/threads,/admin/ping,/update,/admin/file
   [junit4]   2> 280916 INFO  (coreLoadExecutor-2079-thread-1-processing-n:127.0.0.1:57678_) [n:127.0.0.1:57678_ c:control_collection s:shard1 r:core_node1 x:collection1] o.a.s.c.SolrCore Using default statsCache cache: org.apache.solr.search.stats.LocalStatsCache
   [junit4]   2> 280917 INFO  (coreLoadExecutor-2079-thread-1-processing-n:127.0.0.1:57678_) [n:127.0.0.1:57678_ c:control_collection s:shard1 r:core_node1 x:collection1] o.a.s.u.UpdateHandler Using UpdateLog implementation: org.apache.solr.update.UpdateLog
   [junit4]   2> 280917 INFO  (coreLoadExecutor-2079-thread-1-processing-n:127.0.0.1:57678_) [n:127.0.0.1:57678_ c:control_collection s:shard1 r:core_node1 x:collection1] o.a.s.u.UpdateLog Initializing UpdateLog: dataDir= defaultSyncLevel=FLUSH numRecordsToKeep=100 maxNumLogsToKeep=10 numVersionBuckets=65536
   [junit4]   2> 280918 INFO  (coreLoadExecutor-2079-thread-1-processing-n:127.0.0.1:57678_) [n:127.0.0.1:57678_ c:control_collection s:shard1 r:core_node1 x:collection1] o.a.s.c.SolrCore Hard AutoCommit: disabled
   [junit4]   2> 280918 INFO  (coreLoadExecutor-2079-thread-1-processing-n:127.0.0.1:57678_) [n:127.0.0.1:57678_ c:control_collection s:shard1 r:core_node1 x:collection1] o.a.s.c.SolrCore Soft AutoCommit: disabled
   [junit4]   2> 280918 INFO  (coreLoadExecutor-2079-thread-1-processing-n:127.0.0.1:57678_) [n:127.0.0.1:57678_ c:control_collection s:shard1 r:core_node1 x:collection1] o.a.s.u.RandomMergePolicy RandomMergePolicy wrapping class org.apache.lucene.index.TieredMergePolicy: [TieredMergePolicy: maxMergeAtOnce=24, maxMergeAtOnceExplicit=41, maxMergedSegmentMB=49.8974609375, floorSegmentMB=1.408203125, forceMergeDeletesPctAllowed=6.861635089071313, segmentsPerTier=20.0, maxCFSSegmentSizeMB=8.796093022207999E12, noCFSRatio=0.8784312848856685
   [junit4]   2> 280918 INFO  (coreLoadExecutor-2079-thread-1-processing-n:127.0.0.1:57678_) [n:127.0.0.1:57678_ c:control_collection s:shard1 r:core_node1 x:collection1] o.a.s.c.SolrCore SolrDeletionPolicy.onInit: commits: num=1
   [junit4]   2> 	commit{dir=MockDirectoryWrapper(RAMDirectory@ccb06c2 lockFactory=org.apache.lucene.store.SingleInstanceLockFactory@164ae30e),segFN=segments_1,generation=1}
   [junit4]   2> 280918 INFO  (coreLoadExecutor-2079-thread-1-processing-n:127.0.0.1:57678_) [n:127.0.0.1:57678_ c:control_collection s:shard1 r:core_node1 x:collection1] o.a.s.c.SolrCore newest commit generation = 1
   [junit4]   2> 280918 INFO  (coreLoadExecutor-2079-thread-1-processing-n:127.0.0.1:57678_) [n:127.0.0.1:57678_ c:control_collection s:shard1 r:core_node1 x:collection1] o.a.s.s.SolrIndexSearcher Opening Searcher@5000a942[collection1] main
   [junit4]   2> 280919 INFO  (coreLoadExecutor-2079-thread-1-processing-n:127.0.0.1:57678_) [n:127.0.0.1:57678_ c:control_collection s:shard1 r:core_node1 x:collection1] o.a.s.c.c.ZkStateReader Load collection config from:/collections/control_collection
   [junit4]   2> 280919 INFO  (coreLoadExecutor-2079-thread-1-processing-n:127.0.0.1:57678_) [n:127.0.0.1:57678_ c:control_collection s:shard1 r:core_node1 x:collection1] o.a.s.c.c.ZkStateReader path=/collections/control_collection configName=conf1 specified config exists in ZooKeeper
   [junit4]   2> 280919 INFO  (coreLoadExecutor-2079-thread-1-processing-n:127.0.0.1:57678_) [n:127.0.0.1:57678_ c:control_collection s:shard1 r:core_node1 x:collection1] o.a.s.r.ManagedResourceStorage Setting up ZooKeeper-based storage for the RestManager with znodeBase: /configs/conf1
   [junit4]   2> 280919 INFO  (coreLoadExecutor-2079-thread-1-processing-n:127.0.0.1:57678_) [n:127.0.0.1:57678_ c:control_collection s:shard1 r:core_node1 x:collection1] o.a.s.r.ManagedResourceStorage Configured ZooKeeperStorageIO with znodeBase: /configs/conf1
   [junit4]   2> 280919 INFO  (coreLoadExecutor-2079-thread-1-processing-n:127.0.0.1:57678_) [n:127.0.0.1:57678_ c:control_collection s:shard1 r:core_node1 x:collection1] o.a.s.r.RestManager Initializing RestManager with initArgs: {}
   [junit4]   2> 280919 INFO  (coreLoadExecutor-2079-thread-1-processing-n:127.0.0.1:57678_) [n:127.0.0.1:57678_ c:control_collection s:shard1 r:core_node1 x:collection1] o.a.s.r.ManagedResourceStorage Reading _rest_managed.json using ZooKeeperStorageIO:path=/configs/conf1
   [junit4]   2> 280919 INFO  (coreLoadExecutor-2079-thread-1-processing-n:127.0.0.1:57678_) [n:127.0.0.1:57678_ c:control_collection s:shard1 r:core_node1 x:collection1] o.a.s.r.ManagedResourceStorage No data found for znode /configs/conf1/_rest_managed.json
   [junit4]   2> 280919 INFO  (coreLoadExecutor-2079-thread-1-processing-n:127.0.0.1:57678_) [n:127.0.0.1:57678_ c:control_collection s:shard1 r:core_node1 x:collection1] o.a.s.r.ManagedResourceStorage Loaded null at path _rest_managed.json using ZooKeeperStorageIO:path=/configs/conf1
   [junit4]   2> 280919 INFO  (coreLoadExecutor-2079-thread-1-processing-n:127.0.0.1:57678_) [n:127.0.0.1:57678_ c:control_collection s:shard1 r:core_node1 x:collection1] o.a.s.r.RestManager Initializing 0 registered ManagedResources
   [junit4]   2> 280920 INFO  (coreLoadExecutor-2079-thread-1-processing-n:127.0.0.1:57678_) [n:127.0.0.1:57678_ c:control_collection s:shard1 r:core_node1 x:collection1] o.a.s.h.ReplicationHandler Commits will be reserved for  10000
   [junit4]   2> 280920 INFO  (searcherExecutor-2080-thread-1-processing-n:127.0.0.1:57678_ x:collection1 s:shard1 c:control_collection r:core_node1) [n:127.0.0.1:57678_ c:control_collection s:shard1 r:core_node1 x:collection1] o.a.s.c.SolrCore [collection1] Registered new searcher Searcher@5000a942[collection1] main{ExitableDirectoryReader(UninvertingDirectoryReader())}
   [junit4]   2> 280920 INFO  (coreLoadExecutor-2079-thread-1-processing-n:127.0.0.1:57678_) [n:127.0.0.1:57678_ c:control_collection s:shard1 r:core_node1 x:collection1] o.a.s.u.UpdateLog Looking up max value of version field to seed version buckets
   [junit4]   2> 280920 INFO  (coreLoadExecutor-2079-thread-1-processing-n:127.0.0.1:57678_) [n:127.0.0.1:57678_ c:control_collection s:shard1 r:core_node1 x:collection1] o.a.s.u.VersionInfo Refreshing highest value of _version_ for 65536 version buckets from index
   [junit4]   2> 280920 INFO  (coreLoadExecutor-2079-thread-1-processing-n:127.0.0.1:57678_) [n:127.0.0.1:57678_ c:control_collection s:shard1 r:core_node1 x:collection1] o.a.s.u.VersionInfo No terms found for _version_, cannot seed version bucket highest value from index
   [junit4]   2> 280920 INFO  (coreLoadExecutor-2079-thread-1-processing-n:127.0.0.1:57678_) [n:127.0.0.1:57678_ c:control_collection s:shard1 r:core_node1 x:collection1] o.a.s.u.UpdateLog Could not find max version in index or recent updates, using new clock 1514955902603493376
   [junit4]   2> 280922 INFO  (coreLoadExecutor-2079-thread-1-processing-n:127.0.0.1:57678_) [n:127.0.0.1:57678_ c:control_collection s:shard1 r:core_node1 x:collection1] o.a.s.u.UpdateLog Took 1.0ms to seed version buckets with highest version 1514955902603493376
   [junit4]   2> 280922 INFO  (coreLoadExecutor-2079-thread-1-processing-n:127.0.0.1:57678_) [n:127.0.0.1:57678_ c:control_collection s:shard1 r:core_node1 x:collection1] o.a.s.c.ZkController watch zkdir /configs/conf1
   [junit4]   2> 280922 INFO  (coreLoadExecutor-2079-thread-1-processing-n:127.0.0.1:57678_) [n:127.0.0.1:57678_ c:control_collection s:shard1 r:core_node1 x:collection1] o.a.s.c.CoreContainer registering core: collection1
   [junit4]   2> 280922 INFO  (coreZkRegister-2073-thread-1-processing-n:127.0.0.1:57678_ x:collection1 s:shard1 c:control_collection r:core_node1) [n:127.0.0.1:57678_ c:control_collection s:shard1 r:core_node1 x:collection1] o.a.s.c.ZkController Register replica - core:collection1 address:http://127.0.0.1:57678 collection:control_collection shard:shard1
   [junit4]   2> 280923 INFO  (coreZkRegister-2073-thread-1-processing-n:127.0.0.1:57678_ x:collection1 s:shard1 c:control_collection r:core_node1) [n:127.0.0.1:57678_ c:control_collection s:shard1 r:core_node1 x:collection1] o.a.s.c.c.SolrZkClient makePath: /collections/control_collection/leader_elect/shard1/election
   [junit4]   2> 280924 INFO  (coreZkRegister-2073-thread-1-processing-n:127.0.0.1:57678_ x:collection1 s:shard1 c:control_collection r:core_node1) [n:127.0.0.1:57678_ c:control_collection s:shard1 r:core_node1 x:collection1] o.a.s.c.LeaderElector Joined leadership election with path: /collections/control_collection/leader_elect/shard1/election/94684743820902404-core_node1-n_0000000000
   [junit4]   2> 280924 INFO  (coreZkRegister-2073-thread-1-processing-n:127.0.0.1:57678_ x:collection1 s:shard1 c:control_collection r:core_node1) [n:127.0.0.1:57678_ c:control_collection s:shard1 r:core_node1 x:collection1] o.a.s.c.ShardLeaderElectionContext Running the leader process for shard shard1
   [junit4]   2> 280925 INFO  (coreZkRegister-2073-thread-1-processing-n:127.0.0.1:57678_ x:collection1 s:shard1 c:control_collection r:core_node1) [n:127.0.0.1:57678_ c:control_collection s:shard1 r:core_node1 x:collection1] o.a.s.c.ShardLeaderElectionContext Enough replicas found to continue.
   [junit4]   2> 280925 INFO  (coreZkRegister-2073-thread-1-processing-n:127.0.0.1:57678_ x:collection1 s:shard1 c:control_collection r:core_node1) [n:127.0.0.1:57678_ c:control_collection s:shard1 r:core_node1 x:collection1] o.a.s.c.ShardLeaderElectionContext I may be the new leader - try and sync
   [junit4]   2> 280925 INFO  (coreZkRegister-2073-thread-1-processing-n:127.0.0.1:57678_ x:collection1 s:shard1 c:control_collection r:core_node1) [n:127.0.0.1:57678_ c:control_collection s:shard1 r:core_node1 x:collection1] o.a.s.c.SyncStrategy Sync replicas to http://127.0.0.1:57678/collection1/
   [junit4]   2> 280925 INFO  (coreZkRegister-2073-thread-1-processing-n:127.0.0.1:57678_ x:collection1 s:shard1 c:control_collection r:core_node1) [n:127.0.0.1:57678_ c:control_collection s:shard1 r:core_node1 x:collection1] o.a.s.c.SyncStrategy Sync Success - now sync replicas to me
   [junit4]   2> 280925 INFO  (coreZkRegister-2073-thread-1-processing-n:127.0.0.1:57678_ x:collection1 s:shard1 c:control_collection r:core_node1) [n:127.0.0.1:57678_ c:control_collection s:shard1 r:core_node1 x:collection1] o.a.s.c.SyncStrategy http://127.0.0.1:57678/collection1/ has no replicas
   [junit4]   2> 280925 INFO  (coreZkRegister-2073-thread-1-processing-n:127.0.0.1:57678_ x:collection1 s:shard1 c:control_collection r:core_node1) [n:127.0.0.1:57678_ c:control_collection s:shard1 r:core_node1 x:collection1] o.a.s.c.ShardLeaderElectionContext I am the new leader: http://127.0.0.1:57678/collection1/ shard1
   [junit4]   2> 280925 INFO  (OverseerStateUpdate-94684743820902404-127.0.0.1:57678_-n_0000000000) [n:127.0.0.1:57678_    ] o.a.s.c.Overseer processMessage: queueSize: 1, message = {
   [junit4]   2>   "operation":"leader",
   [junit4]   2>   "shard":"shard1",
   [junit4]   2>   "collection":"control_collection"} current state version: 1
   [junit4]   2> 280925 INFO  (coreZkRegister-2073-thread-1-processing-n:127.0.0.1:57678_ x:collection1 s:shard1 c:control_collection r:core_node1) [n:127.0.0.1:57678_ c:control_collection s:shard1 r:core_node1 x:collection1] o.a.s.c.c.SolrZkClient makePath: /collections/control_collection/leaders/shard1
   [junit4]   2> 280926 INFO  (coreZkRegister-2073-thread-1-processing-n:127.0.0.1:57678_ x:collection1 s:shard1 c:control_collection r:core_node1) [n:127.0.0.1:57678_ c:control_collection s:shard1 r:core_node1 x:collection1] o.a.s.c.ShardLeaderElectionContextBase Creating leader registration node
   [junit4]   2> 280927 INFO  (OverseerStateUpdate-94684743820902404-127.0.0.1:57678_-n_0000000000) [n:127.0.0.1:57678_    ] o.a.s.c.Overseer processMessage: queueSize: 1, message = {
   [junit4]   2>   "operation":"leader",
   [junit4]   2>   "shard":"shard1",
   [junit4]   2>   "collection":"control_collection",
   [junit4]   2>   "base_url":"http://127.0.0.1:57678",
   [junit4]   2>   "core":"collection1",
   [junit4]   2>   "state":"active"} current state version: 1
   [junit4]   2> 281028 INFO  (zkCallback-301-thread-2-processing-n:127.0.0.1:57678_) [n:127.0.0.1:57678_    ] o.a.s.c.c.ZkStateReader A cluster state change: WatchedEvent state:SyncConnected type:NodeDataChanged path:/clusterstate.json, has occurred - updating... (live nodes size: 1)
   [junit4]   2> 281028 INFO  (zkCallback-301-thread-1-processing-n:127.0.0.1:57678_) [n:127.0.0.1:57678_    ] o.a.s.c.c.ZkStateReader A cluster state change: WatchedEvent state:SyncConnected type:NodeDataChanged path:/clusterstate.json, has occurred - updating... (live nodes size: 1)
   [junit4]   2> 281077 INFO  (coreZkRegister-2073-thread-1-processing-n:127.0.0.1:57678_ x:collection1 s:shard1 c:control_collection r:core_node1) [n:127.0.0.1:57678_ c:control_collection s:shard1 r:core_node1 x:collection1] o.a.s.c.ZkController We are http://127.0.0.1:57678/collection1/ and leader is http://127.0.0.1:57678/collection1/
   [junit4]   2> 281078 INFO  (coreZkRegister-2073-thread-1-processing-n:127.0.0.1:57678_ x:collection1 s:shard1 c:control_collection r:core_node1) [n:127.0.0.1:57678_ c:control_collection s:shard1 r:core_node1 x:collection1] o.a.s.c.ZkController No LogReplay needed for core=collection1 baseURL=http://127.0.0.1:57678
   [junit4]   2> 281078 INFO  (coreZkRegister-2073-thread-1-processing-n:127.0.0.1:57678_ x:collection1 s:shard1 c:control_collection r:core_node1) [n:127.0.0.1:57678_ c:control_collection s:shard1 r:core_node1 x:collection1] o.a.s.c.ZkController I am the leader, no recovery necessary
   [junit4]   2> 281078 INFO  (coreZkRegister-2073-thread-1-processing-n:127.0.0.1:57678_ x:collection1 s:shard1 c:control_collection r:core_node1) [n:127.0.0.1:57678_ c:control_collection s:shard1 r:core_node1 x:collection1] o.a.s.c.ZkController publishing state=active
   [junit4]   2> 281078 INFO  (coreZkRegister-2073-thread-1-processing-n:127.0.0.1:57678_ x:collection1 s:shard1 c:control_collection r:core_node1) [n:127.0.0.1:57678_ c:control_collection s:shard1 r:core_node1 x:collection1] o.a.s.c.ZkController numShards not found on descriptor - reading it from system property
   [junit4]   2> 281079 INFO  (OverseerStateUpdate-94684743820902404-127.0.0.1:57678_-n_0000000000) [n:127.0.0.1:57678_    ] o.a.s.c.Overseer processMessage: queueSize: 1, message = {
   [junit4]   2>   "core":"collection1",
   [junit4]   2>   "core_node_name":"core_node1",
   [junit4]   2>   "roles":null,
   [junit4]   2>   "base_url":"http://127.0.0.1:57678",
   [junit4]   2>   "node_name":"127.0.0.1:57678_",
   [junit4]   2>   "numShards":"1",
   [junit4]   2>   "state":"active",
   [junit4]   2>   "shard":"shard1",
   [junit4]   2>   "collection":"control_collection",
   [junit4]   2>   "operation":"state"} current state version: 2
   [junit4]   2> 281079 INFO  (OverseerStateUpdate-94684743820902404-127.0.0.1:57678_-n_0000000000) [n:127.0.0.1:57678_    ] o.a.s.c.o.ReplicaMutator Update state numShards=1 message={
   [junit4]   2>   "core":"collection1",
   [junit4]   2>   "core_node_name":"core_node1",
   [junit4]   2>   "roles":null,
   [junit4]   2>   "base_url":"http://127.0.0.1:57678",
   [junit4]   2>   "node_name":"127.0.0.1:57678_",
   [junit4]   2>   "numShards":"1",
   [junit4]   2>   "state":"active",
   [junit4]   2>   "shard":"shard1",
   [junit4]   2>   "collection":"control_collection",
   [junit4]   2>   "operation":"state"}
   [junit4]   2> 281181 INFO  (zkCallback-301-thread-1-processing-n:127.0.0.1:57678_) [n:127.0.0.1:57678_    ] o.a.s.c.c.ZkStateReader A cluster state change: WatchedEvent state:SyncConnected type:NodeDataChanged path:/clusterstate.json, has occurred - updating... (live nodes size: 1)
   [junit4]   2> 281181 INFO  (zkCallback-301-thread-2-processing-n:127.0.0.1:57678_) [n:127.0.0.1:57678_    ] o.a.s.c.c.ZkStateReader A cluster state change: WatchedEvent state:SyncConnected type:NodeDataChanged path:/clusterstate.json, has occurred - updating... (live nodes size: 1)
   [junit4]   2> 281295 INFO  (TEST-SolrCloudExampleTest.testLoadDocsIntoGettingStartedCollection-seed#[F2489A32244E4281]) [    ] o.a.s.c.c.SolrZkClient Using default ZkCredentialsProvider
   [junit4]   2> 281296 INFO  (TEST-SolrCloudExampleTest.testLoadDocsIntoGettingStartedCollection-seed#[F2489A32244E4281]) [    ] o.a.s.c.c.ConnectionManager Waiting for client to connect to ZooKeeper
   [junit4]   2> 281297 INFO  (zkCallback-303-thread-1) [    ] o.a.s.c.c.ConnectionManager Watcher org.apache.solr.common.cloud.ConnectionManager@4cf31fea name:ZooKeeperConnection Watcher:127.0.0.1:45081/solr got event WatchedEvent state:SyncConnected type:None path:null path:null type:None
   [junit4]   2> 281297 INFO  (TEST-SolrCloudExampleTest.testLoadDocsIntoGettingStartedCollection-seed#[F2489A32244E4281]) [    ] o.a.s.c.c.ConnectionManager Client is connected to ZooKeeper
   [junit4]   2> 281297 INFO  (TEST-SolrCloudExampleTest.testLoadDocsIntoGettingStartedCollection-seed#[F2489A32244E4281]) [    ] o.a.s.c.c.SolrZkClient Using default ZkACLProvider
   [junit4]   2> 281297 INFO  (TEST-SolrCloudExampleTest.testLoadDocsIntoGettingStartedCollection-seed#[F2489A32244E4281]) [    ] o.a.s.c.c.ZkStateReader Updating cluster state from ZooKeeper... 
   [junit4]   2> 281298 INFO  (TEST-SolrCloudExampleTest.testLoadDocsIntoGettingStartedCollection-seed#[F2489A32244E4281]) [    ] o.a.s.c.ChaosMonkey monkey: init - expire sessions:false cause connection loss:false
   [junit4]   2> 281298 INFO  (TEST-SolrCloudExampleTest.testLoadDocsIntoGettingStartedCollection-seed#[F2489A32244E4281]) [    ] o.a.s.c.AbstractFullDistribZkTestBase Creating collection1 with stateFormat=2
   [junit4]   2> 281298 INFO  (TEST-SolrCloudExampleTest.testLoadDocsIntoGettingStartedCollection-seed#[F2489A32244E4281]) [    ] o.a.s.c.c.SolrZkClient Using default ZkCredentialsProvider
   [junit4]   2> 281299 INFO  (TEST-SolrCloudExampleTest.testLoadDocsIntoGettingStartedCollection-seed#[F2489A32244E4281]) [    ] o.a.s.c.c.ConnectionManager Waiting for client to connect to ZooKeeper
   [junit4]   2> 281300 INFO  (zkCallback-304-thread-1) [    ] o.a.s.c.c.ConnectionManager Watcher org.apache.solr.common.cloud.ConnectionManager@7fc42f41 name:ZooKeeperConnection Watcher:127.0.0.1:45081/solr got event WatchedEvent state:SyncConnected type:None path:null path:null type:None
   [junit4]   2> 281300 INFO  (TEST-SolrCloudExampleTest.testLoadDocsIntoGettingStartedCollection-seed#[F2489A32244E4281]) [    ] o.a.s.c.c.ConnectionManager Client is connected to ZooKeeper
   [junit4]   2> 281300 INFO  (TEST-SolrCloudExampleTest.testLoadDocsIntoGettingStartedCollection-seed#[F2489A32244E4281]) [    ] o.a.s.c.c.SolrZkClient Using default ZkACLProvider
   [junit4]   2> 281301 INFO  (OverseerStateUpdate-94684743820902404-127.0.0.1:57678_-n_0000000000) [n:127.0.0.1:57678_    ] o.a.s.c.Overseer processMessage: queueSize: 1, message = {
   [junit4]   2>   "operation":"create",
   [junit4]   2>   "name":"collection1",
   [junit4]   2>   "numShards":"2",
   [junit4]   2>   "stateFormat":"2"} current state version: 3
   [junit4]   2> 281302 INFO  (OverseerStateUpdate-94684743820902404-127.0.0.1:57678_-n_0000000000) [n:127.0.0.1:57678_    ] o.a.s.c.o.ClusterStateMutator building a new cName: collection1
   [junit4]   2> 281370 INFO  (TEST-SolrCloudExampleTest.testLoadDocsIntoGettingStartedCollection-seed#[F2489A32244E4281]) [    ] o.a.s.SolrTestCaseJ4 Writing core.properties file to /home/jenkins/workspace/Lucene-Solr-5.x-Linux/solr/build/solr-core/test/J0/temp/solr.cloud.SolrCloudExampleTest_F2489A32244E4281-001/shard-1-001/cores/collection1
   [junit4]   2> 281370 INFO  (TEST-SolrCloudExampleTest.testLoadDocsIntoGettingStartedCollection-seed#[F2489A32244E4281]) [    ] o.a.s.c.AbstractFullDistribZkTestBase create jetty 1 in directory /home/jenkins/workspace/Lucene-Solr-5.x-Linux/solr/build/solr-core/test/J0/temp/solr.cloud.SolrCloudExampleTest_F2489A32244E4281-001/shard-1-001
   [junit4]   2> 281370 INFO  (TEST-SolrCloudExampleTest.testLoadDocsIntoGettingStartedCollection-seed#[F2489A32244E4281]) [    ] o.e.j.s.Server jetty-9.2.13.v20150730
   [junit4]   2> 281371 INFO  (TEST-SolrCloudExampleTest.testLoadDocsIntoGettingStartedCollection-seed#[F2489A32244E4281]) [    ] o.e.j.s.h.ContextHandler Started o.e.j.s.ServletContextHandler@4f7e540d{/,null,AVAILABLE}
   [junit4]   2> 281372 INFO  (TEST-SolrCloudExampleTest.testLoadDocsIntoGettingStartedCollection-seed#[F2489A32244E4281]) [    ] o.e.j.s.ServerConnector Started ServerConnector@5300a8c4{HTTP/1.1}{127.0.0.1:39019}
   [junit4]   2> 281372 INFO  (TEST-SolrCloudExampleTest.testLoadDocsIntoGettingStartedCollection-seed#[F2489A32244E4281]) [    ] o.e.j.s.Server Started @283432ms
   [junit4]   2> 281372 INFO  (TEST-SolrCloudExampleTest.testLoadDocsIntoGettingStartedCollection-seed#[F2489A32244E4281]) [    ] o.a.s.c.s.e.JettySolrRunner Jetty properties: {solr.data.dir=/home/jenkins/workspace/Lucene-Solr-5.x-Linux/solr/build/solr-core/test/J0/temp/solr.cloud.SolrCloudExampleTest_F2489A32244E4281-001/tempDir-001/jetty1, solrconfig=solrconfig.xml, hostContext=/, hostPort=39019, coreRootDirectory=/home/jenkins/workspace/Lucene-Solr-5.x-Linux/solr/build/solr-core/test/J0/temp/solr.cloud.SolrCloudExampleTest_F2489A32244E4281-001/shard-1-001/cores}
   [junit4]   2> 281372 INFO  (TEST-SolrCloudExampleTest.testLoadDocsIntoGettingStartedCollection-seed#[F2489A32244E4281]) [    ] o.a.s.s.SolrDispatchFilter SolrDispatchFilter.init(): sun.misc.Launcher$AppClassLoader@4e0e2f2a
   [junit4]   2> 281372 INFO  (TEST-SolrCloudExampleTest.testLoadDocsIntoGettingStartedCollection-seed#[F2489A32244E4281]) [    ] o.a.s.c.SolrResourceLoader new SolrResourceLoader for directory: '/home/jenkins/workspace/Lucene-Solr-5.x-Linux/solr/build/solr-core/test/J0/temp/solr.cloud.SolrCloudExampleTest_F2489A32244E4281-001/shard-1-001/'
   [junit4]   2> 281372 INFO  (TEST-SolrCloudExampleTest.testLoadDocsIntoGettingStartedCollection-seed#[F2489A32244E4281]) [    ] o.a.s.c.SolrResourceLoader JNDI not configured for solr (NoInitialContextEx)
   [junit4]   2> 281372 INFO  (TEST-SolrCloudExampleTest.testLoadDocsIntoGettingStartedCollection-seed#[F2489A32244E4281]) [    ] o.a.s.c.SolrResourceLoader solr home defaulted to 'solr/' (could not find system property or JNDI)
   [junit4]   2> 281382 INFO  (TEST-SolrCloudExampleTest.testLoadDocsIntoGettingStartedCollection-seed#[F2489A32244E4281]) [    ] o.a.s.c.c.SolrZkClient Using default ZkCredentialsProvider
   [junit4]   2> 281383 INFO  (TEST-SolrCloudExampleTest.testLoadDocsIntoGettingStartedCollection-seed#[F2489A32244E4281]) [    ] o.a.s.c.c.ConnectionManager Waiting for client to connect to ZooKeeper
   [junit4]   2> 281384 INFO  (zkCallback-305-thread-1) [    ] o.a.s.c.c.ConnectionManager Watcher org.apache.solr.common.cloud.ConnectionManager@853ff22 name:ZooKeeperConnection Watcher:127.0.0.1:45081/solr got event WatchedEvent state:SyncConnected type:None path:null path:null type:None
   [junit4]   2> 281384 INFO  (TEST-SolrCloudExampleTest.testLoadDocsIntoGettingStartedCollection-seed#[F2489A32244E4281]) [    ] o.a.s.c.c.ConnectionManager Client is connected to ZooKeeper
   [junit4]   2> 281384 INFO  (TEST-SolrCloudExampleTest.testLoadDocsIntoGettingStartedCollection-seed#[F2489A32244E4281]) [    ] o.a.s.c.c.SolrZkClient Using default ZkACLProvider
   [junit4]   2> 281385 INFO  (TEST-SolrCloudExampleTest.testLoadDocsIntoGettingStartedCollection-seed#[F2489A32244E4281]) [    ] o.a.s.s.SolrDispatchFilter Loading solr.xml from SolrHome (not found in ZooKeeper)
   [junit4]   2> 281385 INFO  (TEST-SolrCloudExampleTest.testLoadDocsIntoGettingStartedCollection-seed#[F2489A32244E4281]) [    ] o.a.s.c.SolrXmlConfig Loading container configuration from /home/jenkins/workspace/Lucene-Solr-5.x-Linux/solr/build/solr-core/test/J0/temp/solr.cloud.SolrCloudExampleTest_F2489A32244E4281-001/shard-1-001/solr.xml
   [junit4]   2> 281388 INFO  (TEST-SolrCloudExampleTest.testLoadDocsIntoGettingStartedCollection-seed#[F2489A32244E4281]) [    ] o.a.s.c.CoresLocator Config-defined core root directory: /home/jenkins/workspace/Lucene-Solr-5.x-Linux/solr/build/solr-core/test/J0/temp/solr.cloud.SolrCloudExampleTest_F2489A32244E4281-001/shard-1-001/cores
   [junit4]   2> 281389 INFO  (TEST-SolrCloudExampleTest.testLoadDocsIntoGettingStartedCollection-seed#[F2489A32244E4281]) [    ] o.a.s.c.CoreContainer New CoreContainer 183068632
   [junit4]   2> 281389 INFO  (TEST-SolrCloudExampleTest.testLoadDocsIntoGettingStartedCollection-seed#[F2489A32244E4281]) [    ] o.a.s.c.CoreContainer Loading cores into CoreContainer [instanceDir=/home/jenkins/workspace/Lucene-Solr-5.x-Linux/solr/build/solr-core/test/J0/temp/solr.cloud.SolrCloudExampleTest_F2489A32244E4281-001/shard-1-001/]
   [junit4]   2> 281389 INFO  (TEST-SolrCloudExampleTest.testLoadDocsIntoGettingStartedCollection-seed#[F2489A32244E4281]) [    ] o.a.s.c.CoreContainer loading shared library: /home/jenkins/workspace/Lucene-Solr-5.x-Linux/solr/build/solr-core/test/J0/temp/solr.cloud.SolrCloudExampleTest_F2489A32244E4281-001/shard-1-001/lib
   [junit4]   2> 281389 WARN  (TEST-SolrCloudExampleTest.testLoadDocsIntoGettingStartedCollection-seed#[F2489A32244E4281]) [    ] o.a.s.c.SolrResourceLoader Can't find (or read) directory to add to classloader: lib (resolved as: /home/jenkins/workspace/Lucene-Solr-5.x-Linux/solr/build/solr-core/test/J0/temp/solr.cloud.SolrCloudExampleTest_F2489A32244E4281-001/shard-1-001/lib).
   [junit4]   2> 281393 INFO  (TEST-SolrCloudExampleTest.testLoadDocsIntoGettingStartedCollection-seed#[F2489A32244E4281]) [    ] o.a.s.h.c.HttpShardHandlerFactory created with socketTimeout : 90000,urlScheme : ,connTimeout : 15000,maxConnectionsPerHost : 20,maxConnections : 10000,corePoolSize : 0,maximumPoolSize : 2147483647,maxThreadIdleTime : 5,sizeOfQueue : -1,fairnessPolicy : false,useRetries : false,
   [junit4]   2> 281394 INFO  (TEST-SolrCloudExampleTest.testLoadDocsIntoGettingStartedCollection-seed#[F2489A32244E4281]) [    ] o.a.s.u.UpdateShardHandler Creating UpdateShardHandler HTTP client with params: socketTimeout=340000&connTimeout=45000&retry=true
   [junit4]   2> 281394 INFO  (TEST-SolrCloudExampleTest.testLoadDocsIntoGettingStartedCollection-seed#[F2489A32244E4281]) [    ] o.a.s.l.LogWatcher SLF4J impl is org.slf4j.impl.Log4jLoggerFactory
   [junit4]   2> 281394 INFO  (TEST-SolrCloudExampleTest.testLoadDocsIntoGettingStartedCollection-seed#[F2489A32244E4281]) [    ] o.a.s.l.LogWatcher Registering Log Listener [Log4j (org.slf4j.impl.Log4jLoggerFactory)]
   [junit4]   2> 281394 INFO  (TEST-SolrCloudExampleTest.testLoadDocsIntoGettingStartedCollection-seed#[F2489A32244E4281]) [    ] o.a.s.c.ZkContainer Zookeeper client=127.0.0.1:45081/solr
   [junit4]   2> 281394 INFO  (TEST-SolrCloudExampleTest.testLoadDocsIntoGettingStartedCollection-seed#[F2489A32244E4281]) [    ] o.a.s.c.ZkController zkHost includes chroot
   [junit4]   2> 281394 INFO  (TEST-SolrCloudExampleTest.testLoadDocsIntoGettingStartedCollection-seed#[F2489A32244E4281]) [    ] o.a.s.c.c.SolrZkClient Using default ZkCredentialsProvider
   [junit4]   2> 281400 INFO  (TEST-SolrCloudExampleTest.testLoadDocsIntoGettingStartedCollection-seed#[F2489A32244E4281]) [    ] o.a.s.c.c.ConnectionManager Waiting for client to connect to ZooKeeper
   [junit4]   2> 281400 INFO  (zkCallback-307-thread-1) [    ] o.a.s.c.c.ConnectionManager Watcher org.apache.solr.common.cloud.ConnectionManager@2595dbf4 name:ZooKeeperConnection Watcher:127.0.0.1:45081 got event WatchedEvent state:SyncConnected type:None path:null path:null type:None
   [junit4]   2> 281400 INFO  (TEST-SolrCloudExampleTest.testLoadDocsIntoGettingStartedCollection-seed#[F2489A32244E4281]) [    ] o.a.s.c.c.ConnectionManager Client is connected to ZooKeeper
   [junit4]   2> 281400 INFO  (TEST-SolrCloudExampleTest.testLoadDocsIntoGettingStartedCollection-seed#[F2489A32244E4281]) [    ] o.a.s.c.c.SolrZkClient Using default ZkACLProvider
   [junit4]   2> 281402 INFO  (TEST-SolrCloudExampleTest.testLoadDocsIntoGettingStartedCollection-seed#[F2489A32244E4281]) [n:127.0.0.1:39019_    ] o.a.s.c.c.ConnectionManager Waiting for client to connect to ZooKeeper
   [junit4]   2> 281403 INFO  (OverseerStateUpdate-94684743820902404-127.0.0.1:57678_-n_0000000000) [n:127.0.0.1:57678_    ] o.a.s.c.o.ZkStateWriter going to create_collection /collections/collection1/state.json
   [junit4]   2> 281405 INFO  (zkCallback-308-thread-1-processing-n:127.0.0.1:39019_) [n:127.0.0.1:39019_    ] o.a.s.c.c.ConnectionManager Watcher org.apache.solr.common.cloud.ConnectionManager@ce67818 name:ZooKeeperConnection Watcher:127.0.0.1:45081/solr got event WatchedEvent state:SyncConnected type:None path:null path:null type:None
   [junit4]   2> 281406 INFO  (TEST-SolrCloudExampleTest.testLoadDocsIntoGettingStartedCollection-seed#[F2489A32244E4281]) [n:127.0.0.1:39019_    ] o.a.s.c.c.ConnectionManager Client is connected to ZooKeeper
   [junit4]   2> 281408 INFO  (TEST-SolrCloudExampleTest.testLoadDocsIntoGettingStartedCollection-seed#[F2489A32244E4281]) [n:127.0.0.1:39019_    ] o.a.s.c.c.ZkStateReader Updating cluster state from ZooKeeper... 
   [junit4]   2> 282412 INFO  (TEST-SolrCloudExampleTest.testLoadDocsIntoGettingStartedCollection-seed#[F2489A32244E4281]) [n:127.0.0.1:39019_    ] o.a.s.c.ZkController Register node as live in ZooKeeper:/live_nodes/127.0.0.1:39019_
   [junit4]   2> 282413 INFO  (TEST-SolrCloudExampleTest.testLoadDocsIntoGettingStartedCollection-seed#[F2489A32244E4281]) [n:127.0.0.1:39019_    ] o.a.s.c.c.SolrZkClient makePath: /live_nodes/127.0.0.1:39019_
   [junit4]   2> 282413 INFO  (zkCallback-301-thread-2-processing-n:127.0.0.1:57678_) [n:127.0.0.1:57678_    ] o.a.s.c.c.ZkStateReader A live node change: WatchedEvent state:SyncConnected type:NodeChildrenChanged path:/live_nodes, has occurred - updating... (live nodes size: 1)
   [junit4]   2> 282413 INFO  (zkCallback-303-thread-1) [    ] o.a.s.c.c.ZkStateReader A live node change: WatchedEvent state:SyncConnected type:NodeChildrenChanged path:/live_nodes, has occurred - updating... (live nodes size: 1)
   [junit4]   2> 282413 INFO  (zkCallback-301-thread-1-processing-n:127.0.0.1:57678_) [n:127.0.0.1:57678_    ] o.a.s.c.c.ZkStateReader A live node change: WatchedEvent state:SyncConnected type:NodeChildrenChanged path:/live_nodes, has occurred - updating... (live nodes size: 1)
   [junit4]   2> 282413 INFO  (zkCallback-308-thread-1-processing-n:127.0.0.1:39019_) [n:127.0.0.1:39019_    ] o.a.s.c.c.ZkStateReader A live node change: WatchedEvent state:SyncConnected type:NodeChildrenChanged path:/live_nodes, has occurred - updating... (live nodes size: 1)
   [junit4]   2> 282414 INFO  (TEST-SolrCloudExampleTest.testLoadDocsIntoGettingStartedCollection-seed#[F2489A32244E4281]) [n:127.0.0.1:39019_    ] o.a.s.c.Overseer Overseer (id=null) closing
   [junit4]   2> 282414 INFO  (TEST-SolrCloudExampleTest.testLoadDocsIntoGettingStartedCollection-seed#[F2489A32244E4281]) [n:127.0.0.1:39019_    ] o.a.s.c.LeaderElector Joined leadership election with path: /overseer_elect/election/94684743820902409-127.0.0.1:39019_-n_0000000001
   [junit4]   2> 282415 INFO  (TEST-SolrCloudExampleTest.testLoadDocsIntoGettingStartedCollection-seed#[F2489A32244E4281]) [n:127.0.0.1:39019_    ] o.a.s.c.LeaderElector Watching path /overseer_elect/election/94684743820902404-127.0.0.1:57678_-n_0000000000 to know if I could be the leader
   [junit4]   2> 282427 INFO  (TEST-SolrCloudExampleTest.testLoadDocsIntoGettingStartedCollection-seed#[F2489A32244E4281]) [n:127.0.0.1:39019_    ] o.a.s.c.CoreContainer Security conf doesn't exist. Skipping setup for authorization module.
   [junit4]   2> 282427 INFO  (TEST-SolrCloudExampleTest.testLoadDocsIntoGettingStartedCollection-seed#[F2489A32244E4281]) [n:127.0.0.1:39019_    ] o.a.s.c.CoreContainer No authentication plugin used.
   [junit4]   2> 282427 INFO  (TEST-SolrCloudExampleTest.testLoadDocsIntoGettingStartedCollection-seed#[F2489A32244E4281]) [n:127.0.0.1:39019_    ] o.a.s.c.CoresLocator Looking for core definitions underneath /home/jenkins/workspace/Lucene-Solr-5.x-Linux/solr/build/solr-core/test/J0/temp/solr.cloud.SolrCloudExampleTest_F2489A32244E4281-001/shard-1-001/cores
   [junit4]   2> 282428 INFO  (TEST-SolrCloudExampleTest.testLoadDocsIntoGettingStartedCollection-seed#[F2489A32244E4281]) [n:127.0.0.1:39019_    ] o.a.s.c.SolrCore Created CoreDescriptor: {name=collection1, config=solrconfig.xml, transient=false, schema=schema.xml, loadOnStartup=true, configSetProperties=configsetprops.json, instanceDir=/home/jenkins/workspace/Lucene-Solr-5.x-Linux/solr/build/solr-core/test/J0/temp/solr.cloud.SolrCloudExampleTest_F2489A32244E4281-001/shard-1-001/cores/collection1, collection=collection1, absoluteInstDir=/home/jenkins/workspace/Lucene-Solr-5.x-Linux/solr/build/solr-core/test/J0/temp/solr.cloud.SolrCloudExampleTest_F2489A32244E4281-001/shard-1-001/cores/collection1/, coreNodeName=, dataDir=data/, shard=}
   [junit4]   2> 282428 INFO  (TEST-SolrCloudExampleTest.testLoadDocsIntoGettingStartedCollection-seed#[F2489A32244E4281]) [n:127.0.0.1:39019_    ] o.a.s.c.CoresLocator Found core collection1 in /home/jenkins/workspace/Lucene-Solr-5.x-Linux/solr/build/solr-core/test/J0/temp/solr.cloud.SolrCloudExampleTest_F2489A32244E4281-001/shard-1-001/cores/collection1/
   [junit4]   2> 282428 INFO  (TEST-SolrCloudExampleTest.testLoadDocsIntoGettingStartedCollection-seed#[F2489A32244E4281]) [n:127.0.0.1:39019_    ] o.a.s.c.CoresLocator Found 1 core definitions
   [junit4]   2> 282429 INFO  (TEST-SolrCloudExampleTest.testLoadDocsIntoGettingStartedCollection-seed#[F2489A32244E4281]) [n:127.0.0.1:39019_    ] o.a.s.s.SolrDispatchFilter user.dir=/home/jenkins/workspace/Lucene-Solr-5.x-Linux/solr/build/solr-core/test/J0
   [junit4]   2> 282429 INFO  (TEST-SolrCloudExampleTest.testLoadDocsIntoGettingStartedCollection-seed#[F2489A32244E4281]) [n:127.0.0.1:39019_    ] o.a.s.s.SolrDispatchFilter SolrDispatchFilter.init() done
   [junit4]   2> 282429 INFO  (coreLoadExecutor-2090-thread-1-processing-n:127.0.0.1:39019_) [n:127.0.0.1:39019_ c:collection1   x:collection1] o.a.s.c.ZkController publishing state=down
   [junit4]   2> 282429 INFO  (coreLoadExecutor-2090-thread-1-processing-n:127.0.0.1:39019_) [n:127.0.0.1:39019_ c:collection1   x:collection1] o.a.s.c.ZkController numShards not found on descriptor - reading it from system property
   [junit4]   2> 282430 INFO  (coreLoadExecutor-2090-thread-1-processing-n:127.0.0.1:39019_) [n:127.0.0.1:39019_ c:collection1   x:collection1] o.a.s.c.ZkController Registering watch for collection collection1
   [junit4]   2> 282430 INFO  (coreLoadExecutor-2090-thread-1-processing-n:127.0.0.1:39019_) [n:127.0.0.1:39019_ c:collection1   x:collection1] o.a.s.c.c.ZkStateReader addZkWatch collection1
   [junit4]   2> 282430 INFO  (OverseerStateUpdate-94684743820902404-127.0.0.1:57678_-n_0000000000) [n:127.0.0.1:57678_    ] o.a.s.c.Overseer processMessage: queueSize: 1, message = {
   [junit4]   2>   "core":"collection1",
   [junit4]   2>   "roles":null,
   [junit4]   2>   "base_url":"http://127.0.0.1:39019",
   [junit4]   2>   "node_name":"127.0.0.1:39019_",
   [junit4]   2>   "numShards":"2",
   [junit4]   2>   "state":"down",
   [junit4]   2>   "shard":null,
   [junit4]   2>   "collection":"collection1",
   [junit4]   2>   "operation":"state"} current state version: 3
   [junit4]   2> 282430 INFO  (coreLoadExecutor-2090-thread-1-processing-n:127.0.0.1:39019_) [n:127.0.0.1:39019_ c:collection1   x:collection1] o.a.s.c.c.ZkStateReader Add data for collection1 ver 0 
   [junit4]   2> 282430 INFO  (coreLoadExecutor-2090-thread-1-processing-n:127.0.0.1:39019_) [n:127.0.0.1:39019_ c:collection1   x:collection1] o.a.s.c.ZkController look for our core node name
   [junit4]   2> 282431 INFO  (OverseerStateUpdate-94684743820902404-127.0.0.1:57678_-n_0000000000) [n:127.0.0.1:57678_    ] o.a.s.c.o.ReplicaMutator Update state numShards=2 message={
   [junit4]   2>   "core":"collection1",
   [junit4]   2>   "roles":null,
   [junit4]   2>   "base_url":"http://127.0.0.1:39019",
   [junit4]   2>   "node_name":"127.0.0.1:39019_",
   [junit4]   2>   "numShards":"2",
   [junit4]   2>   "state":"down",
   [junit4]   2>   "shard":null,
   [junit4]   2>   "collection":"collection1",
   [junit4]   2>   "operation":"state"}
   [junit4]   2> 282431 INFO  (OverseerStateUpdate-94684743820902404-127.0.0.1:57678_-n_0000000000) [n:127.0.0.1:57678_    ] o.a.s.c.o.ReplicaMutator Collection already exists with numShards=2
   [junit4]   2> 282431 INFO  (OverseerStateUpdate-94684743820902404-127.0.0.1:57678_-n_0000000000) [n:127.0.0.1:57678_    ] o.a.s.c.o.ReplicaMutator Assigning new node to shard shard=shard2
   [junit4]   2> 282532 INFO  (OverseerStateUpdate-94684743820902404-127.0.0.1:57678_-n_0000000000) [n:127.0.0.1:57678_    ] o.a.s.c.o.ZkStateWriter going to update_collection /collections/collection1/state.json version: 0
   [junit4]   2> 282534 INFO  (zkCallback-308-thread-1-processing-n:127.0.0.1:39019_) [n:127.0.0.1:39019_    ] o.a.s.c.c.ZkStateReader A cluster state change: WatchedEvent state:SyncConnected type:NodeDataChanged path:/collections/collection1/state.json for collection collection1 has occurred - updating... (live nodes size: 2)
   [junit4]   2> 282535 INFO  (zkCallback-308-thread-1-processing-n:127.0.0.1:39019_) [n:127.0.0.1:39019_    ] o.a.s.c.c.ZkStateReader Updating data for collection1 from 0 to 1 
   [junit4]   2> 283431 INFO  (coreLoadExecutor-2090-thread-1-processing-n:127.0.0.1:39019_) [n:127.0.0.1:39019_ c:collection1   x:collection1] o.a.s.c.ZkController waiting to find shard id in clusterstate for collection1
   [junit4]   2> 283431 INFO  (coreLoadExecutor-2090-thread-1-processing-n:127.0.0.1:39019_) [n:127.0.0.1:39019_ c:collection1   x:collection1] o.a.s.c.ZkController Check for collection zkNode:collection1
   [junit4]   2> 283431 INFO  (coreLoadExecutor-2090-thread-1-processing-n:127.0.0.1:39019_) [n:127.0.0.1:39019_ c:collection1   x:collection1] o.a.s.c.ZkController Collection zkNode exists
   [junit4]   2> 283431 INFO  (coreLoadExecutor-2090-thread-1-processing-n:127.0.0.1:39019_) [n:127.0.0.1:39019_ c:collection1   x:collection1] o.a.s.c.c.ZkStateReader Load collection config from:/collections/collection1
   [junit4]   2> 283431 INFO  (coreLoadExecutor-2090-thread-1-processing-n:127.0.0.1:39019_) [n:127.0.0.1:39019_ c:collection1   x:collection1] o.a.s.c.c.ZkStateReader path=/collections/collection1 configName=conf1 specified config exists in ZooKeeper
   [junit4]   2> 283431 INFO  (coreLoadExecutor-2090-thread-1-processing-n:127.0.0.1:39019_) [n:127.0.0.1:39019_ c:collection1   x:collection1] o.a.s.c.SolrResourceLoader new SolrResourceLoader for directory: '/home/jenkins/workspace/Lucene-Solr-5.x-Linux/solr/build/solr-core/test/J0/temp/solr.cloud.SolrCloudExampleTest_F2489A32244E4281-001/shard-1-001/cores/collection1/'
   [junit4]   2> 283431 INFO  (coreLoadExecutor-2090-thread-1-processing-n:127.0.0.1:39019_) [n:127.0.0.1:39019_ c:collection1   x:collection1] o.a.s.c.SolrResourceLoader JNDI not configured for solr (NoInitialContextEx)
   [junit4]   2> 283431 INFO  (coreLoadExecutor-2090-thread-1-processing-n:127.0.0.1:39019_) [n:127.0.0.1:39019_ c:collection1   x:collection1] o.a.s.c.SolrResourceLoader solr home defaulted to 'solr/' (could not find system property or JNDI)
   [junit4]   2> 283440 INFO  (coreLoadExecutor-2090-thread-1-processing-n:127.0.0.1:39019_) [n:127.0.0.1:39019_ c:collection1   x:collection1] o.a.s.c.Config loaded config solrconfig.xml with version 0 
   [junit4]   2> 283443 INFO  (coreLoadExecutor-2090-thread-1-processing-n:127.0.0.1:39019_) [n:127.0.0.1:39019_ c:collection1   x:collection1] o.a.s.c.SolrConfig current version of requestparams : -1
   [junit4]   2> 283445 INFO  (coreLoadExecutor-2090-thread-1-processing-n:127.0.0.1:39019_) [n:127.0.0.1:39019_ c:collection1   x:collection1] o.a.s.c.SolrConfig Using Lucene MatchVersion: 5.4.0
   [junit4]   2> 283452 INFO  (coreLoadExecutor-2090-thread-1-processing-n:127.0.0.1:39019_) [n:127.0.0.1:39019_ c:collection1   x:collection1] o.a.s.c.Config Loaded SolrConfig: solrconfig.xml
   [junit4]   2> 283453 INFO  (coreLoadExecutor-2090-thread-1-processing-n:127.0.0.1:39019_) [n:127.0.0.1:39019_ c:collection1   x:collection1] o.a.s.s.IndexSchema Reading Solr Schema from /configs/conf1/schema.xml
   [junit4]   2> 283456 INFO  (coreLoadExecutor-2090-thread-1-processing-n:127.0.0.1:39019_) [n:127.0.0.1:39019_ c:collection1   x:collection1] o.a.s.s.IndexSchema [collection1] Schema name=test
   [junit4]   2> 283540 INFO  (coreLoadExecutor-2090-thread-1-processing-n:127.0.0.1:39019_) [n:127.0.0.1:39019_ c:collection1   x:collection1] o.a.s.s.OpenExchangeRatesOrgProvider Initialized with rates=open-exchange-rates.json, refreshInterval=1440.
   [junit4]   2> 283544 INFO  (coreLoadExecutor-2090-thread-1-processing-n:127.0.0.1:39019_) [n:127.0.0.1:39019_ c:collection1   x:collection1] o.a.s.s.IndexSchema default searc

[...truncated too long message...]

ollection1] o.a.s.c.CachingDirectoryFactory Closing directory: /home/jenkins/workspace/Lucene-Solr-5.x-Linux/solr/build/solr-core/test/J0/temp/solr.cloud.SolrCloudExampleTest_F2489A32244E4281-001/shard-4-001/cores/collection1/data
   [junit4]   2> 323491 INFO  (zkCallback-321-thread-1-processing-n:127.0.0.1:46056_) [n:127.0.0.1:46056_ c:collection1 s:shard1 r:core_node4 x:collection1] o.a.s.c.ShardLeaderElectionContextBase No version found for ephemeral leader parent node, won't remove previous leader registration.
   [junit4]   2> 323491 INFO  (zkCallback-321-thread-1-processing-n:127.0.0.1:46056_) [n:127.0.0.1:46056_ c:collection1 s:shard1 r:core_node4 x:collection1] o.a.s.c.ElectionContext Canceling election /collections/collection1/leader_elect/shard1/election/94684743820902418-core_node4-n_0000000001
   [junit4]   2> 323491 WARN  (zkCallback-321-thread-1-processing-n:127.0.0.1:46056_) [n:127.0.0.1:46056_ c:collection1 s:shard1 r:core_node4 x:collection1] o.a.s.c.LeaderElector 
   [junit4]   2> org.apache.zookeeper.KeeperException$SessionExpiredException: KeeperErrorCode = Session expired for /collections/collection1/leader_elect/shard1/election/94684743820902418-core_node4-n_0000000001
   [junit4]   2> 	at org.apache.zookeeper.KeeperException.create(KeeperException.java:127)
   [junit4]   2> 	at org.apache.zookeeper.KeeperException.create(KeeperException.java:51)
   [junit4]   2> 	at org.apache.zookeeper.ZooKeeper.delete(ZooKeeper.java:873)
   [junit4]   2> 	at org.apache.solr.common.cloud.SolrZkClient$2.execute(SolrZkClient.java:244)
   [junit4]   2> 	at org.apache.solr.common.cloud.SolrZkClient$2.execute(SolrZkClient.java:241)
   [junit4]   2> 	at org.apache.solr.common.cloud.ZkCmdExecutor.retryOperation(ZkCmdExecutor.java:61)
   [junit4]   2> 	at org.apache.solr.common.cloud.SolrZkClient.delete(SolrZkClient.java:241)
   [junit4]   2> 	at org.apache.solr.cloud.ElectionContext.cancelElection(ElectionContext.java:85)
   [junit4]   2> 	at org.apache.solr.cloud.ShardLeaderElectionContextBase.cancelElection(ElectionContext.java:166)
   [junit4]   2> 	at org.apache.solr.cloud.ShardLeaderElectionContext.cancelElection(ElectionContext.java:268)
   [junit4]   2> 	at org.apache.solr.cloud.ShardLeaderElectionContext.runLeaderProcess(ElectionContext.java:450)
   [junit4]   2> 	at org.apache.solr.cloud.LeaderElector.runIamLeaderProcess(LeaderElector.java:197)
   [junit4]   2> 	at org.apache.solr.cloud.LeaderElector.checkIfIamLeader(LeaderElector.java:157)
   [junit4]   2> 	at org.apache.solr.cloud.LeaderElector.access$200(LeaderElector.java:58)
   [junit4]   2> 	at org.apache.solr.cloud.LeaderElector$ElectionWatcher.process(LeaderElector.java:388)
   [junit4]   2> 	at org.apache.solr.common.cloud.SolrZkClient$3$1.run(SolrZkClient.java:264)
   [junit4]   2> 	at java.util.concurrent.Executors$RunnableAdapter.call(Executors.java:511)
   [junit4]   2> 	at java.util.concurrent.FutureTask.run(FutureTask.java:266)
   [junit4]   2> 	at org.apache.solr.common.util.ExecutorUtil$MDCAwareThreadPoolExecutor$1.run(ExecutorUtil.java:231)
   [junit4]   2> 	at java.util.concurrent.ThreadPoolExecutor.runWorker(ThreadPoolExecutor.java:1142)
   [junit4]   2> 	at java.util.concurrent.ThreadPoolExecutor$Worker.run(ThreadPoolExecutor.java:617)
   [junit4]   2> 	at java.lang.Thread.run(Thread.java:745)
   [junit4]   2> 323506 INFO  (TEST-SolrCloudExampleTest.testLoadDocsIntoGettingStartedCollection-seed#[F2489A32244E4281]) [    ] o.e.j.s.ServerConnector Stopped ServerConnector@12f84e4e{HTTP/1.1}{127.0.0.1:0}
   [junit4]   2> 323506 INFO  (TEST-SolrCloudExampleTest.testLoadDocsIntoGettingStartedCollection-seed#[F2489A32244E4281]) [    ] o.e.j.s.h.ContextHandler Stopped o.e.j.s.ServletContextHandler@52368b2c{/,null,UNAVAILABLE}
   [junit4]   2> 323510 INFO  (TEST-SolrCloudExampleTest.testLoadDocsIntoGettingStartedCollection-seed#[F2489A32244E4281]) [n:127.0.0.1:46056_ c:collection1 s:shard1 r:core_node4 x:collection1] o.a.s.c.ZkTestServer connecting to 127.0.0.1:45081 45081
   [junit4]   2> 323534 INFO  (Thread-1832) [    ] o.a.s.c.ZkTestServer connecting to 127.0.0.1:45081 45081
   [junit4]   2> 323535 WARN  (Thread-1832) [    ] o.a.s.c.ZkTestServer Watch limit violations: 
   [junit4]   2> Maximum concurrent create/delete watches above limit:
   [junit4]   2> 
   [junit4]   2> 	10	/solr/aliases.json
   [junit4]   2> 	9	/solr/configs/gettingstarted/managed-schema
   [junit4]   2> 	9	/solr/configs/gettingstarted
   [junit4]   2> 	6	/solr/security.json
   [junit4]   2> 	5	/solr/configs/conf1
   [junit4]   2> 
   [junit4]   2> Maximum concurrent data watches above limit:
   [junit4]   2> 
   [junit4]   2> 	13	/solr/clusterstate.json
   [junit4]   2> 	4	/solr/collections/collection1/state.json
   [junit4]   2> 	4	/solr/collections/gettingstarted/state.json
   [junit4]   2> 
   [junit4]   2> Maximum concurrent children watches above limit:
   [junit4]   2> 
   [junit4]   2> 	14	/solr/live_nodes
   [junit4]   2> 	12	/solr/collections
   [junit4]   2> 	5	/solr/overseer/queue
   [junit4]   2> 	5	/solr/overseer/collection-queue-work
   [junit4]   2> 
   [junit4]   2> NOTE: reproduce with: ant test  -Dtestcase=SolrCloudExampleTest -Dtests.method=testLoadDocsIntoGettingStartedCollection -Dtests.seed=F2489A32244E4281 -Dtests.multiplier=3 -Dtests.slow=true -Dtests.locale=ar_SY -Dtests.timezone=America/Argentina/Salta -Dtests.asserts=true -Dtests.file.encoding=UTF-8
   [junit4] FAILURE 44.0s J0 | SolrCloudExampleTest.testLoadDocsIntoGettingStartedCollection <<<
   [junit4]    > Throwable #1: java.lang.AssertionError: Delete action failed!
   [junit4]    > 	at __randomizedtesting.SeedInfo.seed([F2489A32244E4281:E12BA85D1521FB27]:0)
   [junit4]    > 	at org.apache.solr.cloud.SolrCloudExampleTest.doTestDeleteAction(SolrCloudExampleTest.java:169)
   [junit4]    > 	at org.apache.solr.cloud.SolrCloudExampleTest.testLoadDocsIntoGettingStartedCollection(SolrCloudExampleTest.java:145)
   [junit4]    > 	at org.apache.solr.BaseDistributedSearchTestCase$ShardsRepeatRule$ShardsFixedStatement.callStatement(BaseDistributedSearchTestCase.java:963)
   [junit4]    > 	at org.apache.solr.BaseDistributedSearchTestCase$ShardsRepeatRule$ShardsStatement.evaluate(BaseDistributedSearchTestCase.java:938)
   [junit4]    > 	at java.lang.Thread.run(Thread.java:745)
   [junit4]   2> 323540 INFO  (SUITE-SolrCloudExampleTest-seed#[F2489A32244E4281]-worker) [n:127.0.0.1:46056_ c:collection1 s:shard1 r:core_node4 x:collection1] o.a.s.SolrTestCaseJ4 ###deleteCore
   [junit4]   2> NOTE: leaving temporary files on disk at: /home/jenkins/workspace/Lucene-Solr-5.x-Linux/solr/build/solr-core/test/J0/temp/solr.cloud.SolrCloudExampleTest_F2489A32244E4281-001
   [junit4]   2> Oct 13, 2015 10:16:17 PM com.carrotsearch.randomizedtesting.ThreadLeakControl checkThreadLeaks
   [junit4]   2> WARNING: Will linger awaiting termination of 1 leaked thread(s).
   [junit4]   2> NOTE: test params are: codec=Asserting(Lucene53): {}, docValues:{}, sim=RandomSimilarityProvider(queryNorm=true,coord=crazy): {}, locale=ar_SY, timezone=America/Argentina/Salta
   [junit4]   2> NOTE: Linux 3.19.0-30-generic amd64/Oracle Corporation 1.8.0_60 (64-bit)/cpus=12,threads=1,free=163155776,total=531103744
   [junit4]   2> NOTE: All tests run in this JVM: [AnalyticsMergeStrategyTest, TestTrackingShardHandlerFactory, DefaultValueUpdateProcessorTest, TestDynamicFieldCollectionResource, SegmentsInfoRequestHandlerTest, PingRequestHandlerTest, TestBulkSchemaConcurrent, CopyFieldTest, PeerSyncTest, TestNRTOpen, TestCSVLoader, HLLUtilTest, SolrRequestParserTest, DateRangeFieldTest, TestSchemaManager, DeleteLastCustomShardedReplicaTest, HdfsThreadLeakTest, SpatialRPTFieldTypeTest, AssignTest, VMParamsZkACLAndCredentialsProvidersTest, TestJsonRequest, TestFoldingMultitermQuery, BasicZkTest, TestSolrConfigHandler, PathHierarchyTokenizerFactoryTest, TestManagedSchemaDynamicFieldResource, CurrencyFieldOpenExchangeTest, ResourceLoaderTest, TestRandomDVFaceting, TestArbitraryIndexDir, ReturnFieldsTest, SOLR749Test, StandardRequestHandlerTest, TestDocumentBuilder, TestDocBasedVersionConstraints, TestRangeQuery, LeaderInitiatedRecoveryOnShardRestartTest, TestBinaryField, TestSearcherReuse, IndexSchemaRuntimeFieldTest, TestFieldResource, TestDefaultStatsCache, TestRebalanceLeaders, TestExpandComponent, TestReplicationHandler, SolrCoreTest, TestSchemaResource, TestAddFieldRealTimeGet, OpenExchangeRatesOrgProviderTest, TestFaceting, ChangedSchemaMergeTest, IgnoreCommitOptimizeUpdateProcessorFactoryTest, DisMaxRequestHandlerTest, TestBlendedInfixSuggestions, TestReRankQParserPlugin, TestClusterStateMutator, TestRestoreCore, SolrCloudExampleTest]
   [junit4] Completed [144/542] on J0 in 44.80s, 1 test, 1 failure <<< FAILURES!

[...truncated 1264 lines...]
BUILD FAILED
/home/jenkins/workspace/Lucene-Solr-5.x-Linux/build.xml:785: The following error occurred while executing this line:
/home/jenkins/workspace/Lucene-Solr-5.x-Linux/build.xml:729: The following error occurred while executing this line:
/home/jenkins/workspace/Lucene-Solr-5.x-Linux/build.xml:59: The following error occurred while executing this line:
/home/jenkins/workspace/Lucene-Solr-5.x-Linux/solr/build.xml:233: The following error occurred while executing this line:
/home/jenkins/workspace/Lucene-Solr-5.x-Linux/solr/common-build.xml:526: The following error occurred while executing this line:
/home/jenkins/workspace/Lucene-Solr-5.x-Linux/lucene/common-build.xml:1452: The following error occurred while executing this line:
/home/jenkins/workspace/Lucene-Solr-5.x-Linux/lucene/common-build.xml:1006: There were test failures: 542 suites (7 ignored), 2142 tests, 1 failure, 73 ignored (36 assumptions) [seed: F2489A32244E4281]

Total time: 48 minutes 13 seconds
Build step 'Invoke Ant' marked build as failure
Archiving artifacts
[WARNINGS] Skipping publisher since build result is FAILURE
Recording test results
Email was triggered for: Failure - Any
Sending email for trigger: Failure - Any