You are viewing a plain text version of this content. The canonical link for it is here.
Posted to builds@hbase.apache.org by Apache Jenkins Server <je...@builds.apache.org> on 2015/04/23 10:31:57 UTC
Build failed in Jenkins: HBase-1.0 #878
See <https://builds.apache.org/job/HBase-1.0/878/changes>
Changes:
[jerryjch] HBASE-13526 TestRegionServerReportForDuty can be flaky: hang or timeout
------------------------------------------
[...truncated 2047 lines...]
+ cut -d ' ' -f 1
+ xargs -n 1 jstack
2015-04-23 08:29:35
Full thread dump Java HotSpot(TM) 64-Bit Server VM (24.55-b03 mixed mode):
"Attach Listener" daemon prio=10 tid=0x00007f841c002000 nid=0x102a waiting on condition [0x0000000000000000]
java.lang.Thread.State: RUNNABLE
"AsyncDispatcher event handler" prio=10 tid=0x0000000001db8000 nid=0xf02 waiting on condition [0x00007f8418801000]
java.lang.Thread.State: WAITING (parking)
at sun.misc.Unsafe.park(Native Method)
- parking to wait for <0x00000007af044438> (a java.util.concurrent.locks.AbstractQueuedSynchronizer$ConditionObject)
at java.util.concurrent.locks.LockSupport.park(LockSupport.java:186)
at java.util.concurrent.locks.AbstractQueuedSynchronizer$ConditionObject.await(AbstractQueuedSynchronizer.java:2043)
at java.util.concurrent.LinkedBlockingQueue.take(LinkedBlockingQueue.java:442)
at org.apache.hadoop.yarn.event.AsyncDispatcher$1.run(AsyncDispatcher.java:100)
at java.lang.Thread.run(Thread.java:745)
"Ping Checker" prio=10 tid=0x0000000001dbe000 nid=0xf01 waiting on condition [0x00007f8419283000]
java.lang.Thread.State: TIMED_WAITING (sleeping)
at java.lang.Thread.sleep(Native Method)
at org.apache.hadoop.yarn.util.AbstractLivelinessMonitor$PingChecker.run(AbstractLivelinessMonitor.java:133)
at java.lang.Thread.run(Thread.java:745)
"ResourceManager Event Processor" prio=10 tid=0x00000000022e9000 nid=0xf00 waiting on condition [0x00007f8418902000]
java.lang.Thread.State: WAITING (parking)
at sun.misc.Unsafe.park(Native Method)
- parking to wait for <0x00000007af0ef160> (a java.util.concurrent.locks.AbstractQueuedSynchronizer$ConditionObject)
at java.util.concurrent.locks.LockSupport.park(LockSupport.java:186)
at java.util.concurrent.locks.AbstractQueuedSynchronizer$ConditionObject.await(AbstractQueuedSynchronizer.java:2043)
at java.util.concurrent.LinkedBlockingQueue.take(LinkedBlockingQueue.java:442)
at org.apache.hadoop.yarn.server.resourcemanager.ResourceManager$SchedulerEventDispatcher$EventProcessor.run(ResourceManager.java:675)
at java.lang.Thread.run(Thread.java:745)
"Ping Checker" prio=10 tid=0x0000000001b4f800 nid=0xeff waiting on condition [0x00007f84099f0000]
java.lang.Thread.State: TIMED_WAITING (sleeping)
at java.lang.Thread.sleep(Native Method)
at org.apache.hadoop.yarn.util.AbstractLivelinessMonitor$PingChecker.run(AbstractLivelinessMonitor.java:133)
at java.lang.Thread.run(Thread.java:745)
"Ping Checker" prio=10 tid=0x0000000001559800 nid=0xefe waiting on condition [0x00007f8409af1000]
java.lang.Thread.State: TIMED_WAITING (sleeping)
at java.lang.Thread.sleep(Native Method)
at org.apache.hadoop.yarn.util.AbstractLivelinessMonitor$PingChecker.run(AbstractLivelinessMonitor.java:133)
at java.lang.Thread.run(Thread.java:745)
"Ping Checker" prio=10 tid=0x00000000019d8000 nid=0xefd waiting on condition [0x00007f8409bf2000]
java.lang.Thread.State: TIMED_WAITING (sleeping)
at java.lang.Thread.sleep(Native Method)
at org.apache.hadoop.yarn.util.AbstractLivelinessMonitor$PingChecker.run(AbstractLivelinessMonitor.java:133)
at java.lang.Thread.run(Thread.java:745)
"Thread[Thread-37,5,main]" daemon prio=10 tid=0x00000000019d9000 nid=0xefc waiting on condition [0x00007f8409cf3000]
java.lang.Thread.State: TIMED_WAITING (sleeping)
at java.lang.Thread.sleep(Native Method)
at org.apache.hadoop.security.token.delegation.AbstractDelegationTokenSecretManager$ExpiredTokenRemover.run(AbstractDelegationTokenSecretManager.java:657)
at java.lang.Thread.run(Thread.java:745)
"AsyncDispatcher event handler" prio=10 tid=0x0000000001531800 nid=0xefb waiting on condition [0x00007f8409df4000]
java.lang.Thread.State: WAITING (parking)
at sun.misc.Unsafe.park(Native Method)
- parking to wait for <0x00000007aead34d8> (a java.util.concurrent.locks.AbstractQueuedSynchronizer$ConditionObject)
at java.util.concurrent.locks.LockSupport.park(LockSupport.java:186)
at java.util.concurrent.locks.AbstractQueuedSynchronizer$ConditionObject.await(AbstractQueuedSynchronizer.java:2043)
at java.util.concurrent.LinkedBlockingQueue.take(LinkedBlockingQueue.java:442)
at org.apache.hadoop.yarn.event.AsyncDispatcher$1.run(AsyncDispatcher.java:100)
at java.lang.Thread.run(Thread.java:745)
"Timer-11" prio=10 tid=0x0000000000eef800 nid=0xefa in Object.wait() [0x00007f8409ef5000]
java.lang.Thread.State: TIMED_WAITING (on object monitor)
at java.lang.Object.wait(Native Method)
- waiting on <0x00000007af351680> (a java.util.TaskQueue)
at java.util.TimerThread.mainLoop(Timer.java:552)
- locked <0x00000007af351680> (a java.util.TaskQueue)
at java.util.TimerThread.run(Timer.java:505)
"Timer for 'ResourceManager' metrics system" daemon prio=10 tid=0x0000000001b09800 nid=0xef9 in Object.wait() [0x00007f8409ff6000]
java.lang.Thread.State: TIMED_WAITING (on object monitor)
at java.lang.Object.wait(Native Method)
- waiting on <0x00000007af1ed8c0> (a java.util.TaskQueue)
at java.util.TimerThread.mainLoop(Timer.java:552)
- locked <0x00000007af1ed8c0> (a java.util.TaskQueue)
at java.util.TimerThread.run(Timer.java:505)
"Timer-10" prio=10 tid=0x0000000000efb000 nid=0xef8 in Object.wait() [0x00007f840a3fa000]
java.lang.Thread.State: TIMED_WAITING (on object monitor)
at java.lang.Object.wait(Native Method)
- waiting on <0x00000007af072178> (a java.util.TaskQueue)
at java.util.TimerThread.mainLoop(Timer.java:552)
- locked <0x00000007af072178> (a java.util.TaskQueue)
at java.util.TimerThread.run(Timer.java:505)
"Timer-9" prio=10 tid=0x00000000012ed800 nid=0xef7 in Object.wait() [0x00007f840a2f9000]
java.lang.Thread.State: TIMED_WAITING (on object monitor)
at java.lang.Object.wait(Native Method)
- waiting on <0x00000007af069f80> (a java.util.TaskQueue)
at java.util.TimerThread.mainLoop(Timer.java:552)
- locked <0x00000007af069f80> (a java.util.TaskQueue)
at java.util.TimerThread.run(Timer.java:505)
"Timer-8" prio=10 tid=0x000000000127f000 nid=0xef6 in Object.wait() [0x00007f840a1f8000]
java.lang.Thread.State: TIMED_WAITING (on object monitor)
at java.lang.Object.wait(Native Method)
- waiting on <0x00000007af061dc8> (a java.util.TaskQueue)
at java.util.TimerThread.mainLoop(Timer.java:552)
- locked <0x00000007af061dc8> (a java.util.TaskQueue)
at java.util.TimerThread.run(Timer.java:505)
"Thread-29" prio=10 tid=0x00007f842483e800 nid=0xef5 waiting on condition [0x00007f8419aa4000]
java.lang.Thread.State: TIMED_WAITING (sleeping)
at java.lang.Thread.sleep(Native Method)
at org.apache.hadoop.yarn.server.resourcemanager.MockAM.waitForState(MockAM.java:83)
at org.apache.hadoop.yarn.server.resourcemanager.MockRM.sendAMLaunched(MockRM.java:507)
at org.apache.hadoop.yarn.server.resourcemanager.MockRM.launchAM(MockRM.java:689)
at org.apache.hadoop.yarn.server.resourcemanager.MockRM.launchAndRegisterAM(MockRM.java:696)
at org.apache.hadoop.yarn.server.resourcemanager.MockRM.waitForNewAMToLaunchAndRegister(MockRM.java:194)
at org.apache.hadoop.yarn.server.resourcemanager.applicationsmanager.TestAMRestart.testShouldNotCountFailureToMaxAttemptRetry(TestAMRestart.java:448)
at sun.reflect.NativeMethodAccessorImpl.invoke0(Native Method)
at sun.reflect.NativeMethodAccessorImpl.invoke(NativeMethodAccessorImpl.java:57)
at sun.reflect.DelegatingMethodAccessorImpl.invoke(DelegatingMethodAccessorImpl.java:43)
at java.lang.reflect.Method.invoke(Method.java:606)
at org.junit.runners.model.FrameworkMethod$1.runReflectiveCall(FrameworkMethod.java:47)
at org.junit.internal.runners.model.ReflectiveCallable.run(ReflectiveCallable.java:12)
at org.junit.runners.model.FrameworkMethod.invokeExplosively(FrameworkMethod.java:44)
at org.junit.internal.runners.statements.InvokeMethod.evaluate(InvokeMethod.java:17)
at org.junit.internal.runners.statements.FailOnTimeout$StatementThread.run(FailOnTimeout.java:74)
"Timer-7" prio=10 tid=0x0000000000ef1000 nid=0xee4 in Object.wait() [0x00007f840a0f7000]
java.lang.Thread.State: TIMED_WAITING (on object monitor)
at java.lang.Object.wait(Native Method)
- waiting on <0x00000007b686b640> (a java.util.TaskQueue)
at java.util.TimerThread.mainLoop(Timer.java:552)
- locked <0x00000007b686b640> (a java.util.TaskQueue)
at java.util.TimerThread.run(Timer.java:505)
"Timer-3" prio=10 tid=0x0000000001524800 nid=0xec8 in Object.wait() [0x00007f84185ff000]
java.lang.Thread.State: TIMED_WAITING (on object monitor)
at java.lang.Object.wait(Native Method)
- waiting on <0x00000007b686bae0> (a java.util.TaskQueue)
at java.util.TimerThread.mainLoop(Timer.java:552)
- locked <0x00000007b686bae0> (a java.util.TaskQueue)
at java.util.TimerThread.run(Timer.java:505)
"Service Thread" daemon prio=10 tid=0x00007f8424291000 nid=0xebc runnable [0x0000000000000000]
java.lang.Thread.State: RUNNABLE
"C2 CompilerThread1" daemon prio=10 tid=0x00007f842428f000 nid=0xebb waiting on condition [0x0000000000000000]
java.lang.Thread.State: RUNNABLE
"C2 CompilerThread0" daemon prio=10 tid=0x00007f842428c000 nid=0xeba waiting on condition [0x0000000000000000]
java.lang.Thread.State: RUNNABLE
"Signal Dispatcher" daemon prio=10 tid=0x00007f8424281800 nid=0xeb9 runnable [0x0000000000000000]
java.lang.Thread.State: RUNNABLE
"Finalizer" daemon prio=10 tid=0x00007f842426b000 nid=0xeb8 in Object.wait() [0x00007f841a6e5000]
java.lang.Thread.State: WAITING (on object monitor)
at java.lang.Object.wait(Native Method)
- waiting on <0x00000007b693b620> (a java.lang.ref.ReferenceQueue$Lock)
at java.lang.ref.ReferenceQueue.remove(ReferenceQueue.java:135)
- locked <0x00000007b693b620> (a java.lang.ref.ReferenceQueue$Lock)
at java.lang.ref.ReferenceQueue.remove(ReferenceQueue.java:151)
at java.lang.ref.Finalizer$FinalizerThread.run(Finalizer.java:189)
"Reference Handler" daemon prio=10 tid=0x00007f8424267000 nid=0xeb7 in Object.wait() [0x00007f841a7e6000]
java.lang.Thread.State: WAITING (on object monitor)
at java.lang.Object.wait(Native Method)
- waiting on <0x00000007b691a938> (a java.lang.ref.Reference$Lock)
at java.lang.Object.wait(Object.java:503)
at java.lang.ref.Reference$ReferenceHandler.run(Reference.java:133)
- locked <0x00000007b691a938> (a java.lang.ref.Reference$Lock)
"main" prio=10 tid=0x00007f842400a800 nid=0xea8 in Object.wait() [0x00007f842dcca000]
java.lang.Thread.State: TIMED_WAITING (on object monitor)
at java.lang.Object.wait(Native Method)
- waiting on <0x00000007ae658658> (a org.junit.internal.runners.statements.FailOnTimeout$StatementThread)
at java.lang.Thread.join(Thread.java:1289)
- locked <0x00000007ae658658> (a org.junit.internal.runners.statements.FailOnTimeout$StatementThread)
at org.junit.internal.runners.statements.FailOnTimeout.evaluateStatement(FailOnTimeout.java:26)
at org.junit.internal.runners.statements.FailOnTimeout.evaluate(FailOnTimeout.java:17)
at org.junit.runners.ParentRunner.runLeaf(ParentRunner.java:271)
at org.junit.runners.BlockJUnit4ClassRunner.runChild(BlockJUnit4ClassRunner.java:70)
at org.junit.runners.BlockJUnit4ClassRunner.runChild(BlockJUnit4ClassRunner.java:50)
at org.junit.runners.ParentRunner$3.run(ParentRunner.java:238)
at org.junit.runners.ParentRunner$1.schedule(ParentRunner.java:63)
at org.junit.runners.ParentRunner.runChildren(ParentRunner.java:236)
at org.junit.runners.ParentRunner.access$000(ParentRunner.java:53)
at org.junit.runners.ParentRunner$2.evaluate(ParentRunner.java:229)
at org.junit.runners.ParentRunner.run(ParentRunner.java:309)
at org.apache.maven.surefire.junit4.JUnit4Provider.execute(JUnit4Provider.java:264)
at org.apache.maven.surefire.junit4.JUnit4Provider.executeTestSet(JUnit4Provider.java:153)
at org.apache.maven.surefire.junit4.JUnit4Provider.invoke(JUnit4Provider.java:124)
at org.apache.maven.surefire.booter.ForkedBooter.invokeProviderInSameClassLoader(ForkedBooter.java:200)
at org.apache.maven.surefire.booter.ForkedBooter.runSuitesInProcess(ForkedBooter.java:153)
at org.apache.maven.surefire.booter.ForkedBooter.main(ForkedBooter.java:103)
"VM Thread" prio=10 tid=0x00007f8424264800 nid=0xeb6 runnable
"GC task thread#0 (ParallelGC)" prio=10 tid=0x00007f8424020000 nid=0xea9 runnable
"GC task thread#1 (ParallelGC)" prio=10 tid=0x00007f8424022000 nid=0xeaa runnable
"GC task thread#2 (ParallelGC)" prio=10 tid=0x00007f8424024000 nid=0xeab runnable
"GC task thread#3 (ParallelGC)" prio=10 tid=0x00007f8424025800 nid=0xeac runnable
"GC task thread#4 (ParallelGC)" prio=10 tid=0x00007f8424027800 nid=0xead runnable
"GC task thread#5 (ParallelGC)" prio=10 tid=0x00007f8424029800 nid=0xeae runnable
"GC task thread#6 (ParallelGC)" prio=10 tid=0x00007f842402b800 nid=0xeaf runnable
"GC task thread#7 (ParallelGC)" prio=10 tid=0x00007f842402d000 nid=0xeb0 runnable
"GC task thread#8 (ParallelGC)" prio=10 tid=0x00007f842402f000 nid=0xeb1 runnable
"GC task thread#9 (ParallelGC)" prio=10 tid=0x00007f8424031000 nid=0xeb2 runnable
"GC task thread#10 (ParallelGC)" prio=10 tid=0x00007f8424032800 nid=0xeb3 runnable
"GC task thread#11 (ParallelGC)" prio=10 tid=0x00007f8424034800 nid=0xeb4 runnable
"GC task thread#12 (ParallelGC)" prio=10 tid=0x00007f8424036800 nid=0xeb5 runnable
"VM Periodic Task Thread" prio=10 tid=0x00007f842429c000 nid=0xebd waiting on condition
JNI global references: 289
+ echo '************ END zombies jstack extract'
************ END zombies jstack extract
+ JIRA_COMMENT='
{color:red}-1 core zombie tests{color}. There are 1 zombie test(s): at org.apache.hadoop.yarn.server.resourcemanager.applicationsmanager.TestAMRestart.testShouldNotCountFailureToMaxAttemptRetry(TestAMRestart.java:441)'
+ BAD=1
+ jps
+ grep surefirebooter
+ cut -d ' ' -f 1
+ xargs kill -9
POST BUILD TASK : SUCCESS
END OF POST BUILD TASK : 0
Archiving artifacts
Sending artifact delta relative to HBase-1.0 #868
Archived 1893 artifacts
Archive block size is 32768
Received 27 blocks and 400196947 bytes
Compression is 0.2%
Took 2 min 8 sec
Recording test results
Updating HBASE-13526
Jenkins build is back to normal : HBase-1.0 #881
Posted by Apache Jenkins Server <je...@builds.apache.org>.
See <https://builds.apache.org/job/HBase-1.0/881/changes>
Build failed in Jenkins: HBase-1.0 #880
Posted by Apache Jenkins Server <je...@builds.apache.org>.
See <https://builds.apache.org/job/HBase-1.0/880/changes>
Changes:
[busbey] HBASE-13546 handle nulls in MasterAddressTracker when there is no master active.
------------------------------------------
[...truncated 1866 lines...]
Running org.apache.hadoop.hbase.security.visibility.TestVisibilityLabelsWithDeletes
Tests run: 23, Failures: 0, Errors: 0, Skipped: 0, Time elapsed: 19.562 sec - in org.apache.hadoop.hbase.security.visibility.TestVisibilityLabelsWithDistributedLogReplay
Running org.apache.hadoop.hbase.security.visibility.TestEnforcingScanLabelGenerator
Tests run: 1, Failures: 0, Errors: 0, Skipped: 0, Time elapsed: 2.659 sec - in org.apache.hadoop.hbase.security.visibility.TestEnforcingScanLabelGenerator
Tests run: 1, Failures: 0, Errors: 0, Skipped: 0, Time elapsed: 24.091 sec - in org.apache.hadoop.hbase.security.visibility.TestVisibilityLabelsReplication
Running org.apache.hadoop.hbase.security.visibility.TestDefaultScanLabelGeneratorStack
Tests run: 1, Failures: 0, Errors: 0, Skipped: 0, Time elapsed: 1.822 sec - in org.apache.hadoop.hbase.security.visibility.TestDefaultScanLabelGeneratorStack
Running org.apache.hadoop.hbase.security.visibility.TestVisibilityWithCheckAuths
Tests run: 2, Failures: 0, Errors: 0, Skipped: 0, Time elapsed: 3.665 sec - in org.apache.hadoop.hbase.security.visibility.TestVisibilityWithCheckAuths
Running org.apache.hadoop.hbase.security.visibility.TestVisibilityLabelsOpWithDifferentUsersNoACL
Running org.apache.hadoop.hbase.security.visibility.TestWithDisabledAuthorization
Tests run: 1, Failures: 0, Errors: 0, Skipped: 0, Time elapsed: 2.338 sec - in org.apache.hadoop.hbase.security.visibility.TestVisibilityLabelsOpWithDifferentUsersNoACL
Tests run: 2, Failures: 0, Errors: 0, Skipped: 0, Time elapsed: 3.767 sec - in org.apache.hadoop.hbase.security.visibility.TestWithDisabledAuthorization
Running org.apache.hadoop.hbase.security.visibility.TestVisibilityLabelsWithDefaultVisLabelService
Running org.apache.hadoop.hbase.security.visibility.TestVisibilityLabelsWithACL
Running org.apache.hadoop.hbase.security.visibility.TestVisibilityLablesWithGroups
Tests run: 1, Failures: 0, Errors: 0, Skipped: 0, Time elapsed: 3.193 sec - in org.apache.hadoop.hbase.security.visibility.TestVisibilityLablesWithGroups
Tests run: 5, Failures: 0, Errors: 0, Skipped: 0, Time elapsed: 7.476 sec - in org.apache.hadoop.hbase.security.visibility.TestVisibilityLabelsWithACL
Tests run: 37, Failures: 0, Errors: 0, Skipped: 0, Time elapsed: 56.356 sec - in org.apache.hadoop.hbase.security.visibility.TestVisibilityLabelsWithDeletes
Tests run: 23, Failures: 0, Errors: 0, Skipped: 0, Time elapsed: 19.974 sec - in org.apache.hadoop.hbase.security.visibility.TestVisibilityLabelsWithDefaultVisLabelService
Running org.apache.hadoop.hbase.security.visibility.TestVisibilityLabelsWithCustomVisLabService
Running org.apache.hadoop.hbase.security.access.TestAccessController2
Running org.apache.hadoop.hbase.security.access.TestAccessController
Running org.apache.hadoop.hbase.security.access.TestTablePermissions
Tests run: 19, Failures: 0, Errors: 0, Skipped: 0, Time elapsed: 16.274 sec - in org.apache.hadoop.hbase.security.visibility.TestVisibilityLabelsWithCustomVisLabService
Tests run: 8, Failures: 0, Errors: 0, Skipped: 0, Time elapsed: 220.598 sec - in org.apache.hadoop.hbase.replication.regionserver.TestReplicationWALReaderManager
Running org.apache.hadoop.hbase.security.access.TestAccessControlFilter
Tests run: 4, Failures: 0, Errors: 0, Skipped: 0, Time elapsed: 24.053 sec - in org.apache.hadoop.hbase.security.access.TestAccessController2
Tests run: 1, Failures: 0, Errors: 0, Skipped: 0, Time elapsed: 3.728 sec - in org.apache.hadoop.hbase.security.access.TestAccessControlFilter
Running org.apache.hadoop.hbase.security.access.TestCellACLs
Running org.apache.hadoop.hbase.security.access.TestWithDisabledAuthorization
Tests run: 2, Failures: 0, Errors: 0, Skipped: 0, Time elapsed: 9.4 sec - in org.apache.hadoop.hbase.security.access.TestCellACLs
Running org.apache.hadoop.hbase.security.access.TestNamespaceCommands
Tests run: 7, Failures: 0, Errors: 0, Skipped: 0, Time elapsed: 33.007 sec - in org.apache.hadoop.hbase.security.access.TestTablePermissions
Running org.apache.hadoop.hbase.security.access.TestZKPermissionsWatcher
Running org.apache.hadoop.hbase.security.access.TestScanEarlyTermination
Tests run: 7, Failures: 0, Errors: 0, Skipped: 0, Time elapsed: 11.36 sec - in org.apache.hadoop.hbase.security.access.TestNamespaceCommands
Tests run: 1, Failures: 0, Errors: 0, Skipped: 0, Time elapsed: 3.53 sec - in org.apache.hadoop.hbase.security.access.TestZKPermissionsWatcher
Running org.apache.hadoop.hbase.security.token.TestZKSecretWatcher
Tests run: 1, Failures: 0, Errors: 0, Skipped: 0, Time elapsed: 4.527 sec - in org.apache.hadoop.hbase.security.access.TestScanEarlyTermination
Running org.apache.hadoop.hbase.security.token.TestTokenAuthentication
Tests run: 3, Failures: 0, Errors: 0, Skipped: 0, Time elapsed: 0.506 sec - in org.apache.hadoop.hbase.security.token.TestTokenAuthentication
Running org.apache.hadoop.hbase.security.access.TestCellACLWithMultipleVersions
Running org.apache.hadoop.hbase.TestMetaTableAccessorNoCluster
Tests run: 2, Failures: 0, Errors: 0, Skipped: 0, Time elapsed: 3.334 sec - in org.apache.hadoop.hbase.TestMetaTableAccessorNoCluster
Running org.apache.hadoop.hbase.TestMetaTableLocator
Tests run: 1, Failures: 0, Errors: 0, Skipped: 0, Time elapsed: 13.223 sec - in org.apache.hadoop.hbase.security.token.TestZKSecretWatcher
Tests run: 7, Failures: 0, Errors: 0, Skipped: 0, Time elapsed: 3.391 sec - in org.apache.hadoop.hbase.TestMetaTableLocator
Running org.apache.hadoop.hbase.TestHBaseTestingUtility
Running org.apache.hadoop.hbase.TestZooKeeper
Tests run: 6, Failures: 0, Errors: 0, Skipped: 0, Time elapsed: 38.503 sec - in org.apache.hadoop.hbase.security.access.TestWithDisabledAuthorization
Running org.apache.hadoop.hbase.snapshot.TestSnapshotDescriptionUtils
Tests run: 2, Failures: 0, Errors: 0, Skipped: 0, Time elapsed: 0.186 sec - in org.apache.hadoop.hbase.snapshot.TestSnapshotDescriptionUtils
Tests run: 8, Failures: 0, Errors: 0, Skipped: 0, Time elapsed: 27.467 sec - in org.apache.hadoop.hbase.security.access.TestCellACLWithMultipleVersions
Running org.apache.hadoop.hbase.snapshot.TestFlushSnapshotFromClient
Running org.apache.hadoop.hbase.snapshot.TestSecureExportSnapshot
Tests run: 9, Failures: 0, Errors: 0, Skipped: 0, Time elapsed: 50.976 sec - in org.apache.hadoop.hbase.TestHBaseTestingUtility
Tests run: 9, Failures: 0, Errors: 0, Skipped: 0, Time elapsed: 39.666 sec - in org.apache.hadoop.hbase.snapshot.TestFlushSnapshotFromClient
Running org.apache.hadoop.hbase.snapshot.TestSnapshotClientRetries
Running org.apache.hadoop.hbase.snapshot.TestExportSnapshot
Tests run: 2, Failures: 0, Errors: 0, Skipped: 0, Time elapsed: 16.42 sec - in org.apache.hadoop.hbase.snapshot.TestSnapshotClientRetries
Running org.apache.hadoop.hbase.snapshot.TestRestoreFlushSnapshotFromClient
Tests run: 5, Failures: 0, Errors: 0, Skipped: 0, Time elapsed: 46.368 sec - in org.apache.hadoop.hbase.snapshot.TestRestoreFlushSnapshotFromClient
Running org.apache.hadoop.hbase.TestInfoServers
Tests run: 3, Failures: 0, Errors: 0, Skipped: 0, Time elapsed: 2.278 sec - in org.apache.hadoop.hbase.TestInfoServers
Running org.apache.hadoop.hbase.procedure.TestZKProcedureControllers
Tests run: 4, Failures: 0, Errors: 0, Skipped: 0, Time elapsed: 1.614 sec - in org.apache.hadoop.hbase.procedure.TestZKProcedureControllers
Running org.apache.hadoop.hbase.procedure.TestZKProcedure
Tests run: 4, Failures: 0, Errors: 0, Skipped: 0, Time elapsed: 1.942 sec - in org.apache.hadoop.hbase.procedure.TestZKProcedure
Tests run: 11, Failures: 0, Errors: 0, Skipped: 0, Time elapsed: 159.585 sec - in org.apache.hadoop.hbase.TestZooKeeper
Running org.apache.hadoop.hbase.io.hfile.TestForceCacheImportantBlocks
Running org.apache.hadoop.hbase.io.hfile.TestCacheOnWrite
Tests run: 54, Failures: 0, Errors: 0, Skipped: 0, Time elapsed: 255.105 sec - in org.apache.hadoop.hbase.security.access.TestAccessController
Running org.apache.hadoop.hbase.io.hfile.TestHFileBlock
Tests run: 4, Failures: 0, Errors: 0, Skipped: 0, Time elapsed: 42.363 sec - in org.apache.hadoop.hbase.io.hfile.TestForceCacheImportantBlocks
Running org.apache.hadoop.hbase.io.hfile.TestHFileBlockIndex
Tests run: 10, Failures: 0, Errors: 0, Skipped: 0, Time elapsed: 13.399 sec - in org.apache.hadoop.hbase.io.hfile.TestHFileBlockIndex
Running org.apache.hadoop.hbase.io.hfile.TestHFileSeek
Tests run: 1, Failures: 0, Errors: 0, Skipped: 0, Time elapsed: 2.277 sec - in org.apache.hadoop.hbase.io.hfile.TestHFileSeek
Running org.apache.hadoop.hbase.io.hfile.TestScannerSelectionUsingTTL
Tests run: 28, Failures: 0, Errors: 0, Skipped: 0, Time elapsed: 95.244 sec - in org.apache.hadoop.hbase.io.hfile.TestHFileBlock
Running org.apache.hadoop.hbase.io.hfile.TestCacheConfig
Tests run: 6, Failures: 0, Errors: 0, Skipped: 0, Time elapsed: 2.644 sec - in org.apache.hadoop.hbase.io.hfile.TestCacheConfig
Running org.apache.hadoop.hbase.io.encoding.TestDataBlockEncoders
Tests run: 6, Failures: 0, Errors: 0, Skipped: 0, Time elapsed: 63.301 sec - in org.apache.hadoop.hbase.io.hfile.TestScannerSelectionUsingTTL
Running org.apache.hadoop.hbase.io.encoding.TestEncodedSeekers
Tests run: 9, Failures: 0, Errors: 0, Skipped: 0, Time elapsed: 299.479 sec - in org.apache.hadoop.hbase.snapshot.TestSecureExportSnapshot
Running org.apache.hadoop.hbase.io.encoding.TestBufferedDataBlockEncoder
Tests run: 1, Failures: 0, Errors: 0, Skipped: 0, Time elapsed: 26.022 sec - in org.apache.hadoop.hbase.io.encoding.TestBufferedDataBlockEncoder
Running org.apache.hadoop.hbase.io.encoding.TestChangingEncoding
Tests run: 9, Failures: 0, Errors: 0, Skipped: 0, Time elapsed: 298.182 sec - in org.apache.hadoop.hbase.snapshot.TestExportSnapshot
Running org.apache.hadoop.hbase.io.encoding.TestLoadAndSwitchEncodeOnDisk
Tests run: 1, Failures: 0, Errors: 0, Skipped: 0, Time elapsed: 23.739 sec - in org.apache.hadoop.hbase.io.encoding.TestLoadAndSwitchEncodeOnDisk
Running org.apache.hadoop.hbase.io.TestFileLink
Tests run: 3, Failures: 0, Errors: 0, Skipped: 0, Time elapsed: 15.851 sec - in org.apache.hadoop.hbase.io.TestFileLink
Running org.apache.hadoop.hbase.wal.TestWALFactory
Tests run: 20, Failures: 0, Errors: 0, Skipped: 0, Time elapsed: 133.027 sec - in org.apache.hadoop.hbase.io.encoding.TestEncodedSeekers
Running org.apache.hadoop.hbase.wal.TestWALFiltering
Tests run: 9, Failures: 0, Errors: 0, Skipped: 0, Time elapsed: 15.807 sec - in org.apache.hadoop.hbase.wal.TestWALFactory
Running org.apache.hadoop.hbase.wal.TestWALReaderOnSecureWAL
Tests run: 2, Failures: 0, Errors: 0, Skipped: 0, Time elapsed: 1.86 sec - in org.apache.hadoop.hbase.wal.TestWALReaderOnSecureWAL
Running org.apache.hadoop.hbase.wal.TestDefaultWALProvider
Tests run: 5, Failures: 0, Errors: 0, Skipped: 0, Time elapsed: 7.062 sec - in org.apache.hadoop.hbase.wal.TestDefaultWALProvider
Tests run: 1, Failures: 0, Errors: 0, Skipped: 0, Time elapsed: 25.378 sec - in org.apache.hadoop.hbase.wal.TestWALFiltering
Running org.apache.hadoop.hbase.wal.TestWALSplit
Running org.apache.hadoop.hbase.wal.TestSecureWAL
Tests run: 1, Failures: 0, Errors: 0, Skipped: 0, Time elapsed: 1.309 sec - in org.apache.hadoop.hbase.wal.TestSecureWAL
Tests run: 3, Failures: 0, Errors: 0, Skipped: 0, Time elapsed: 103.095 sec - in org.apache.hadoop.hbase.io.encoding.TestChangingEncoding
Running org.apache.hadoop.hbase.wal.TestDefaultWALProviderWithHLogKey
Running org.apache.hadoop.hbase.wal.TestBoundedRegionGroupingProvider
Tests run: 5, Failures: 0, Errors: 0, Skipped: 0, Time elapsed: 7.322 sec - in org.apache.hadoop.hbase.wal.TestDefaultWALProviderWithHLogKey
Running org.apache.hadoop.hbase.wal.TestWALSplitCompressed
Tests run: 5, Failures: 0, Errors: 0, Skipped: 0, Time elapsed: 21.843 sec - in org.apache.hadoop.hbase.wal.TestBoundedRegionGroupingProvider
Running org.apache.hadoop.hbase.zookeeper.TestZooKeeperACL
Tests run: 6, Failures: 0, Errors: 0, Skipped: 0, Time elapsed: 0.251 sec - in org.apache.hadoop.hbase.zookeeper.TestZooKeeperACL
Running org.apache.hadoop.hbase.zookeeper.TestZKLeaderManager
Tests run: 1, Failures: 0, Errors: 0, Skipped: 0, Time elapsed: 0.127 sec - in org.apache.hadoop.hbase.zookeeper.TestZKLeaderManager
Running org.apache.hadoop.hbase.zookeeper.TestZooKeeperNodeTracker
Tests run: 3, Failures: 0, Errors: 0, Skipped: 0, Time elapsed: 0.823 sec - in org.apache.hadoop.hbase.zookeeper.TestZooKeeperNodeTracker
Running org.apache.hadoop.hbase.zookeeper.TestRecoverableZooKeeper
Tests run: 1, Failures: 0, Errors: 0, Skipped: 0, Time elapsed: 1.216 sec - in org.apache.hadoop.hbase.zookeeper.TestRecoverableZooKeeper
Running org.apache.hadoop.hbase.zookeeper.TestZKTableStateManager
Tests run: 1, Failures: 0, Errors: 0, Skipped: 0, Time elapsed: 0.738 sec - in org.apache.hadoop.hbase.zookeeper.TestZKTableStateManager
Running org.apache.hadoop.hbase.zookeeper.TestZKMulti
Tests run: 6, Failures: 0, Errors: 0, Skipped: 0, Time elapsed: 0.327 sec - in org.apache.hadoop.hbase.zookeeper.TestZKMulti
Running org.apache.hadoop.hbase.zookeeper.lock.TestZKInterProcessReadWriteLock
Tests run: 6, Failures: 0, Errors: 0, Skipped: 0, Time elapsed: 24.441 sec - in org.apache.hadoop.hbase.zookeeper.lock.TestZKInterProcessReadWriteLock
Running org.apache.hadoop.hbase.zookeeper.TestHQuorumPeer
Tests run: 3, Failures: 0, Errors: 0, Skipped: 0, Time elapsed: 2.492 sec - in org.apache.hadoop.hbase.zookeeper.TestHQuorumPeer
Tests run: 28, Failures: 0, Errors: 0, Skipped: 0, Time elapsed: 257.095 sec - in org.apache.hadoop.hbase.io.encoding.TestDataBlockEncoders
Running org.apache.hadoop.hbase.TestIOFencing
Running org.apache.hadoop.hbase.constraint.TestConstraint
Tests run: 5, Failures: 0, Errors: 0, Skipped: 0, Time elapsed: 5.811 sec - in org.apache.hadoop.hbase.constraint.TestConstraint
Running org.apache.hadoop.hbase.backup.TestHFileArchiving
Tests run: 5, Failures: 0, Errors: 0, Skipped: 0, Time elapsed: 38.412 sec - in org.apache.hadoop.hbase.backup.TestHFileArchiving
Running org.apache.hadoop.hbase.backup.example.TestZooKeeperTableArchiveClient
Tests run: 216, Failures: 0, Errors: 0, Skipped: 0, Time elapsed: 452.261 sec - in org.apache.hadoop.hbase.io.hfile.TestCacheOnWrite
Tests run: 3, Failures: 0, Errors: 0, Skipped: 0, Time elapsed: 3.868 sec - in org.apache.hadoop.hbase.backup.example.TestZooKeeperTableArchiveClient
Running org.apache.hadoop.hbase.ipc.TestProtoBufRpc
Tests run: 1, Failures: 0, Errors: 0, Skipped: 0, Time elapsed: 1.589 sec - in org.apache.hadoop.hbase.ipc.TestProtoBufRpc
Running org.apache.hadoop.hbase.ipc.TestDelayedRpc
Running org.apache.hadoop.hbase.TestHColumnDescriptorDefaultVersions
Tests run: 4, Failures: 0, Errors: 0, Skipped: 0, Time elapsed: 3.594 sec - in org.apache.hadoop.hbase.ipc.TestDelayedRpc
Running org.apache.hadoop.hbase.ipc.TestHBaseClient
Tests run: 1, Failures: 0, Errors: 0, Skipped: 0, Time elapsed: 0.363 sec - in org.apache.hadoop.hbase.ipc.TestHBaseClient
Tests run: 3, Failures: 0, Errors: 0, Skipped: 0, Time elapsed: 14.162 sec - in org.apache.hadoop.hbase.TestHColumnDescriptorDefaultVersions
Running org.apache.hadoop.hbase.TestNamespace
Tests run: 31, Failures: 0, Errors: 0, Skipped: 0, Time elapsed: 181.807 sec - in org.apache.hadoop.hbase.wal.TestWALSplit
Tests run: 9, Failures: 0, Errors: 0, Skipped: 1, Time elapsed: 6.959 sec - in org.apache.hadoop.hbase.TestNamespace
Tests run: 31, Failures: 0, Errors: 0, Skipped: 0, Time elapsed: 184.629 sec - in org.apache.hadoop.hbase.wal.TestWALSplitCompressed
Tests run: 2, Failures: 0, Errors: 0, Skipped: 0, Time elapsed: 205.925 sec - in org.apache.hadoop.hbase.TestIOFencing
Results :
Failed tests:
TestSnapshotCloneIndependence.testOnlineSnapshotDeleteIndependent:182->runTestSnapshotDeleteIndependent:425 expected:<17576> but was:<13798>
Tests in error:
TestLoadIncrementalHFiles.setUpBeforeClass:83 » IO Shutting down
TestMultithreadedTableMapper.beforeClass:68 » IO Shutting down
Tests run: 2306, Failures: 1, Errors: 2, Skipped: 17
[INFO] ------------------------------------------------------------------------
[INFO] Reactor Summary:
[INFO]
[INFO] HBase ............................................. SUCCESS [5.078s]
[INFO] HBase - Checkstyle ................................ SUCCESS [0.932s]
[INFO] HBase - Annotations ............................... SUCCESS [1.307s]
[INFO] HBase - Common .................................... SUCCESS [1:11.016s]
[INFO] HBase - Protocol .................................. SUCCESS [18.581s]
[INFO] HBase - Client .................................... SUCCESS [1:41.829s]
[INFO] HBase - Hadoop Compatibility ...................... SUCCESS [8.079s]
[INFO] HBase - Hadoop Two Compatibility .................. SUCCESS [9.425s]
[INFO] HBase - Prefix Tree ............................... SUCCESS [14.806s]
[INFO] HBase - Server .................................... FAILURE [1:17:13.783s]
[INFO] HBase - Testing Util .............................. SKIPPED
[INFO] HBase - Thrift .................................... SKIPPED
[INFO] HBase - Rest ...................................... SKIPPED
[INFO] HBase - Shell ..................................... SKIPPED
[INFO] HBase - Integration Tests ......................... SKIPPED
[INFO] HBase - Examples .................................. SKIPPED
[INFO] HBase - Assembly .................................. SKIPPED
[INFO] ------------------------------------------------------------------------
[INFO] BUILD FAILURE
[INFO] ------------------------------------------------------------------------
[INFO] Total time: 1:21:05.822s
[INFO] Finished at: Fri Apr 24 21:01:47 UTC 2015
[INFO] Final Memory: 47M/1107M
[INFO] ------------------------------------------------------------------------
[ERROR] Failed to execute goal org.apache.maven.plugins:maven-surefire-plugin:2.18:test (secondPartTestsExecution) on project hbase-server: ExecutionException: java.lang.RuntimeException: The forked VM terminated without properly saying goodbye. VM crash or System.exit called?
[ERROR] Command was /bin/sh -c cd <https://builds.apache.org/job/HBase-1.0/ws/hbase-server> && /home/jenkins/tools/java/jdk1.7.0_25-32/jre/bin/java -enableassertions -XX:MaxDirectMemorySize=1G -Xmx2800m -XX:MaxPermSize=256m -Djava.security.egd=file:/dev/./urandom -Djava.net.preferIPv4Stack=true -Djava.awt.headless=true -jar <https://builds.apache.org/job/HBase-1.0/ws/hbase-server/target/surefire/surefirebooter6877841193574672890.jar> <https://builds.apache.org/job/HBase-1.0/ws/hbase-server/target/surefire/surefire1974475909585898387tmp> <https://builds.apache.org/job/HBase-1.0/ws/hbase-server/target/surefire/surefire_7116827484440468832861tmp>
[ERROR] -> [Help 1]
[ERROR]
[ERROR] To see the full stack trace of the errors, re-run Maven with the -e switch.
[ERROR] Re-run Maven using the -X switch to enable full debug logging.
[ERROR]
[ERROR] For more information about the errors and possible solutions, please read the following articles:
[ERROR] [Help 1] http://cwiki.apache.org/confluence/display/MAVEN/MojoFailureException
[ERROR]
[ERROR] After correcting the problems, you can resume the build with the command
[ERROR] mvn <goals> -rf :hbase-server
Build step 'Invoke top-level Maven targets' marked build as failure
Performing Post build task...
Match found for :.* : True
Logical operation result is TRUE
Running script : ZOMBIE_TESTS_COUNT=`jps | grep surefirebooter | wc -l`
if [[ $ZOMBIE_TESTS_COUNT != 0 ]] ; then
#It seems sometimes the tests are not dying immediately. Let's give them 10s
echo "Suspicious java process found - waiting 10s to see if there are just slow to stop"
sleep 10
ZOMBIE_TESTS_COUNT=`jps | grep surefirebooter | wc -l`
if [[ $ZOMBIE_TESTS_COUNT != 0 ]] ; then
echo "There are $ZOMBIE_TESTS_COUNT zombie tests, they should have been killed by surefire but survived"
echo "************ BEGIN zombies jstack extract"
ZB_STACK=`jps | grep surefirebooter | cut -d ' ' -f 1 | xargs -n 1 jstack | grep ".test" | grep "\.java"`
jps | grep surefirebooter | cut -d ' ' -f 1 | xargs -n 1 jstack
echo "************ END zombies jstack extract"
JIRA_COMMENT="$JIRA_COMMENT
{color:red}-1 core zombie tests{color}. There are ${ZOMBIE_TESTS_COUNT} zombie test(s): ${ZB_STACK}"
BAD=1
jps | grep surefirebooter | cut -d ' ' -f 1 | xargs kill -9
else
echo "We're ok: there is no zombie test, but some tests took some time to stop"
fi
else
echo "We're ok: there is no zombie test"
fi
[HBase-1.0] $ /bin/bash -xe /tmp/hudson6663021459073309211.sh
++ jps
++ grep surefirebooter
++ wc -l
+ ZOMBIE_TESTS_COUNT=0
+ [[ 0 != 0 ]]
+ echo 'We'\''re ok: there is no zombie test'
We're ok: there is no zombie test
POST BUILD TASK : SUCCESS
END OF POST BUILD TASK : 0
Archiving artifacts
Sending artifact delta relative to HBase-1.0 #868
Archived 1883 artifacts
Archive block size is 32768
Received 27 blocks and 388725016 bytes
Compression is 0.2%
Took 2 min 41 sec
Recording test results
Updating HBASE-13546
Build failed in Jenkins: HBase-1.0 #879
Posted by Apache Jenkins Server <je...@builds.apache.org>.
See <https://builds.apache.org/job/HBase-1.0/879/changes>
Changes:
[tedyu] HBASE-13528 A bug on selecting compaction pool (Shuaifeng Zhou)
------------------------------------------
[...truncated 2227 lines...]
Running org.apache.hadoop.hbase.regionserver.TestRegionReplicas
Tests run: 9, Failures: 0, Errors: 0, Skipped: 0, Time elapsed: 36.967 sec - in org.apache.hadoop.hbase.regionserver.wal.TestWALReplay
Running org.apache.hadoop.hbase.regionserver.TestEncryptionKeyRotation
Tests run: 2, Failures: 0, Errors: 0, Skipped: 0, Time elapsed: 11.835 sec - in org.apache.hadoop.hbase.regionserver.TestEncryptionKeyRotation
Tests run: 7, Failures: 0, Errors: 0, Skipped: 0, Time elapsed: 45.468 sec - in org.apache.hadoop.hbase.regionserver.TestMajorCompaction
Running org.apache.hadoop.hbase.regionserver.TestZKLessSplitOnCluster
Running org.apache.hadoop.hbase.regionserver.TestCompactionState
Tests run: 2, Failures: 0, Errors: 0, Skipped: 0, Time elapsed: 61.072 sec - in org.apache.hadoop.hbase.regionserver.TestParallelPut
Running org.apache.hadoop.hbase.regionserver.TestFSErrorsExposed
Tests run: 5, Failures: 0, Errors: 0, Skipped: 0, Time elapsed: 28.654 sec - in org.apache.hadoop.hbase.regionserver.TestCompactionState
Tests run: 16, Failures: 0, Errors: 0, Skipped: 0, Time elapsed: 39.139 sec - in org.apache.hadoop.hbase.regionserver.TestZKLessSplitOnCluster
Running org.apache.hadoop.hbase.regionserver.TestDefaultMemStore
Tests run: 3, Failures: 0, Errors: 0, Skipped: 0, Time elapsed: 27.876 sec - in org.apache.hadoop.hbase.regionserver.TestFSErrorsExposed
Running org.apache.hadoop.hbase.regionserver.TestGetClosestAtOrBefore
Running org.apache.hadoop.hbase.regionserver.TestRegionServerMetrics
Tests run: 3, Failures: 0, Errors: 0, Skipped: 0, Time elapsed: 2.127 sec - in org.apache.hadoop.hbase.regionserver.TestGetClosestAtOrBefore
Running org.apache.hadoop.hbase.regionserver.TestRSKilledWhenInitializing
Tests run: 9, Failures: 0, Errors: 0, Skipped: 0, Time elapsed: 6.376 sec - in org.apache.hadoop.hbase.regionserver.TestRegionServerMetrics
Running org.apache.hadoop.hbase.regionserver.TestReversibleScanners
Tests run: 5, Failures: 0, Errors: 0, Skipped: 0, Time elapsed: 4.097 sec - in org.apache.hadoop.hbase.regionserver.TestReversibleScanners
Running org.apache.hadoop.hbase.regionserver.TestRecoveredEdits
Tests run: 1, Failures: 0, Errors: 0, Skipped: 0, Time elapsed: 18.467 sec - in org.apache.hadoop.hbase.regionserver.TestRSKilledWhenInitializing
Tests run: 1, Failures: 0, Errors: 0, Skipped: 0, Time elapsed: 12.478 sec - in org.apache.hadoop.hbase.regionserver.TestRecoveredEdits
Running org.apache.hadoop.hbase.regionserver.TestRegionServerNoMaster
Tests run: 23, Failures: 0, Errors: 0, Skipped: 0, Time elapsed: 43.788 sec - in org.apache.hadoop.hbase.regionserver.TestDefaultMemStore
Running org.apache.hadoop.hbase.regionserver.TestClusterId
Running org.apache.hadoop.hbase.regionserver.TestScannerWithBulkload
Tests run: 3, Failures: 0, Errors: 0, Skipped: 0, Time elapsed: 5.73 sec - in org.apache.hadoop.hbase.regionserver.TestScannerWithBulkload
Running org.apache.hadoop.hbase.regionserver.TestCompaction
Tests run: 9, Failures: 0, Errors: 0, Skipped: 0, Time elapsed: 18.151 sec - in org.apache.hadoop.hbase.regionserver.TestRegionServerNoMaster
Tests run: 2, Failures: 0, Errors: 0, Skipped: 0, Time elapsed: 27.658 sec - in org.apache.hadoop.hbase.regionserver.TestClusterId
Running org.apache.hadoop.hbase.regionserver.TestRegionFavoredNodes
Tests run: 5, Failures: 0, Errors: 0, Skipped: 0, Time elapsed: 23.074 sec - in org.apache.hadoop.hbase.regionserver.TestCompaction
Running org.apache.hadoop.hbase.regionserver.TestSeekOptimizations
Tests run: 1, Failures: 0, Errors: 0, Skipped: 0, Time elapsed: 8.71 sec - in org.apache.hadoop.hbase.regionserver.TestRegionFavoredNodes
Running org.apache.hadoop.hbase.regionserver.TestServerCustomProtocol
Running org.apache.hadoop.hbase.regionserver.TestHRegion
Tests run: 6, Failures: 0, Errors: 0, Skipped: 0, Time elapsed: 4.704 sec - in org.apache.hadoop.hbase.regionserver.TestSeekOptimizations
Running org.apache.hadoop.hbase.regionserver.TestAtomicOperation
Tests run: 7, Failures: 0, Errors: 0, Skipped: 0, Time elapsed: 160.836 sec - in org.apache.hadoop.hbase.regionserver.TestRegionReplicas
Tests run: 5, Failures: 0, Errors: 0, Skipped: 0, Time elapsed: 243.217 sec - in org.apache.hadoop.hbase.regionserver.wal.TestLogRolling
Running org.apache.hadoop.hbase.regionserver.TestSplitTransactionOnCluster
Running org.apache.hadoop.hbase.regionserver.TestCompactionWithCoprocessor
Tests run: 7, Failures: 0, Errors: 0, Skipped: 0, Time elapsed: 16.481 sec - in org.apache.hadoop.hbase.regionserver.TestServerCustomProtocol
Running org.apache.hadoop.hbase.regionserver.TestHRegionServerBulkLoad
Tests run: 5, Failures: 0, Errors: 0, Skipped: 0, Time elapsed: 30.191 sec - in org.apache.hadoop.hbase.regionserver.TestCompactionWithCoprocessor
Tests run: 6, Failures: 0, Errors: 0, Skipped: 0, Time elapsed: 50.605 sec - in org.apache.hadoop.hbase.regionserver.TestAtomicOperation
Running org.apache.hadoop.hbase.regionserver.TestZKLessMergeOnCluster
Tests run: 1, Failures: 0, Errors: 0, Skipped: 0, Time elapsed: 45.395 sec - in org.apache.hadoop.hbase.regionserver.TestHRegionServerBulkLoad
Running org.apache.hadoop.hbase.regionserver.TestRegionServerOnlineConfigChange
Tests run: 16, Failures: 0, Errors: 0, Skipped: 0, Time elapsed: 55.017 sec - in org.apache.hadoop.hbase.regionserver.TestSplitTransactionOnCluster
Tests run: 3, Failures: 0, Errors: 0, Skipped: 0, Time elapsed: 12.194 sec - in org.apache.hadoop.hbase.regionserver.TestZKLessMergeOnCluster
Tests run: 2, Failures: 0, Errors: 0, Skipped: 0, Time elapsed: 1.627 sec - in org.apache.hadoop.hbase.regionserver.TestRegionServerOnlineConfigChange
Running org.apache.hadoop.hbase.TestRegionRebalancing
Running org.apache.hadoop.hbase.io.encoding.TestEncodedSeekers
Running org.apache.hadoop.hbase.regionserver.TestEncryptionRandomKeying
Tests run: 1, Failures: 0, Errors: 0, Skipped: 0, Time elapsed: 1.691 sec - in org.apache.hadoop.hbase.regionserver.TestEncryptionRandomKeying
Running org.apache.hadoop.hbase.io.encoding.TestDataBlockEncoders
Running org.apache.hadoop.hbase.regionserver.TestEndToEndSplitTransaction
Tests run: 91, Failures: 0, Errors: 0, Skipped: 0, Time elapsed: 96.899 sec - in org.apache.hadoop.hbase.regionserver.TestHRegion
Tests run: 2, Failures: 0, Errors: 0, Skipped: 0, Time elapsed: 16.061 sec - in org.apache.hadoop.hbase.regionserver.TestEndToEndSplitTransaction
Running org.apache.hadoop.hbase.io.encoding.TestLoadAndSwitchEncodeOnDisk
Running org.apache.hadoop.hbase.io.encoding.TestChangingEncoding
Tests run: 2, Failures: 0, Errors: 0, Skipped: 0, Time elapsed: 35.462 sec - in org.apache.hadoop.hbase.TestRegionRebalancing
Running org.apache.hadoop.hbase.io.encoding.TestBufferedDataBlockEncoder
Tests run: 1, Failures: 0, Errors: 0, Skipped: 0, Time elapsed: 25.473 sec - in org.apache.hadoop.hbase.io.encoding.TestLoadAndSwitchEncodeOnDisk
Running org.apache.hadoop.hbase.io.hfile.TestCacheOnWrite
Tests run: 1, Failures: 0, Errors: 0, Skipped: 0, Time elapsed: 32.203 sec - in org.apache.hadoop.hbase.io.encoding.TestBufferedDataBlockEncoder
Running org.apache.hadoop.hbase.io.hfile.TestCacheConfig
Tests run: 6, Failures: 0, Errors: 0, Skipped: 0, Time elapsed: 1.995 sec - in org.apache.hadoop.hbase.io.hfile.TestCacheConfig
Running org.apache.hadoop.hbase.io.hfile.TestHFileSeek
Tests run: 1, Failures: 0, Errors: 0, Skipped: 0, Time elapsed: 2.373 sec - in org.apache.hadoop.hbase.io.hfile.TestHFileSeek
Running org.apache.hadoop.hbase.io.hfile.TestHFileBlock
Tests run: 3, Failures: 0, Errors: 0, Skipped: 0, Time elapsed: 106.82 sec - in org.apache.hadoop.hbase.io.encoding.TestChangingEncoding
Running org.apache.hadoop.hbase.io.hfile.TestForceCacheImportantBlocks
Tests run: 20, Failures: 0, Errors: 0, Skipped: 0, Time elapsed: 160.644 sec - in org.apache.hadoop.hbase.io.encoding.TestEncodedSeekers
Running org.apache.hadoop.hbase.io.hfile.TestScannerSelectionUsingTTL
Tests run: 28, Failures: 0, Errors: 0, Skipped: 0, Time elapsed: 94.937 sec - in org.apache.hadoop.hbase.io.hfile.TestHFileBlock
Running org.apache.hadoop.hbase.io.hfile.TestHFileBlockIndex
Tests run: 4, Failures: 0, Errors: 0, Skipped: 0, Time elapsed: 44.536 sec - in org.apache.hadoop.hbase.io.hfile.TestForceCacheImportantBlocks
Running org.apache.hadoop.hbase.io.TestFileLink
Tests run: 10, Failures: 0, Errors: 0, Skipped: 0, Time elapsed: 13.046 sec - in org.apache.hadoop.hbase.io.hfile.TestHFileBlockIndex
Tests run: 3, Failures: 0, Errors: 0, Skipped: 0, Time elapsed: 18.134 sec - in org.apache.hadoop.hbase.io.TestFileLink
Running org.apache.hadoop.hbase.security.access.TestAccessController
Running org.apache.hadoop.hbase.security.access.TestTablePermissions
Tests run: 6, Failures: 0, Errors: 0, Skipped: 0, Time elapsed: 63.332 sec - in org.apache.hadoop.hbase.io.hfile.TestScannerSelectionUsingTTL
Running org.apache.hadoop.hbase.security.access.TestCellACLs
Tests run: 2, Failures: 0, Errors: 0, Skipped: 0, Time elapsed: 9.784 sec - in org.apache.hadoop.hbase.security.access.TestCellACLs
Tests run: 7, Failures: 0, Errors: 0, Skipped: 0, Time elapsed: 32.544 sec - in org.apache.hadoop.hbase.security.access.TestTablePermissions
Running org.apache.hadoop.hbase.security.access.TestAccessControlFilter
Tests run: 1, Failures: 0, Errors: 0, Skipped: 0, Time elapsed: 3.264 sec - in org.apache.hadoop.hbase.security.access.TestAccessControlFilter
Running org.apache.hadoop.hbase.security.access.TestNamespaceCommands
Running org.apache.hadoop.hbase.security.access.TestCellACLWithMultipleVersions
Tests run: 7, Failures: 0, Errors: 0, Skipped: 0, Time elapsed: 12.054 sec - in org.apache.hadoop.hbase.security.access.TestNamespaceCommands
Running org.apache.hadoop.hbase.security.access.TestAccessController2
Tests run: 28, Failures: 0, Errors: 0, Skipped: 0, Time elapsed: 293.077 sec - in org.apache.hadoop.hbase.io.encoding.TestDataBlockEncoders
Tests run: 8, Failures: 0, Errors: 0, Skipped: 0, Time elapsed: 25.579 sec - in org.apache.hadoop.hbase.security.access.TestCellACLWithMultipleVersions
Running org.apache.hadoop.hbase.security.access.TestZKPermissionsWatcher
Running org.apache.hadoop.hbase.security.access.TestWithDisabledAuthorization
Tests run: 1, Failures: 0, Errors: 0, Skipped: 0, Time elapsed: 3.551 sec - in org.apache.hadoop.hbase.security.access.TestZKPermissionsWatcher
Tests run: 4, Failures: 0, Errors: 0, Skipped: 0, Time elapsed: 24.155 sec - in org.apache.hadoop.hbase.security.access.TestAccessController2
Running org.apache.hadoop.hbase.security.access.TestScanEarlyTermination
Running org.apache.hadoop.hbase.security.visibility.TestVisibilityLablesWithGroups
Tests run: 1, Failures: 0, Errors: 0, Skipped: 0, Time elapsed: 4.739 sec - in org.apache.hadoop.hbase.security.access.TestScanEarlyTermination
Tests run: 1, Failures: 0, Errors: 0, Skipped: 0, Time elapsed: 2.811 sec - in org.apache.hadoop.hbase.security.visibility.TestVisibilityLablesWithGroups
Running org.apache.hadoop.hbase.security.visibility.TestVisibilityLabelsWithDeletes
Running org.apache.hadoop.hbase.security.visibility.TestVisibilityLabelsWithDefaultVisLabelService
Tests run: 6, Failures: 0, Errors: 0, Skipped: 0, Time elapsed: 39.265 sec - in org.apache.hadoop.hbase.security.access.TestWithDisabledAuthorization
Tests run: 23, Failures: 0, Errors: 0, Skipped: 0, Time elapsed: 18.846 sec - in org.apache.hadoop.hbase.security.visibility.TestVisibilityLabelsWithDefaultVisLabelService
Running org.apache.hadoop.hbase.security.visibility.TestVisibilityLabelsWithCustomVisLabService
Running org.apache.hadoop.hbase.security.visibility.TestDefaultScanLabelGeneratorStack
Tests run: 1, Failures: 0, Errors: 0, Skipped: 0, Time elapsed: 1.926 sec - in org.apache.hadoop.hbase.security.visibility.TestDefaultScanLabelGeneratorStack
Tests run: 19, Failures: 0, Errors: 0, Skipped: 0, Time elapsed: 15.807 sec - in org.apache.hadoop.hbase.security.visibility.TestVisibilityLabelsWithCustomVisLabService
Running org.apache.hadoop.hbase.security.visibility.TestVisibilityWithCheckAuths
Tests run: 2, Failures: 0, Errors: 0, Skipped: 0, Time elapsed: 2.981 sec - in org.apache.hadoop.hbase.security.visibility.TestVisibilityWithCheckAuths
Running org.apache.hadoop.hbase.security.visibility.TestVisibilityLabelsWithDistributedLogReplay
Tests run: 37, Failures: 0, Errors: 0, Skipped: 0, Time elapsed: 53.052 sec - in org.apache.hadoop.hbase.security.visibility.TestVisibilityLabelsWithDeletes
Running org.apache.hadoop.hbase.security.visibility.TestVisibilityLabelsOpWithDifferentUsersNoACL
Tests run: 1, Failures: 0, Errors: 0, Skipped: 0, Time elapsed: 2.742 sec - in org.apache.hadoop.hbase.security.visibility.TestVisibilityLabelsOpWithDifferentUsersNoACL
Running org.apache.hadoop.hbase.security.visibility.TestVisibilityLabelsWithSLGStack
Tests run: 1, Failures: 0, Errors: 0, Skipped: 0, Time elapsed: 1.86 sec - in org.apache.hadoop.hbase.security.visibility.TestVisibilityLabelsWithSLGStack
Running org.apache.hadoop.hbase.security.visibility.TestVisibilityLabelsReplication
Tests run: 23, Failures: 0, Errors: 0, Skipped: 0, Time elapsed: 18.522 sec - in org.apache.hadoop.hbase.security.visibility.TestVisibilityLabelsWithDistributedLogReplay
Running org.apache.hadoop.hbase.security.visibility.TestVisibilityLabelReplicationWithExpAsString
Running org.apache.hadoop.hbase.security.visibility.TestEnforcingScanLabelGenerator
Tests run: 1, Failures: 0, Errors: 0, Skipped: 0, Time elapsed: 2.358 sec - in org.apache.hadoop.hbase.security.visibility.TestEnforcingScanLabelGenerator
Running org.apache.hadoop.hbase.security.visibility.TestVisibilityLabelsWithACL
Tests run: 1, Failures: 0, Errors: 0, Skipped: 0, Time elapsed: 19.53 sec - in org.apache.hadoop.hbase.security.visibility.TestVisibilityLabelsReplication
Tests run: 1, Failures: 0, Errors: 0, Skipped: 0, Time elapsed: 19.6 sec - in org.apache.hadoop.hbase.security.visibility.TestVisibilityLabelReplicationWithExpAsString
Tests run: 5, Failures: 0, Errors: 0, Skipped: 0, Time elapsed: 6.754 sec - in org.apache.hadoop.hbase.security.visibility.TestVisibilityLabelsWithACL
Running org.apache.hadoop.hbase.security.token.TestZKSecretWatcher
Running org.apache.hadoop.hbase.security.token.TestTokenAuthentication
Tests run: 3, Failures: 0, Errors: 0, Skipped: 0, Time elapsed: 0.541 sec - in org.apache.hadoop.hbase.security.token.TestTokenAuthentication
Running org.apache.hadoop.hbase.security.visibility.TestWithDisabledAuthorization
Tests run: 2, Failures: 0, Errors: 0, Skipped: 0, Time elapsed: 2.636 sec - in org.apache.hadoop.hbase.security.visibility.TestWithDisabledAuthorization
Tests run: 1, Failures: 0, Errors: 0, Skipped: 0, Time elapsed: 13.262 sec - in org.apache.hadoop.hbase.security.token.TestZKSecretWatcher
Tests run: 54, Failures: 0, Errors: 0, Skipped: 0, Time elapsed: 249.701 sec - in org.apache.hadoop.hbase.security.access.TestAccessController
Tests run: 216, Failures: 0, Errors: 0, Skipped: 0, Time elapsed: 437.677 sec - in org.apache.hadoop.hbase.io.hfile.TestCacheOnWrite
Results :
Tests in error:
TestAssignmentManager.testBalanceOnMasterFailoverScenarioWithOpenedNode:268 »
TestDistributedLogSplitting.testLogReplayTwoSequentialRSDown:585->installTable:1427->installTable:1455 » Runtime
Tests run: 2356, Failures: 0, Errors: 2, Skipped: 18
[INFO] ------------------------------------------------------------------------
[INFO] Reactor Summary:
[INFO]
[INFO] HBase ............................................. SUCCESS [4.811s]
[INFO] HBase - Checkstyle ................................ SUCCESS [1.049s]
[INFO] HBase - Annotations ............................... SUCCESS [0.959s]
[INFO] HBase - Common .................................... SUCCESS [1:04.760s]
[INFO] HBase - Protocol .................................. SUCCESS [9.068s]
[INFO] HBase - Client .................................... SUCCESS [1:18.870s]
[INFO] HBase - Hadoop Compatibility ...................... SUCCESS [6.978s]
[INFO] HBase - Hadoop Two Compatibility .................. SUCCESS [6.101s]
[INFO] HBase - Prefix Tree ............................... SUCCESS [8.264s]
[INFO] HBase - Server .................................... FAILURE [1:11:53.675s]
[INFO] HBase - Testing Util .............................. SKIPPED
[INFO] HBase - Thrift .................................... SKIPPED
[INFO] HBase - Rest ...................................... SKIPPED
[INFO] HBase - Shell ..................................... SKIPPED
[INFO] HBase - Integration Tests ......................... SKIPPED
[INFO] HBase - Examples .................................. SKIPPED
[INFO] HBase - Assembly .................................. SKIPPED
[INFO] ------------------------------------------------------------------------
[INFO] BUILD FAILURE
[INFO] ------------------------------------------------------------------------
[INFO] Total time: 1:14:55.408s
[INFO] Finished at: Fri Apr 24 10:52:08 UTC 2015
[INFO] Final Memory: 48M/718M
[INFO] ------------------------------------------------------------------------
[ERROR] Failed to execute goal org.apache.maven.plugins:maven-surefire-plugin:2.18:test (secondPartTestsExecution) on project hbase-server: There was a timeout or other error in the fork -> [Help 1]
[ERROR]
[ERROR] To see the full stack trace of the errors, re-run Maven with the -e switch.
[ERROR] Re-run Maven using the -X switch to enable full debug logging.
[ERROR]
[ERROR] For more information about the errors and possible solutions, please read the following articles:
[ERROR] [Help 1] http://cwiki.apache.org/confluence/display/MAVEN/MojoFailureException
[ERROR]
[ERROR] After correcting the problems, you can resume the build with the command
[ERROR] mvn <goals> -rf :hbase-server
Build step 'Invoke top-level Maven targets' marked build as failure
Performing Post build task...
Match found for :.* : True
Logical operation result is TRUE
Running script : ZOMBIE_TESTS_COUNT=`jps | grep surefirebooter | wc -l`
if [[ $ZOMBIE_TESTS_COUNT != 0 ]] ; then
#It seems sometimes the tests are not dying immediately. Let's give them 10s
echo "Suspicious java process found - waiting 10s to see if there are just slow to stop"
sleep 10
ZOMBIE_TESTS_COUNT=`jps | grep surefirebooter | wc -l`
if [[ $ZOMBIE_TESTS_COUNT != 0 ]] ; then
echo "There are $ZOMBIE_TESTS_COUNT zombie tests, they should have been killed by surefire but survived"
echo "************ BEGIN zombies jstack extract"
ZB_STACK=`jps | grep surefirebooter | cut -d ' ' -f 1 | xargs -n 1 jstack | grep ".test" | grep "\.java"`
jps | grep surefirebooter | cut -d ' ' -f 1 | xargs -n 1 jstack
echo "************ END zombies jstack extract"
JIRA_COMMENT="$JIRA_COMMENT
{color:red}-1 core zombie tests{color}. There are ${ZOMBIE_TESTS_COUNT} zombie test(s): ${ZB_STACK}"
BAD=1
jps | grep surefirebooter | cut -d ' ' -f 1 | xargs kill -9
else
echo "We're ok: there is no zombie test, but some tests took some time to stop"
fi
else
echo "We're ok: there is no zombie test"
fi
[HBase-1.0] $ /bin/bash -xe /tmp/hudson1836513382892427550.sh
++ jps
++ grep surefirebooter
++ wc -l
+ ZOMBIE_TESTS_COUNT=2
+ [[ 2 != 0 ]]
+ echo 'Suspicious java process found - waiting 10s to see if there are just slow to stop'
Suspicious java process found - waiting 10s to see if there are just slow to stop
+ sleep 10
++ jps
++ grep surefirebooter
++ wc -l
+ ZOMBIE_TESTS_COUNT=1
+ [[ 1 != 0 ]]
+ echo 'There are 1 zombie tests, they should have been killed by surefire but survived'
There are 1 zombie tests, they should have been killed by surefire but survived
+ echo '************ BEGIN zombies jstack extract'
************ BEGIN zombies jstack extract
++ jps
++ grep surefirebooter
++ cut -d ' ' -f 1
++ grep .test
++ xargs -n 1 jstack
++ grep '\.java'
+ ZB_STACK=
POST BUILD TASK : FAILURE
END OF POST BUILD TASK : 0
Archiving artifacts
Sending artifact delta relative to HBase-1.0 #868
Archived 1893 artifacts
Archive block size is 32768
Received 27 blocks and 396455382 bytes
Compression is 0.2%
Took 2 min 46 sec
Recording test results
Updating HBASE-13528
Re: Build failed in Jenkins: HBase-1.0 #878
Posted by Stack <st...@duboce.net>.
Zombie caught a yarn hang:
at org.apache.hadoop.yarn.server.resourcemanager.applicationsmanager.TestAMRestart.testShouldNotCountFailureToMaxAttemptRetry(TestAMRestart.java:448)
St.Ack
On Thu, Apr 23, 2015 at 1:31 AM, Apache Jenkins Server <
jenkins@builds.apache.org> wrote:
> See <https://builds.apache.org/job/HBase-1.0/878/changes>
>
> Changes:
>
> [jerryjch] HBASE-13526 TestRegionServerReportForDuty can be flaky: hang or
> timeout
>
> ------------------------------------------
> [...truncated 2047 lines...]
> + cut -d ' ' -f 1
> + xargs -n 1 jstack
> 2015-04-23 08:29:35
> Full thread dump Java HotSpot(TM) 64-Bit Server VM (24.55-b03 mixed mode):
>
> "Attach Listener" daemon prio=10 tid=0x00007f841c002000 nid=0x102a waiting
> on condition [0x0000000000000000]
> java.lang.Thread.State: RUNNABLE
>
> "AsyncDispatcher event handler" prio=10 tid=0x0000000001db8000 nid=0xf02
> waiting on condition [0x00007f8418801000]
> java.lang.Thread.State: WAITING (parking)
> at sun.misc.Unsafe.park(Native Method)
> - parking to wait for <0x00000007af044438> (a
> java.util.concurrent.locks.AbstractQueuedSynchronizer$ConditionObject)
> at
> java.util.concurrent.locks.LockSupport.park(LockSupport.java:186)
> at
> java.util.concurrent.locks.AbstractQueuedSynchronizer$ConditionObject.await(AbstractQueuedSynchronizer.java:2043)
> at
> java.util.concurrent.LinkedBlockingQueue.take(LinkedBlockingQueue.java:442)
> at
> org.apache.hadoop.yarn.event.AsyncDispatcher$1.run(AsyncDispatcher.java:100)
> at java.lang.Thread.run(Thread.java:745)
>
> "Ping Checker" prio=10 tid=0x0000000001dbe000 nid=0xf01 waiting on
> condition [0x00007f8419283000]
> java.lang.Thread.State: TIMED_WAITING (sleeping)
> at java.lang.Thread.sleep(Native Method)
> at
> org.apache.hadoop.yarn.util.AbstractLivelinessMonitor$PingChecker.run(AbstractLivelinessMonitor.java:133)
> at java.lang.Thread.run(Thread.java:745)
>
> "ResourceManager Event Processor" prio=10 tid=0x00000000022e9000 nid=0xf00
> waiting on condition [0x00007f8418902000]
> java.lang.Thread.State: WAITING (parking)
> at sun.misc.Unsafe.park(Native Method)
> - parking to wait for <0x00000007af0ef160> (a
> java.util.concurrent.locks.AbstractQueuedSynchronizer$ConditionObject)
> at
> java.util.concurrent.locks.LockSupport.park(LockSupport.java:186)
> at
> java.util.concurrent.locks.AbstractQueuedSynchronizer$ConditionObject.await(AbstractQueuedSynchronizer.java:2043)
> at
> java.util.concurrent.LinkedBlockingQueue.take(LinkedBlockingQueue.java:442)
> at
> org.apache.hadoop.yarn.server.resourcemanager.ResourceManager$SchedulerEventDispatcher$EventProcessor.run(ResourceManager.java:675)
> at java.lang.Thread.run(Thread.java:745)
>
> "Ping Checker" prio=10 tid=0x0000000001b4f800 nid=0xeff waiting on
> condition [0x00007f84099f0000]
> java.lang.Thread.State: TIMED_WAITING (sleeping)
> at java.lang.Thread.sleep(Native Method)
> at
> org.apache.hadoop.yarn.util.AbstractLivelinessMonitor$PingChecker.run(AbstractLivelinessMonitor.java:133)
> at java.lang.Thread.run(Thread.java:745)
>
> "Ping Checker" prio=10 tid=0x0000000001559800 nid=0xefe waiting on
> condition [0x00007f8409af1000]
> java.lang.Thread.State: TIMED_WAITING (sleeping)
> at java.lang.Thread.sleep(Native Method)
> at
> org.apache.hadoop.yarn.util.AbstractLivelinessMonitor$PingChecker.run(AbstractLivelinessMonitor.java:133)
> at java.lang.Thread.run(Thread.java:745)
>
> "Ping Checker" prio=10 tid=0x00000000019d8000 nid=0xefd waiting on
> condition [0x00007f8409bf2000]
> java.lang.Thread.State: TIMED_WAITING (sleeping)
> at java.lang.Thread.sleep(Native Method)
> at
> org.apache.hadoop.yarn.util.AbstractLivelinessMonitor$PingChecker.run(AbstractLivelinessMonitor.java:133)
> at java.lang.Thread.run(Thread.java:745)
>
> "Thread[Thread-37,5,main]" daemon prio=10 tid=0x00000000019d9000 nid=0xefc
> waiting on condition [0x00007f8409cf3000]
> java.lang.Thread.State: TIMED_WAITING (sleeping)
> at java.lang.Thread.sleep(Native Method)
> at
> org.apache.hadoop.security.token.delegation.AbstractDelegationTokenSecretManager$ExpiredTokenRemover.run(AbstractDelegationTokenSecretManager.java:657)
> at java.lang.Thread.run(Thread.java:745)
>
> "AsyncDispatcher event handler" prio=10 tid=0x0000000001531800 nid=0xefb
> waiting on condition [0x00007f8409df4000]
> java.lang.Thread.State: WAITING (parking)
> at sun.misc.Unsafe.park(Native Method)
> - parking to wait for <0x00000007aead34d8> (a
> java.util.concurrent.locks.AbstractQueuedSynchronizer$ConditionObject)
> at
> java.util.concurrent.locks.LockSupport.park(LockSupport.java:186)
> at
> java.util.concurrent.locks.AbstractQueuedSynchronizer$ConditionObject.await(AbstractQueuedSynchronizer.java:2043)
> at
> java.util.concurrent.LinkedBlockingQueue.take(LinkedBlockingQueue.java:442)
> at
> org.apache.hadoop.yarn.event.AsyncDispatcher$1.run(AsyncDispatcher.java:100)
> at java.lang.Thread.run(Thread.java:745)
>
> "Timer-11" prio=10 tid=0x0000000000eef800 nid=0xefa in Object.wait()
> [0x00007f8409ef5000]
> java.lang.Thread.State: TIMED_WAITING (on object monitor)
> at java.lang.Object.wait(Native Method)
> - waiting on <0x00000007af351680> (a java.util.TaskQueue)
> at java.util.TimerThread.mainLoop(Timer.java:552)
> - locked <0x00000007af351680> (a java.util.TaskQueue)
> at java.util.TimerThread.run(Timer.java:505)
>
> "Timer for 'ResourceManager' metrics system" daemon prio=10
> tid=0x0000000001b09800 nid=0xef9 in Object.wait() [0x00007f8409ff6000]
> java.lang.Thread.State: TIMED_WAITING (on object monitor)
> at java.lang.Object.wait(Native Method)
> - waiting on <0x00000007af1ed8c0> (a java.util.TaskQueue)
> at java.util.TimerThread.mainLoop(Timer.java:552)
> - locked <0x00000007af1ed8c0> (a java.util.TaskQueue)
> at java.util.TimerThread.run(Timer.java:505)
>
> "Timer-10" prio=10 tid=0x0000000000efb000 nid=0xef8 in Object.wait()
> [0x00007f840a3fa000]
> java.lang.Thread.State: TIMED_WAITING (on object monitor)
> at java.lang.Object.wait(Native Method)
> - waiting on <0x00000007af072178> (a java.util.TaskQueue)
> at java.util.TimerThread.mainLoop(Timer.java:552)
> - locked <0x00000007af072178> (a java.util.TaskQueue)
> at java.util.TimerThread.run(Timer.java:505)
>
> "Timer-9" prio=10 tid=0x00000000012ed800 nid=0xef7 in Object.wait()
> [0x00007f840a2f9000]
> java.lang.Thread.State: TIMED_WAITING (on object monitor)
> at java.lang.Object.wait(Native Method)
> - waiting on <0x00000007af069f80> (a java.util.TaskQueue)
> at java.util.TimerThread.mainLoop(Timer.java:552)
> - locked <0x00000007af069f80> (a java.util.TaskQueue)
> at java.util.TimerThread.run(Timer.java:505)
>
> "Timer-8" prio=10 tid=0x000000000127f000 nid=0xef6 in Object.wait()
> [0x00007f840a1f8000]
> java.lang.Thread.State: TIMED_WAITING (on object monitor)
> at java.lang.Object.wait(Native Method)
> - waiting on <0x00000007af061dc8> (a java.util.TaskQueue)
> at java.util.TimerThread.mainLoop(Timer.java:552)
> - locked <0x00000007af061dc8> (a java.util.TaskQueue)
> at java.util.TimerThread.run(Timer.java:505)
>
> "Thread-29" prio=10 tid=0x00007f842483e800 nid=0xef5 waiting on condition
> [0x00007f8419aa4000]
> java.lang.Thread.State: TIMED_WAITING (sleeping)
> at java.lang.Thread.sleep(Native Method)
> at
> org.apache.hadoop.yarn.server.resourcemanager.MockAM.waitForState(MockAM.java:83)
> at
> org.apache.hadoop.yarn.server.resourcemanager.MockRM.sendAMLaunched(MockRM.java:507)
> at
> org.apache.hadoop.yarn.server.resourcemanager.MockRM.launchAM(MockRM.java:689)
> at
> org.apache.hadoop.yarn.server.resourcemanager.MockRM.launchAndRegisterAM(MockRM.java:696)
> at
> org.apache.hadoop.yarn.server.resourcemanager.MockRM.waitForNewAMToLaunchAndRegister(MockRM.java:194)
> at
> org.apache.hadoop.yarn.server.resourcemanager.applicationsmanager.TestAMRestart.testShouldNotCountFailureToMaxAttemptRetry(TestAMRestart.java:448)
> at sun.reflect.NativeMethodAccessorImpl.invoke0(Native Method)
> at
> sun.reflect.NativeMethodAccessorImpl.invoke(NativeMethodAccessorImpl.java:57)
> at
> sun.reflect.DelegatingMethodAccessorImpl.invoke(DelegatingMethodAccessorImpl.java:43)
> at java.lang.reflect.Method.invoke(Method.java:606)
> at
> org.junit.runners.model.FrameworkMethod$1.runReflectiveCall(FrameworkMethod.java:47)
> at
> org.junit.internal.runners.model.ReflectiveCallable.run(ReflectiveCallable.java:12)
> at
> org.junit.runners.model.FrameworkMethod.invokeExplosively(FrameworkMethod.java:44)
> at
> org.junit.internal.runners.statements.InvokeMethod.evaluate(InvokeMethod.java:17)
> at
> org.junit.internal.runners.statements.FailOnTimeout$StatementThread.run(FailOnTimeout.java:74)
>
> "Timer-7" prio=10 tid=0x0000000000ef1000 nid=0xee4 in Object.wait()
> [0x00007f840a0f7000]
> java.lang.Thread.State: TIMED_WAITING (on object monitor)
> at java.lang.Object.wait(Native Method)
> - waiting on <0x00000007b686b640> (a java.util.TaskQueue)
> at java.util.TimerThread.mainLoop(Timer.java:552)
> - locked <0x00000007b686b640> (a java.util.TaskQueue)
> at java.util.TimerThread.run(Timer.java:505)
>
> "Timer-3" prio=10 tid=0x0000000001524800 nid=0xec8 in Object.wait()
> [0x00007f84185ff000]
> java.lang.Thread.State: TIMED_WAITING (on object monitor)
> at java.lang.Object.wait(Native Method)
> - waiting on <0x00000007b686bae0> (a java.util.TaskQueue)
> at java.util.TimerThread.mainLoop(Timer.java:552)
> - locked <0x00000007b686bae0> (a java.util.TaskQueue)
> at java.util.TimerThread.run(Timer.java:505)
>
> "Service Thread" daemon prio=10 tid=0x00007f8424291000 nid=0xebc runnable
> [0x0000000000000000]
> java.lang.Thread.State: RUNNABLE
>
> "C2 CompilerThread1" daemon prio=10 tid=0x00007f842428f000 nid=0xebb
> waiting on condition [0x0000000000000000]
> java.lang.Thread.State: RUNNABLE
>
> "C2 CompilerThread0" daemon prio=10 tid=0x00007f842428c000 nid=0xeba
> waiting on condition [0x0000000000000000]
> java.lang.Thread.State: RUNNABLE
>
> "Signal Dispatcher" daemon prio=10 tid=0x00007f8424281800 nid=0xeb9
> runnable [0x0000000000000000]
> java.lang.Thread.State: RUNNABLE
>
> "Finalizer" daemon prio=10 tid=0x00007f842426b000 nid=0xeb8 in
> Object.wait() [0x00007f841a6e5000]
> java.lang.Thread.State: WAITING (on object monitor)
> at java.lang.Object.wait(Native Method)
> - waiting on <0x00000007b693b620> (a
> java.lang.ref.ReferenceQueue$Lock)
> at java.lang.ref.ReferenceQueue.remove(ReferenceQueue.java:135)
> - locked <0x00000007b693b620> (a java.lang.ref.ReferenceQueue$Lock)
> at java.lang.ref.ReferenceQueue.remove(ReferenceQueue.java:151)
> at java.lang.ref.Finalizer$FinalizerThread.run(Finalizer.java:189)
>
> "Reference Handler" daemon prio=10 tid=0x00007f8424267000 nid=0xeb7 in
> Object.wait() [0x00007f841a7e6000]
> java.lang.Thread.State: WAITING (on object monitor)
> at java.lang.Object.wait(Native Method)
> - waiting on <0x00000007b691a938> (a java.lang.ref.Reference$Lock)
> at java.lang.Object.wait(Object.java:503)
> at java.lang.ref.Reference$ReferenceHandler.run(Reference.java:133)
> - locked <0x00000007b691a938> (a java.lang.ref.Reference$Lock)
>
> "main" prio=10 tid=0x00007f842400a800 nid=0xea8 in Object.wait()
> [0x00007f842dcca000]
> java.lang.Thread.State: TIMED_WAITING (on object monitor)
> at java.lang.Object.wait(Native Method)
> - waiting on <0x00000007ae658658> (a
> org.junit.internal.runners.statements.FailOnTimeout$StatementThread)
> at java.lang.Thread.join(Thread.java:1289)
> - locked <0x00000007ae658658> (a
> org.junit.internal.runners.statements.FailOnTimeout$StatementThread)
> at
> org.junit.internal.runners.statements.FailOnTimeout.evaluateStatement(FailOnTimeout.java:26)
> at
> org.junit.internal.runners.statements.FailOnTimeout.evaluate(FailOnTimeout.java:17)
> at org.junit.runners.ParentRunner.runLeaf(ParentRunner.java:271)
> at
> org.junit.runners.BlockJUnit4ClassRunner.runChild(BlockJUnit4ClassRunner.java:70)
> at
> org.junit.runners.BlockJUnit4ClassRunner.runChild(BlockJUnit4ClassRunner.java:50)
> at org.junit.runners.ParentRunner$3.run(ParentRunner.java:238)
> at org.junit.runners.ParentRunner$1.schedule(ParentRunner.java:63)
> at
> org.junit.runners.ParentRunner.runChildren(ParentRunner.java:236)
> at org.junit.runners.ParentRunner.access$000(ParentRunner.java:53)
> at org.junit.runners.ParentRunner$2.evaluate(ParentRunner.java:229)
> at org.junit.runners.ParentRunner.run(ParentRunner.java:309)
> at
> org.apache.maven.surefire.junit4.JUnit4Provider.execute(JUnit4Provider.java:264)
> at
> org.apache.maven.surefire.junit4.JUnit4Provider.executeTestSet(JUnit4Provider.java:153)
> at
> org.apache.maven.surefire.junit4.JUnit4Provider.invoke(JUnit4Provider.java:124)
> at
> org.apache.maven.surefire.booter.ForkedBooter.invokeProviderInSameClassLoader(ForkedBooter.java:200)
> at
> org.apache.maven.surefire.booter.ForkedBooter.runSuitesInProcess(ForkedBooter.java:153)
> at
> org.apache.maven.surefire.booter.ForkedBooter.main(ForkedBooter.java:103)
>
> "VM Thread" prio=10 tid=0x00007f8424264800 nid=0xeb6 runnable
>
> "GC task thread#0 (ParallelGC)" prio=10 tid=0x00007f8424020000 nid=0xea9
> runnable
>
> "GC task thread#1 (ParallelGC)" prio=10 tid=0x00007f8424022000 nid=0xeaa
> runnable
>
> "GC task thread#2 (ParallelGC)" prio=10 tid=0x00007f8424024000 nid=0xeab
> runnable
>
> "GC task thread#3 (ParallelGC)" prio=10 tid=0x00007f8424025800 nid=0xeac
> runnable
>
> "GC task thread#4 (ParallelGC)" prio=10 tid=0x00007f8424027800 nid=0xead
> runnable
>
> "GC task thread#5 (ParallelGC)" prio=10 tid=0x00007f8424029800 nid=0xeae
> runnable
>
> "GC task thread#6 (ParallelGC)" prio=10 tid=0x00007f842402b800 nid=0xeaf
> runnable
>
> "GC task thread#7 (ParallelGC)" prio=10 tid=0x00007f842402d000 nid=0xeb0
> runnable
>
> "GC task thread#8 (ParallelGC)" prio=10 tid=0x00007f842402f000 nid=0xeb1
> runnable
>
> "GC task thread#9 (ParallelGC)" prio=10 tid=0x00007f8424031000 nid=0xeb2
> runnable
>
> "GC task thread#10 (ParallelGC)" prio=10 tid=0x00007f8424032800 nid=0xeb3
> runnable
>
> "GC task thread#11 (ParallelGC)" prio=10 tid=0x00007f8424034800 nid=0xeb4
> runnable
>
> "GC task thread#12 (ParallelGC)" prio=10 tid=0x00007f8424036800 nid=0xeb5
> runnable
>
> "VM Periodic Task Thread" prio=10 tid=0x00007f842429c000 nid=0xebd waiting
> on condition
>
> JNI global references: 289
>
> + echo '************ END zombies jstack extract'
> ************ END zombies jstack extract
> + JIRA_COMMENT='
>
> {color:red}-1 core zombie tests{color}. There are 1 zombie test(s):
> at
> org.apache.hadoop.yarn.server.resourcemanager.applicationsmanager.TestAMRestart.testShouldNotCountFailureToMaxAttemptRetry(TestAMRestart.java:441)'
> + BAD=1
> + jps
> + grep surefirebooter
> + cut -d ' ' -f 1
> + xargs kill -9
> POST BUILD TASK : SUCCESS
> END OF POST BUILD TASK : 0
> Archiving artifacts
> Sending artifact delta relative to HBase-1.0 #868
> Archived 1893 artifacts
> Archive block size is 32768
> Received 27 blocks and 400196947 bytes
> Compression is 0.2%
> Took 2 min 8 sec
> Recording test results
> Updating HBASE-13526
>