You are viewing a plain text version of this content. The canonical link for it is here.
Posted to dev@lucene.apache.org by Policeman Jenkins Server <je...@thetaphi.de> on 2014/02/02 04:03:48 UTC
[JENKINS] Lucene-Solr-trunk-Linux (32bit/ibm-j9-jdk7) - Build #
9325 - Failure!
Build: http://jenkins.thetaphi.de/job/Lucene-Solr-trunk-Linux/9325/
Java: 32bit/ibm-j9-jdk7 -Xjit:exclude={org/apache/lucene/util/fst/FST.pack(IIF)Lorg/apache/lucene/util/fst/FST;}
6 tests failed.
REGRESSION: org.apache.solr.analytics.expression.ExpressionTest.absoluteValueTest
Error Message:
Caught exception in getStatResult, xPath = /response/lst[@name='stats']/lst[@name='avr']/double[@name='sum'] raw data: <?xml version="1.0" encoding="UTF-8"?> <response> <lst name="responseHeader"> <int name="status">0</int> <int name="QTime">11</int> </lst> <result name="response" numFound="100" start="0"> </result> <lst name="stats"> <lst name="stats_fields"/> </lst> <lst name="stats"> <lst name="mr"> <long name="count">100</long> <double name="mcm">70829.5</double> <double name="mean">28.91</double> <double name="median">24.5</double> <double name="su">104076.0</double> <double name="sum">2891.0</double> <long name="unique">36</long> </lst> <lst name="csr"> <str name="cs1">this is the first</str> <str name="cs2">this is the second</str> <str name="cs3">this is the third</str> </lst> <lst name="rr"> <str name="max">str9</str> <str name="min">str0</str> <str name="rmax">9rts</str> <str name="rmin">0rts</str> </lst> <lst name="nr"> <double name="c">-100.0</double> <long name="count">100</long> <null name="s"/> <null name="sum"/> </lst> <lst name="dmr"> <str name="cma">+2MONTHS</str> <str name="cme">+2YEARS</str> <date name="dmma">1812-02-29T23:59:59Z</date> <date name="dmme">1807-12-31T23:59:59Z</date> <date name="max">1811-12-31T23:59:59Z</date> <date name="median">1805-12-31T23:59:59Z</date> </lst> <lst name="cnr"> <double name="c10">10.0</double> <double name="c8">8.0</double> </lst> <lst name="avr"> <double name="c">100.0</double> <long name="count">100</long> <null name="s"/> <null name="sum"/> </lst> <lst name="pr"> <long name="count">100</long> <double name="mc">1.2729436151389237E146</double> <double name="mean">28.91</double> <double name="su">3.9603293116911423E124</double> <double name="sum">2891.0</double> <long name="unique">36</long> </lst> <lst name="cr"> <str name="ccmax">this is the secondstr9</str> <str name="ccmin">this is the firststr0</str> <str name="csmax">this is the second</str> <str name="csmin">this is the first</str> <str name="max">str9</str> <str name="min">str0</str> </lst> <lst name="dr"> <long name="count">100</long> <double name="mc">0.2891</double> <double name="mean">28.91</double> <double name="su">80.30555555555556</double> <double name="sum">2891.0</double> <long name="unique">36</long> </lst> <lst name="cdr"> <date name="cd1">1800-12-31T23:59:59Z</date> <date name="cd2">1804-06-30T23:59:59Z</date> <str name="cs1">1800-12-31T23:59:59Z</str> <str name="cs2">1804-06-30T23:59:59Z</str> </lst> <lst name="ar"> <long name="count">100</long> <null name="mcm"/> <null name="mean"/> <null name="median"/> <null name="su"/> <null name="sum"/> <null name="unique"/> </lst> </lst> </response>
Stack Trace:
java.lang.AssertionError: Caught exception in getStatResult, xPath = /response/lst[@name='stats']/lst[@name='avr']/double[@name='sum']
raw data: <?xml version="1.0" encoding="UTF-8"?>
<response>
<lst name="responseHeader">
<int name="status">0</int>
<int name="QTime">11</int>
</lst>
<result name="response" numFound="100" start="0">
</result>
<lst name="stats">
<lst name="stats_fields"/>
</lst>
<lst name="stats">
<lst name="mr">
<long name="count">100</long>
<double name="mcm">70829.5</double>
<double name="mean">28.91</double>
<double name="median">24.5</double>
<double name="su">104076.0</double>
<double name="sum">2891.0</double>
<long name="unique">36</long>
</lst>
<lst name="csr">
<str name="cs1">this is the first</str>
<str name="cs2">this is the second</str>
<str name="cs3">this is the third</str>
</lst>
<lst name="rr">
<str name="max">str9</str>
<str name="min">str0</str>
<str name="rmax">9rts</str>
<str name="rmin">0rts</str>
</lst>
<lst name="nr">
<double name="c">-100.0</double>
<long name="count">100</long>
<null name="s"/>
<null name="sum"/>
</lst>
<lst name="dmr">
<str name="cma">+2MONTHS</str>
<str name="cme">+2YEARS</str>
<date name="dmma">1812-02-29T23:59:59Z</date>
<date name="dmme">1807-12-31T23:59:59Z</date>
<date name="max">1811-12-31T23:59:59Z</date>
<date name="median">1805-12-31T23:59:59Z</date>
</lst>
<lst name="cnr">
<double name="c10">10.0</double>
<double name="c8">8.0</double>
</lst>
<lst name="avr">
<double name="c">100.0</double>
<long name="count">100</long>
<null name="s"/>
<null name="sum"/>
</lst>
<lst name="pr">
<long name="count">100</long>
<double name="mc">1.2729436151389237E146</double>
<double name="mean">28.91</double>
<double name="su">3.9603293116911423E124</double>
<double name="sum">2891.0</double>
<long name="unique">36</long>
</lst>
<lst name="cr">
<str name="ccmax">this is the secondstr9</str>
<str name="ccmin">this is the firststr0</str>
<str name="csmax">this is the second</str>
<str name="csmin">this is the first</str>
<str name="max">str9</str>
<str name="min">str0</str>
</lst>
<lst name="dr">
<long name="count">100</long>
<double name="mc">0.2891</double>
<double name="mean">28.91</double>
<double name="su">80.30555555555556</double>
<double name="sum">2891.0</double>
<long name="unique">36</long>
</lst>
<lst name="cdr">
<date name="cd1">1800-12-31T23:59:59Z</date>
<date name="cd2">1804-06-30T23:59:59Z</date>
<str name="cs1">1800-12-31T23:59:59Z</str>
<str name="cs2">1804-06-30T23:59:59Z</str>
</lst>
<lst name="ar">
<long name="count">100</long>
<null name="mcm"/>
<null name="mean"/>
<null name="median"/>
<null name="su"/>
<null name="sum"/>
<null name="unique"/>
</lst>
</lst>
</response>
at __randomizedtesting.SeedInfo.seed([31E8FA9B808C782B:1044DA8E4D11204D]:0)
at org.junit.Assert.fail(Assert.java:93)
at org.apache.solr.analytics.AbstractAnalyticsStatsTest.getStatResult(AbstractAnalyticsStatsTest.java:114)
at org.apache.solr.analytics.expression.ExpressionTest.absoluteValueTest(ExpressionTest.java:143)
at sun.reflect.NativeMethodAccessorImpl.invoke0(Native Method)
at sun.reflect.NativeMethodAccessorImpl.invoke(NativeMethodAccessorImpl.java:88)
at sun.reflect.DelegatingMethodAccessorImpl.invoke(DelegatingMethodAccessorImpl.java:55)
at java.lang.reflect.Method.invoke(Method.java:613)
at com.carrotsearch.randomizedtesting.RandomizedRunner.invoke(RandomizedRunner.java:1559)
at com.carrotsearch.randomizedtesting.RandomizedRunner.access$600(RandomizedRunner.java:79)
at com.carrotsearch.randomizedtesting.RandomizedRunner$6.evaluate(RandomizedRunner.java:737)
at com.carrotsearch.randomizedtesting.RandomizedRunner$7.evaluate(RandomizedRunner.java:773)
at com.carrotsearch.randomizedtesting.RandomizedRunner$8.evaluate(RandomizedRunner.java:787)
at com.carrotsearch.randomizedtesting.rules.SystemPropertiesRestoreRule$1.evaluate(SystemPropertiesRestoreRule.java:53)
at org.apache.lucene.util.TestRuleSetupTeardownChained$1.evaluate(TestRuleSetupTeardownChained.java:50)
at org.apache.lucene.util.TestRuleFieldCacheSanity$1.evaluate(TestRuleFieldCacheSanity.java:51)
at org.apache.lucene.util.AbstractBeforeAfterRule$1.evaluate(AbstractBeforeAfterRule.java:46)
at com.carrotsearch.randomizedtesting.rules.SystemPropertiesInvariantRule$1.evaluate(SystemPropertiesInvariantRule.java:55)
at org.apache.lucene.util.TestRuleThreadAndTestName$1.evaluate(TestRuleThreadAndTestName.java:49)
at org.apache.lucene.util.TestRuleIgnoreAfterMaxFailures$1.evaluate(TestRuleIgnoreAfterMaxFailures.java:70)
at org.apache.lucene.util.TestRuleMarkFailure$1.evaluate(TestRuleMarkFailure.java:48)
at com.carrotsearch.randomizedtesting.rules.StatementAdapter.evaluate(StatementAdapter.java:36)
at com.carrotsearch.randomizedtesting.ThreadLeakControl$StatementRunner.run(ThreadLeakControl.java:358)
at com.carrotsearch.randomizedtesting.ThreadLeakControl.forkTimeoutingTask(ThreadLeakControl.java:782)
at com.carrotsearch.randomizedtesting.ThreadLeakControl$3.evaluate(ThreadLeakControl.java:442)
at com.carrotsearch.randomizedtesting.RandomizedRunner.runSingleTest(RandomizedRunner.java:746)
at com.carrotsearch.randomizedtesting.RandomizedRunner$3.evaluate(RandomizedRunner.java:648)
at com.carrotsearch.randomizedtesting.RandomizedRunner$4.evaluate(RandomizedRunner.java:682)
at com.carrotsearch.randomizedtesting.RandomizedRunner$5.evaluate(RandomizedRunner.java:693)
at com.carrotsearch.randomizedtesting.rules.StatementAdapter.evaluate(StatementAdapter.java:36)
at com.carrotsearch.randomizedtesting.rules.SystemPropertiesRestoreRule$1.evaluate(SystemPropertiesRestoreRule.java:53)
at org.apache.lucene.util.AbstractBeforeAfterRule$1.evaluate(AbstractBeforeAfterRule.java:46)
at org.apache.lucene.util.TestRuleStoreClassName$1.evaluate(TestRuleStoreClassName.java:42)
at com.carrotsearch.randomizedtesting.rules.SystemPropertiesInvariantRule$1.evaluate(SystemPropertiesInvariantRule.java:55)
at com.carrotsearch.randomizedtesting.rules.NoShadowingOrOverridesOnMethodsRule$1.evaluate(NoShadowingOrOverridesOnMethodsRule.java:39)
at com.carrotsearch.randomizedtesting.rules.NoShadowingOrOverridesOnMethodsRule$1.evaluate(NoShadowingOrOverridesOnMethodsRule.java:39)
at com.carrotsearch.randomizedtesting.rules.StatementAdapter.evaluate(StatementAdapter.java:36)
at org.apache.lucene.util.TestRuleAssertionsRequired$1.evaluate(TestRuleAssertionsRequired.java:43)
at org.apache.lucene.util.TestRuleMarkFailure$1.evaluate(TestRuleMarkFailure.java:48)
at org.apache.lucene.util.TestRuleIgnoreAfterMaxFailures$1.evaluate(TestRuleIgnoreAfterMaxFailures.java:70)
at org.apache.lucene.util.TestRuleIgnoreTestSuites$1.evaluate(TestRuleIgnoreTestSuites.java:55)
at com.carrotsearch.randomizedtesting.rules.StatementAdapter.evaluate(StatementAdapter.java:36)
at com.carrotsearch.randomizedtesting.ThreadLeakControl$StatementRunner.run(ThreadLeakControl.java:358)
at java.lang.Thread.run(Thread.java:780)
REGRESSION: org.apache.solr.analytics.expression.ExpressionTest.addTest
Error Message:
Caught exception in getStatResult, xPath = /response/lst[@name='stats']/lst[@name='ar']/double[@name='sum'] raw data: <?xml version="1.0" encoding="UTF-8"?> <response> <lst name="responseHeader"> <int name="status">0</int> <int name="QTime">11</int> </lst> <result name="response" numFound="100" start="0"> </result> <lst name="stats"> <lst name="stats_fields"/> </lst> <lst name="stats"> <lst name="mr"> <long name="count">100</long> <double name="mcm">70829.5</double> <double name="mean">28.91</double> <double name="median">24.5</double> <double name="su">104076.0</double> <double name="sum">2891.0</double> <long name="unique">36</long> </lst> <lst name="csr"> <str name="cs1">this is the first</str> <str name="cs2">this is the second</str> <str name="cs3">this is the third</str> </lst> <lst name="rr"> <str name="max">str9</str> <str name="min">str0</str> <str name="rmax">9rts</str> <str name="rmin">0rts</str> </lst> <lst name="nr"> <double name="c">-100.0</double> <long name="count">100</long> <null name="s"/> <null name="sum"/> </lst> <lst name="dmr"> <str name="cma">+2MONTHS</str> <str name="cme">+2YEARS</str> <date name="dmma">1812-02-29T23:59:59Z</date> <date name="dmme">1807-12-31T23:59:59Z</date> <date name="max">1811-12-31T23:59:59Z</date> <date name="median">1805-12-31T23:59:59Z</date> </lst> <lst name="cnr"> <double name="c10">10.0</double> <double name="c8">8.0</double> </lst> <lst name="avr"> <double name="c">100.0</double> <long name="count">100</long> <null name="s"/> <null name="sum"/> </lst> <lst name="pr"> <long name="count">100</long> <double name="mc">1.2729436151389237E146</double> <double name="mean">28.91</double> <double name="su">3.9603293116911423E124</double> <double name="sum">2891.0</double> <long name="unique">36</long> </lst> <lst name="cr"> <str name="ccmax">this is the secondstr9</str> <str name="ccmin">this is the firststr0</str> <str name="csmax">this is the second</str> <str name="csmin">this is the first</str> <str name="max">str9</str> <str name="min">str0</str> </lst> <lst name="dr"> <long name="count">100</long> <double name="mc">0.2891</double> <double name="mean">28.91</double> <double name="su">80.30555555555556</double> <double name="sum">2891.0</double> <long name="unique">36</long> </lst> <lst name="cdr"> <date name="cd1">1800-12-31T23:59:59Z</date> <date name="cd2">1804-06-30T23:59:59Z</date> <str name="cs1">1800-12-31T23:59:59Z</str> <str name="cs2">1804-06-30T23:59:59Z</str> </lst> <lst name="ar"> <long name="count">100</long> <null name="mcm"/> <null name="mean"/> <null name="median"/> <null name="su"/> <null name="sum"/> <null name="unique"/> </lst> </lst> </response>
Stack Trace:
java.lang.AssertionError: Caught exception in getStatResult, xPath = /response/lst[@name='stats']/lst[@name='ar']/double[@name='sum']
raw data: <?xml version="1.0" encoding="UTF-8"?>
<response>
<lst name="responseHeader">
<int name="status">0</int>
<int name="QTime">11</int>
</lst>
<result name="response" numFound="100" start="0">
</result>
<lst name="stats">
<lst name="stats_fields"/>
</lst>
<lst name="stats">
<lst name="mr">
<long name="count">100</long>
<double name="mcm">70829.5</double>
<double name="mean">28.91</double>
<double name="median">24.5</double>
<double name="su">104076.0</double>
<double name="sum">2891.0</double>
<long name="unique">36</long>
</lst>
<lst name="csr">
<str name="cs1">this is the first</str>
<str name="cs2">this is the second</str>
<str name="cs3">this is the third</str>
</lst>
<lst name="rr">
<str name="max">str9</str>
<str name="min">str0</str>
<str name="rmax">9rts</str>
<str name="rmin">0rts</str>
</lst>
<lst name="nr">
<double name="c">-100.0</double>
<long name="count">100</long>
<null name="s"/>
<null name="sum"/>
</lst>
<lst name="dmr">
<str name="cma">+2MONTHS</str>
<str name="cme">+2YEARS</str>
<date name="dmma">1812-02-29T23:59:59Z</date>
<date name="dmme">1807-12-31T23:59:59Z</date>
<date name="max">1811-12-31T23:59:59Z</date>
<date name="median">1805-12-31T23:59:59Z</date>
</lst>
<lst name="cnr">
<double name="c10">10.0</double>
<double name="c8">8.0</double>
</lst>
<lst name="avr">
<double name="c">100.0</double>
<long name="count">100</long>
<null name="s"/>
<null name="sum"/>
</lst>
<lst name="pr">
<long name="count">100</long>
<double name="mc">1.2729436151389237E146</double>
<double name="mean">28.91</double>
<double name="su">3.9603293116911423E124</double>
<double name="sum">2891.0</double>
<long name="unique">36</long>
</lst>
<lst name="cr">
<str name="ccmax">this is the secondstr9</str>
<str name="ccmin">this is the firststr0</str>
<str name="csmax">this is the second</str>
<str name="csmin">this is the first</str>
<str name="max">str9</str>
<str name="min">str0</str>
</lst>
<lst name="dr">
<long name="count">100</long>
<double name="mc">0.2891</double>
<double name="mean">28.91</double>
<double name="su">80.30555555555556</double>
<double name="sum">2891.0</double>
<long name="unique">36</long>
</lst>
<lst name="cdr">
<date name="cd1">1800-12-31T23:59:59Z</date>
<date name="cd2">1804-06-30T23:59:59Z</date>
<str name="cs1">1800-12-31T23:59:59Z</str>
<str name="cs2">1804-06-30T23:59:59Z</str>
</lst>
<lst name="ar">
<long name="count">100</long>
<null name="mcm"/>
<null name="mean"/>
<null name="median"/>
<null name="su"/>
<null name="sum"/>
<null name="unique"/>
</lst>
</lst>
</response>
at __randomizedtesting.SeedInfo.seed([31E8FA9B808C782B:C7C45745C1437F6C]:0)
at org.junit.Assert.fail(Assert.java:93)
at org.apache.solr.analytics.AbstractAnalyticsStatsTest.getStatResult(AbstractAnalyticsStatsTest.java:114)
at org.apache.solr.analytics.expression.ExpressionTest.addTest(ExpressionTest.java:78)
at sun.reflect.NativeMethodAccessorImpl.invoke0(Native Method)
at sun.reflect.NativeMethodAccessorImpl.invoke(NativeMethodAccessorImpl.java:88)
at sun.reflect.DelegatingMethodAccessorImpl.invoke(DelegatingMethodAccessorImpl.java:55)
at java.lang.reflect.Method.invoke(Method.java:613)
at com.carrotsearch.randomizedtesting.RandomizedRunner.invoke(RandomizedRunner.java:1559)
at com.carrotsearch.randomizedtesting.RandomizedRunner.access$600(RandomizedRunner.java:79)
at com.carrotsearch.randomizedtesting.RandomizedRunner$6.evaluate(RandomizedRunner.java:737)
at com.carrotsearch.randomizedtesting.RandomizedRunner$7.evaluate(RandomizedRunner.java:773)
at com.carrotsearch.randomizedtesting.RandomizedRunner$8.evaluate(RandomizedRunner.java:787)
at com.carrotsearch.randomizedtesting.rules.SystemPropertiesRestoreRule$1.evaluate(SystemPropertiesRestoreRule.java:53)
at org.apache.lucene.util.TestRuleSetupTeardownChained$1.evaluate(TestRuleSetupTeardownChained.java:50)
at org.apache.lucene.util.TestRuleFieldCacheSanity$1.evaluate(TestRuleFieldCacheSanity.java:51)
at org.apache.lucene.util.AbstractBeforeAfterRule$1.evaluate(AbstractBeforeAfterRule.java:46)
at com.carrotsearch.randomizedtesting.rules.SystemPropertiesInvariantRule$1.evaluate(SystemPropertiesInvariantRule.java:55)
at org.apache.lucene.util.TestRuleThreadAndTestName$1.evaluate(TestRuleThreadAndTestName.java:49)
at org.apache.lucene.util.TestRuleIgnoreAfterMaxFailures$1.evaluate(TestRuleIgnoreAfterMaxFailures.java:70)
at org.apache.lucene.util.TestRuleMarkFailure$1.evaluate(TestRuleMarkFailure.java:48)
at com.carrotsearch.randomizedtesting.rules.StatementAdapter.evaluate(StatementAdapter.java:36)
at com.carrotsearch.randomizedtesting.ThreadLeakControl$StatementRunner.run(ThreadLeakControl.java:358)
at com.carrotsearch.randomizedtesting.ThreadLeakControl.forkTimeoutingTask(ThreadLeakControl.java:782)
at com.carrotsearch.randomizedtesting.ThreadLeakControl$3.evaluate(ThreadLeakControl.java:442)
at com.carrotsearch.randomizedtesting.RandomizedRunner.runSingleTest(RandomizedRunner.java:746)
at com.carrotsearch.randomizedtesting.RandomizedRunner$3.evaluate(RandomizedRunner.java:648)
at com.carrotsearch.randomizedtesting.RandomizedRunner$4.evaluate(RandomizedRunner.java:682)
at com.carrotsearch.randomizedtesting.RandomizedRunner$5.evaluate(RandomizedRunner.java:693)
at com.carrotsearch.randomizedtesting.rules.StatementAdapter.evaluate(StatementAdapter.java:36)
at com.carrotsearch.randomizedtesting.rules.SystemPropertiesRestoreRule$1.evaluate(SystemPropertiesRestoreRule.java:53)
at org.apache.lucene.util.AbstractBeforeAfterRule$1.evaluate(AbstractBeforeAfterRule.java:46)
at org.apache.lucene.util.TestRuleStoreClassName$1.evaluate(TestRuleStoreClassName.java:42)
at com.carrotsearch.randomizedtesting.rules.SystemPropertiesInvariantRule$1.evaluate(SystemPropertiesInvariantRule.java:55)
at com.carrotsearch.randomizedtesting.rules.NoShadowingOrOverridesOnMethodsRule$1.evaluate(NoShadowingOrOverridesOnMethodsRule.java:39)
at com.carrotsearch.randomizedtesting.rules.NoShadowingOrOverridesOnMethodsRule$1.evaluate(NoShadowingOrOverridesOnMethodsRule.java:39)
at com.carrotsearch.randomizedtesting.rules.StatementAdapter.evaluate(StatementAdapter.java:36)
at org.apache.lucene.util.TestRuleAssertionsRequired$1.evaluate(TestRuleAssertionsRequired.java:43)
at org.apache.lucene.util.TestRuleMarkFailure$1.evaluate(TestRuleMarkFailure.java:48)
at org.apache.lucene.util.TestRuleIgnoreAfterMaxFailures$1.evaluate(TestRuleIgnoreAfterMaxFailures.java:70)
at org.apache.lucene.util.TestRuleIgnoreTestSuites$1.evaluate(TestRuleIgnoreTestSuites.java:55)
at com.carrotsearch.randomizedtesting.rules.StatementAdapter.evaluate(StatementAdapter.java:36)
at com.carrotsearch.randomizedtesting.ThreadLeakControl$StatementRunner.run(ThreadLeakControl.java:358)
at java.lang.Thread.run(Thread.java:780)
REGRESSION: org.apache.solr.analytics.expression.ExpressionTest.negateTest
Error Message:
Caught exception in getStatResult, xPath = /response/lst[@name='stats']/lst[@name='nr']/double[@name='sum'] raw data: <?xml version="1.0" encoding="UTF-8"?> <response> <lst name="responseHeader"> <int name="status">0</int> <int name="QTime">11</int> </lst> <result name="response" numFound="100" start="0"> </result> <lst name="stats"> <lst name="stats_fields"/> </lst> <lst name="stats"> <lst name="mr"> <long name="count">100</long> <double name="mcm">70829.5</double> <double name="mean">28.91</double> <double name="median">24.5</double> <double name="su">104076.0</double> <double name="sum">2891.0</double> <long name="unique">36</long> </lst> <lst name="csr"> <str name="cs1">this is the first</str> <str name="cs2">this is the second</str> <str name="cs3">this is the third</str> </lst> <lst name="rr"> <str name="max">str9</str> <str name="min">str0</str> <str name="rmax">9rts</str> <str name="rmin">0rts</str> </lst> <lst name="nr"> <double name="c">-100.0</double> <long name="count">100</long> <null name="s"/> <null name="sum"/> </lst> <lst name="dmr"> <str name="cma">+2MONTHS</str> <str name="cme">+2YEARS</str> <date name="dmma">1812-02-29T23:59:59Z</date> <date name="dmme">1807-12-31T23:59:59Z</date> <date name="max">1811-12-31T23:59:59Z</date> <date name="median">1805-12-31T23:59:59Z</date> </lst> <lst name="cnr"> <double name="c10">10.0</double> <double name="c8">8.0</double> </lst> <lst name="avr"> <double name="c">100.0</double> <long name="count">100</long> <null name="s"/> <null name="sum"/> </lst> <lst name="pr"> <long name="count">100</long> <double name="mc">1.2729436151389237E146</double> <double name="mean">28.91</double> <double name="su">3.9603293116911423E124</double> <double name="sum">2891.0</double> <long name="unique">36</long> </lst> <lst name="cr"> <str name="ccmax">this is the secondstr9</str> <str name="ccmin">this is the firststr0</str> <str name="csmax">this is the second</str> <str name="csmin">this is the first</str> <str name="max">str9</str> <str name="min">str0</str> </lst> <lst name="dr"> <long name="count">100</long> <double name="mc">0.2891</double> <double name="mean">28.91</double> <double name="su">80.30555555555556</double> <double name="sum">2891.0</double> <long name="unique">36</long> </lst> <lst name="cdr"> <date name="cd1">1800-12-31T23:59:59Z</date> <date name="cd2">1804-06-30T23:59:59Z</date> <str name="cs1">1800-12-31T23:59:59Z</str> <str name="cs2">1804-06-30T23:59:59Z</str> </lst> <lst name="ar"> <long name="count">100</long> <null name="mcm"/> <null name="mean"/> <null name="median"/> <null name="su"/> <null name="sum"/> <null name="unique"/> </lst> </lst> </response>
Stack Trace:
java.lang.AssertionError: Caught exception in getStatResult, xPath = /response/lst[@name='stats']/lst[@name='nr']/double[@name='sum']
raw data: <?xml version="1.0" encoding="UTF-8"?>
<response>
<lst name="responseHeader">
<int name="status">0</int>
<int name="QTime">11</int>
</lst>
<result name="response" numFound="100" start="0">
</result>
<lst name="stats">
<lst name="stats_fields"/>
</lst>
<lst name="stats">
<lst name="mr">
<long name="count">100</long>
<double name="mcm">70829.5</double>
<double name="mean">28.91</double>
<double name="median">24.5</double>
<double name="su">104076.0</double>
<double name="sum">2891.0</double>
<long name="unique">36</long>
</lst>
<lst name="csr">
<str name="cs1">this is the first</str>
<str name="cs2">this is the second</str>
<str name="cs3">this is the third</str>
</lst>
<lst name="rr">
<str name="max">str9</str>
<str name="min">str0</str>
<str name="rmax">9rts</str>
<str name="rmin">0rts</str>
</lst>
<lst name="nr">
<double name="c">-100.0</double>
<long name="count">100</long>
<null name="s"/>
<null name="sum"/>
</lst>
<lst name="dmr">
<str name="cma">+2MONTHS</str>
<str name="cme">+2YEARS</str>
<date name="dmma">1812-02-29T23:59:59Z</date>
<date name="dmme">1807-12-31T23:59:59Z</date>
<date name="max">1811-12-31T23:59:59Z</date>
<date name="median">1805-12-31T23:59:59Z</date>
</lst>
<lst name="cnr">
<double name="c10">10.0</double>
<double name="c8">8.0</double>
</lst>
<lst name="avr">
<double name="c">100.0</double>
<long name="count">100</long>
<null name="s"/>
<null name="sum"/>
</lst>
<lst name="pr">
<long name="count">100</long>
<double name="mc">1.2729436151389237E146</double>
<double name="mean">28.91</double>
<double name="su">3.9603293116911423E124</double>
<double name="sum">2891.0</double>
<long name="unique">36</long>
</lst>
<lst name="cr">
<str name="ccmax">this is the secondstr9</str>
<str name="ccmin">this is the firststr0</str>
<str name="csmax">this is the second</str>
<str name="csmin">this is the first</str>
<str name="max">str9</str>
<str name="min">str0</str>
</lst>
<lst name="dr">
<long name="count">100</long>
<double name="mc">0.2891</double>
<double name="mean">28.91</double>
<double name="su">80.30555555555556</double>
<double name="sum">2891.0</double>
<long name="unique">36</long>
</lst>
<lst name="cdr">
<date name="cd1">1800-12-31T23:59:59Z</date>
<date name="cd2">1804-06-30T23:59:59Z</date>
<str name="cs1">1800-12-31T23:59:59Z</str>
<str name="cs2">1804-06-30T23:59:59Z</str>
</lst>
<lst name="ar">
<long name="count">100</long>
<null name="mcm"/>
<null name="mean"/>
<null name="median"/>
<null name="su"/>
<null name="sum"/>
<null name="unique"/>
</lst>
</lst>
</response>
at __randomizedtesting.SeedInfo.seed([31E8FA9B808C782B:39E0923E24A1289B]:0)
at org.junit.Assert.fail(Assert.java:93)
at org.apache.solr.analytics.AbstractAnalyticsStatsTest.getStatResult(AbstractAnalyticsStatsTest.java:114)
at org.apache.solr.analytics.expression.ExpressionTest.negateTest(ExpressionTest.java:132)
at sun.reflect.NativeMethodAccessorImpl.invoke0(Native Method)
at sun.reflect.NativeMethodAccessorImpl.invoke(NativeMethodAccessorImpl.java:88)
at sun.reflect.DelegatingMethodAccessorImpl.invoke(DelegatingMethodAccessorImpl.java:55)
at java.lang.reflect.Method.invoke(Method.java:613)
at com.carrotsearch.randomizedtesting.RandomizedRunner.invoke(RandomizedRunner.java:1559)
at com.carrotsearch.randomizedtesting.RandomizedRunner.access$600(RandomizedRunner.java:79)
at com.carrotsearch.randomizedtesting.RandomizedRunner$6.evaluate(RandomizedRunner.java:737)
at com.carrotsearch.randomizedtesting.RandomizedRunner$7.evaluate(RandomizedRunner.java:773)
at com.carrotsearch.randomizedtesting.RandomizedRunner$8.evaluate(RandomizedRunner.java:787)
at com.carrotsearch.randomizedtesting.rules.SystemPropertiesRestoreRule$1.evaluate(SystemPropertiesRestoreRule.java:53)
at org.apache.lucene.util.TestRuleSetupTeardownChained$1.evaluate(TestRuleSetupTeardownChained.java:50)
at org.apache.lucene.util.TestRuleFieldCacheSanity$1.evaluate(TestRuleFieldCacheSanity.java:51)
at org.apache.lucene.util.AbstractBeforeAfterRule$1.evaluate(AbstractBeforeAfterRule.java:46)
at com.carrotsearch.randomizedtesting.rules.SystemPropertiesInvariantRule$1.evaluate(SystemPropertiesInvariantRule.java:55)
at org.apache.lucene.util.TestRuleThreadAndTestName$1.evaluate(TestRuleThreadAndTestName.java:49)
at org.apache.lucene.util.TestRuleIgnoreAfterMaxFailures$1.evaluate(TestRuleIgnoreAfterMaxFailures.java:70)
at org.apache.lucene.util.TestRuleMarkFailure$1.evaluate(TestRuleMarkFailure.java:48)
at com.carrotsearch.randomizedtesting.rules.StatementAdapter.evaluate(StatementAdapter.java:36)
at com.carrotsearch.randomizedtesting.ThreadLeakControl$StatementRunner.run(ThreadLeakControl.java:358)
at com.carrotsearch.randomizedtesting.ThreadLeakControl.forkTimeoutingTask(ThreadLeakControl.java:782)
at com.carrotsearch.randomizedtesting.ThreadLeakControl$3.evaluate(ThreadLeakControl.java:442)
at com.carrotsearch.randomizedtesting.RandomizedRunner.runSingleTest(RandomizedRunner.java:746)
at com.carrotsearch.randomizedtesting.RandomizedRunner$3.evaluate(RandomizedRunner.java:648)
at com.carrotsearch.randomizedtesting.RandomizedRunner$4.evaluate(RandomizedRunner.java:682)
at com.carrotsearch.randomizedtesting.RandomizedRunner$5.evaluate(RandomizedRunner.java:693)
at com.carrotsearch.randomizedtesting.rules.StatementAdapter.evaluate(StatementAdapter.java:36)
at com.carrotsearch.randomizedtesting.rules.SystemPropertiesRestoreRule$1.evaluate(SystemPropertiesRestoreRule.java:53)
at org.apache.lucene.util.AbstractBeforeAfterRule$1.evaluate(AbstractBeforeAfterRule.java:46)
at org.apache.lucene.util.TestRuleStoreClassName$1.evaluate(TestRuleStoreClassName.java:42)
at com.carrotsearch.randomizedtesting.rules.SystemPropertiesInvariantRule$1.evaluate(SystemPropertiesInvariantRule.java:55)
at com.carrotsearch.randomizedtesting.rules.NoShadowingOrOverridesOnMethodsRule$1.evaluate(NoShadowingOrOverridesOnMethodsRule.java:39)
at com.carrotsearch.randomizedtesting.rules.NoShadowingOrOverridesOnMethodsRule$1.evaluate(NoShadowingOrOverridesOnMethodsRule.java:39)
at com.carrotsearch.randomizedtesting.rules.StatementAdapter.evaluate(StatementAdapter.java:36)
at org.apache.lucene.util.TestRuleAssertionsRequired$1.evaluate(TestRuleAssertionsRequired.java:43)
at org.apache.lucene.util.TestRuleMarkFailure$1.evaluate(TestRuleMarkFailure.java:48)
at org.apache.lucene.util.TestRuleIgnoreAfterMaxFailures$1.evaluate(TestRuleIgnoreAfterMaxFailures.java:70)
at org.apache.lucene.util.TestRuleIgnoreTestSuites$1.evaluate(TestRuleIgnoreTestSuites.java:55)
at com.carrotsearch.randomizedtesting.rules.StatementAdapter.evaluate(StatementAdapter.java:36)
at com.carrotsearch.randomizedtesting.ThreadLeakControl$StatementRunner.run(ThreadLeakControl.java:358)
at java.lang.Thread.run(Thread.java:780)
REGRESSION: org.apache.solr.cloud.ChaosMonkeyNothingIsSafeTest.testDistribSearch
Error Message:
document count mismatch. control=1831 sum(shards)=1514 cloudClient=1514
Stack Trace:
java.lang.AssertionError: document count mismatch. control=1831 sum(shards)=1514 cloudClient=1514
at __randomizedtesting.SeedInfo.seed([31E8FA9B808C782B:B00E7483F7D31817]:0)
at org.junit.Assert.fail(Assert.java:93)
at org.apache.solr.cloud.AbstractFullDistribZkTestBase.checkShardConsistency(AbstractFullDistribZkTestBase.java:1215)
at org.apache.solr.cloud.ChaosMonkeyNothingIsSafeTest.doTest(ChaosMonkeyNothingIsSafeTest.java:213)
at org.apache.solr.BaseDistributedSearchTestCase.testDistribSearch(BaseDistributedSearchTestCase.java:867)
at sun.reflect.NativeMethodAccessorImpl.invoke0(Native Method)
at sun.reflect.NativeMethodAccessorImpl.invoke(NativeMethodAccessorImpl.java:88)
at sun.reflect.DelegatingMethodAccessorImpl.invoke(DelegatingMethodAccessorImpl.java:55)
at java.lang.reflect.Method.invoke(Method.java:613)
at com.carrotsearch.randomizedtesting.RandomizedRunner.invoke(RandomizedRunner.java:1559)
at com.carrotsearch.randomizedtesting.RandomizedRunner.access$600(RandomizedRunner.java:79)
at com.carrotsearch.randomizedtesting.RandomizedRunner$6.evaluate(RandomizedRunner.java:737)
at com.carrotsearch.randomizedtesting.RandomizedRunner$7.evaluate(RandomizedRunner.java:773)
at com.carrotsearch.randomizedtesting.RandomizedRunner$8.evaluate(RandomizedRunner.java:787)
at com.carrotsearch.randomizedtesting.rules.SystemPropertiesRestoreRule$1.evaluate(SystemPropertiesRestoreRule.java:53)
at org.apache.lucene.util.TestRuleSetupTeardownChained$1.evaluate(TestRuleSetupTeardownChained.java:50)
at org.apache.lucene.util.TestRuleFieldCacheSanity$1.evaluate(TestRuleFieldCacheSanity.java:51)
at org.apache.lucene.util.AbstractBeforeAfterRule$1.evaluate(AbstractBeforeAfterRule.java:46)
at com.carrotsearch.randomizedtesting.rules.SystemPropertiesInvariantRule$1.evaluate(SystemPropertiesInvariantRule.java:55)
at org.apache.lucene.util.TestRuleThreadAndTestName$1.evaluate(TestRuleThreadAndTestName.java:49)
at org.apache.lucene.util.TestRuleIgnoreAfterMaxFailures$1.evaluate(TestRuleIgnoreAfterMaxFailures.java:70)
at org.apache.lucene.util.TestRuleMarkFailure$1.evaluate(TestRuleMarkFailure.java:48)
at com.carrotsearch.randomizedtesting.rules.StatementAdapter.evaluate(StatementAdapter.java:36)
at com.carrotsearch.randomizedtesting.ThreadLeakControl$StatementRunner.run(ThreadLeakControl.java:358)
at com.carrotsearch.randomizedtesting.ThreadLeakControl.forkTimeoutingTask(ThreadLeakControl.java:782)
at com.carrotsearch.randomizedtesting.ThreadLeakControl$3.evaluate(ThreadLeakControl.java:442)
at com.carrotsearch.randomizedtesting.RandomizedRunner.runSingleTest(RandomizedRunner.java:746)
at com.carrotsearch.randomizedtesting.RandomizedRunner$3.evaluate(RandomizedRunner.java:648)
at com.carrotsearch.randomizedtesting.RandomizedRunner$4.evaluate(RandomizedRunner.java:682)
at com.carrotsearch.randomizedtesting.RandomizedRunner$5.evaluate(RandomizedRunner.java:693)
at com.carrotsearch.randomizedtesting.rules.StatementAdapter.evaluate(StatementAdapter.java:36)
at com.carrotsearch.randomizedtesting.rules.SystemPropertiesRestoreRule$1.evaluate(SystemPropertiesRestoreRule.java:53)
at org.apache.lucene.util.AbstractBeforeAfterRule$1.evaluate(AbstractBeforeAfterRule.java:46)
at org.apache.lucene.util.TestRuleStoreClassName$1.evaluate(TestRuleStoreClassName.java:42)
at com.carrotsearch.randomizedtesting.rules.SystemPropertiesInvariantRule$1.evaluate(SystemPropertiesInvariantRule.java:55)
at com.carrotsearch.randomizedtesting.rules.NoShadowingOrOverridesOnMethodsRule$1.evaluate(NoShadowingOrOverridesOnMethodsRule.java:39)
at com.carrotsearch.randomizedtesting.rules.NoShadowingOrOverridesOnMethodsRule$1.evaluate(NoShadowingOrOverridesOnMethodsRule.java:39)
at com.carrotsearch.randomizedtesting.rules.StatementAdapter.evaluate(StatementAdapter.java:36)
at org.apache.lucene.util.TestRuleAssertionsRequired$1.evaluate(TestRuleAssertionsRequired.java:43)
at org.apache.lucene.util.TestRuleMarkFailure$1.evaluate(TestRuleMarkFailure.java:48)
at org.apache.lucene.util.TestRuleIgnoreAfterMaxFailures$1.evaluate(TestRuleIgnoreAfterMaxFailures.java:70)
at org.apache.lucene.util.TestRuleIgnoreTestSuites$1.evaluate(TestRuleIgnoreTestSuites.java:55)
at com.carrotsearch.randomizedtesting.rules.StatementAdapter.evaluate(StatementAdapter.java:36)
at com.carrotsearch.randomizedtesting.ThreadLeakControl$StatementRunner.run(ThreadLeakControl.java:358)
at java.lang.Thread.run(Thread.java:780)
REGRESSION: org.apache.solr.handler.component.DistributedQueryElevationComponentTest.testDistribSearch
Error Message:
.responseHeader.params.rows!=version (unordered or missing)
Stack Trace:
junit.framework.AssertionFailedError: .responseHeader.params.rows!=version (unordered or missing)
at __randomizedtesting.SeedInfo.seed([31E8FA9B808C782B:B00E7483F7D31817]:0)
at junit.framework.Assert.fail(Assert.java:50)
at org.apache.solr.BaseDistributedSearchTestCase.compareSolrResponses(BaseDistributedSearchTestCase.java:840)
at org.apache.solr.BaseDistributedSearchTestCase.compareResponses(BaseDistributedSearchTestCase.java:859)
at org.apache.solr.BaseDistributedSearchTestCase.query(BaseDistributedSearchTestCase.java:562)
at org.apache.solr.BaseDistributedSearchTestCase.query(BaseDistributedSearchTestCase.java:542)
at org.apache.solr.BaseDistributedSearchTestCase.query(BaseDistributedSearchTestCase.java:521)
at org.apache.solr.handler.component.DistributedQueryElevationComponentTest.doTest(DistributedQueryElevationComponentTest.java:81)
at org.apache.solr.BaseDistributedSearchTestCase.testDistribSearch(BaseDistributedSearchTestCase.java:867)
at sun.reflect.NativeMethodAccessorImpl.invoke0(Native Method)
at sun.reflect.NativeMethodAccessorImpl.invoke(NativeMethodAccessorImpl.java:88)
at sun.reflect.DelegatingMethodAccessorImpl.invoke(DelegatingMethodAccessorImpl.java:55)
at java.lang.reflect.Method.invoke(Method.java:613)
at com.carrotsearch.randomizedtesting.RandomizedRunner.invoke(RandomizedRunner.java:1559)
at com.carrotsearch.randomizedtesting.RandomizedRunner.access$600(RandomizedRunner.java:79)
at com.carrotsearch.randomizedtesting.RandomizedRunner$6.evaluate(RandomizedRunner.java:737)
at com.carrotsearch.randomizedtesting.RandomizedRunner$7.evaluate(RandomizedRunner.java:773)
at com.carrotsearch.randomizedtesting.RandomizedRunner$8.evaluate(RandomizedRunner.java:787)
at com.carrotsearch.randomizedtesting.rules.SystemPropertiesRestoreRule$1.evaluate(SystemPropertiesRestoreRule.java:53)
at org.apache.lucene.util.TestRuleSetupTeardownChained$1.evaluate(TestRuleSetupTeardownChained.java:50)
at org.apache.lucene.util.TestRuleFieldCacheSanity$1.evaluate(TestRuleFieldCacheSanity.java:51)
at org.apache.lucene.util.AbstractBeforeAfterRule$1.evaluate(AbstractBeforeAfterRule.java:46)
at com.carrotsearch.randomizedtesting.rules.SystemPropertiesInvariantRule$1.evaluate(SystemPropertiesInvariantRule.java:55)
at org.apache.lucene.util.TestRuleThreadAndTestName$1.evaluate(TestRuleThreadAndTestName.java:49)
at org.apache.lucene.util.TestRuleIgnoreAfterMaxFailures$1.evaluate(TestRuleIgnoreAfterMaxFailures.java:70)
at org.apache.lucene.util.TestRuleMarkFailure$1.evaluate(TestRuleMarkFailure.java:48)
at com.carrotsearch.randomizedtesting.rules.StatementAdapter.evaluate(StatementAdapter.java:36)
at com.carrotsearch.randomizedtesting.ThreadLeakControl$StatementRunner.run(ThreadLeakControl.java:358)
at com.carrotsearch.randomizedtesting.ThreadLeakControl.forkTimeoutingTask(ThreadLeakControl.java:782)
at com.carrotsearch.randomizedtesting.ThreadLeakControl$3.evaluate(ThreadLeakControl.java:442)
at com.carrotsearch.randomizedtesting.RandomizedRunner.runSingleTest(RandomizedRunner.java:746)
at com.carrotsearch.randomizedtesting.RandomizedRunner$3.evaluate(RandomizedRunner.java:648)
at com.carrotsearch.randomizedtesting.RandomizedRunner$4.evaluate(RandomizedRunner.java:682)
at com.carrotsearch.randomizedtesting.RandomizedRunner$5.evaluate(RandomizedRunner.java:693)
at com.carrotsearch.randomizedtesting.rules.StatementAdapter.evaluate(StatementAdapter.java:36)
at com.carrotsearch.randomizedtesting.rules.SystemPropertiesRestoreRule$1.evaluate(SystemPropertiesRestoreRule.java:53)
at org.apache.lucene.util.AbstractBeforeAfterRule$1.evaluate(AbstractBeforeAfterRule.java:46)
at org.apache.lucene.util.TestRuleStoreClassName$1.evaluate(TestRuleStoreClassName.java:42)
at com.carrotsearch.randomizedtesting.rules.SystemPropertiesInvariantRule$1.evaluate(SystemPropertiesInvariantRule.java:55)
at com.carrotsearch.randomizedtesting.rules.NoShadowingOrOverridesOnMethodsRule$1.evaluate(NoShadowingOrOverridesOnMethodsRule.java:39)
at com.carrotsearch.randomizedtesting.rules.NoShadowingOrOverridesOnMethodsRule$1.evaluate(NoShadowingOrOverridesOnMethodsRule.java:39)
at com.carrotsearch.randomizedtesting.rules.StatementAdapter.evaluate(StatementAdapter.java:36)
at org.apache.lucene.util.TestRuleAssertionsRequired$1.evaluate(TestRuleAssertionsRequired.java:43)
at org.apache.lucene.util.TestRuleMarkFailure$1.evaluate(TestRuleMarkFailure.java:48)
at org.apache.lucene.util.TestRuleIgnoreAfterMaxFailures$1.evaluate(TestRuleIgnoreAfterMaxFailures.java:70)
at org.apache.lucene.util.TestRuleIgnoreTestSuites$1.evaluate(TestRuleIgnoreTestSuites.java:55)
at com.carrotsearch.randomizedtesting.rules.StatementAdapter.evaluate(StatementAdapter.java:36)
at com.carrotsearch.randomizedtesting.ThreadLeakControl$StatementRunner.run(ThreadLeakControl.java:358)
at java.lang.Thread.run(Thread.java:780)
REGRESSION: org.apache.solr.handler.component.TermVectorComponentDistributedTest.testDistribSearch
Error Message:
.termVectors.7.test_offtv!=test_basictv (unordered or missing)
Stack Trace:
junit.framework.AssertionFailedError: .termVectors.7.test_offtv!=test_basictv (unordered or missing)
at __randomizedtesting.SeedInfo.seed([31E8FA9B808C782B:B00E7483F7D31817]:0)
at junit.framework.Assert.fail(Assert.java:50)
at org.apache.solr.BaseDistributedSearchTestCase.compareSolrResponses(BaseDistributedSearchTestCase.java:840)
at org.apache.solr.BaseDistributedSearchTestCase.compareResponses(BaseDistributedSearchTestCase.java:859)
at org.apache.solr.BaseDistributedSearchTestCase.query(BaseDistributedSearchTestCase.java:562)
at org.apache.solr.BaseDistributedSearchTestCase.query(BaseDistributedSearchTestCase.java:542)
at org.apache.solr.BaseDistributedSearchTestCase.query(BaseDistributedSearchTestCase.java:521)
at org.apache.solr.handler.component.TermVectorComponentDistributedTest.doTest(TermVectorComponentDistributedTest.java:127)
at org.apache.solr.BaseDistributedSearchTestCase.testDistribSearch(BaseDistributedSearchTestCase.java:873)
at sun.reflect.NativeMethodAccessorImpl.invoke0(Native Method)
at sun.reflect.NativeMethodAccessorImpl.invoke(NativeMethodAccessorImpl.java:88)
at sun.reflect.DelegatingMethodAccessorImpl.invoke(DelegatingMethodAccessorImpl.java:55)
at java.lang.reflect.Method.invoke(Method.java:613)
at com.carrotsearch.randomizedtesting.RandomizedRunner.invoke(RandomizedRunner.java:1559)
at com.carrotsearch.randomizedtesting.RandomizedRunner.access$600(RandomizedRunner.java:79)
at com.carrotsearch.randomizedtesting.RandomizedRunner$6.evaluate(RandomizedRunner.java:737)
at com.carrotsearch.randomizedtesting.RandomizedRunner$7.evaluate(RandomizedRunner.java:773)
at com.carrotsearch.randomizedtesting.RandomizedRunner$8.evaluate(RandomizedRunner.java:787)
at com.carrotsearch.randomizedtesting.rules.SystemPropertiesRestoreRule$1.evaluate(SystemPropertiesRestoreRule.java:53)
at org.apache.lucene.util.TestRuleSetupTeardownChained$1.evaluate(TestRuleSetupTeardownChained.java:50)
at org.apache.lucene.util.TestRuleFieldCacheSanity$1.evaluate(TestRuleFieldCacheSanity.java:51)
at org.apache.lucene.util.AbstractBeforeAfterRule$1.evaluate(AbstractBeforeAfterRule.java:46)
at com.carrotsearch.randomizedtesting.rules.SystemPropertiesInvariantRule$1.evaluate(SystemPropertiesInvariantRule.java:55)
at org.apache.lucene.util.TestRuleThreadAndTestName$1.evaluate(TestRuleThreadAndTestName.java:49)
at org.apache.lucene.util.TestRuleIgnoreAfterMaxFailures$1.evaluate(TestRuleIgnoreAfterMaxFailures.java:70)
at org.apache.lucene.util.TestRuleMarkFailure$1.evaluate(TestRuleMarkFailure.java:48)
at com.carrotsearch.randomizedtesting.rules.StatementAdapter.evaluate(StatementAdapter.java:36)
at com.carrotsearch.randomizedtesting.ThreadLeakControl$StatementRunner.run(ThreadLeakControl.java:358)
at com.carrotsearch.randomizedtesting.ThreadLeakControl.forkTimeoutingTask(ThreadLeakControl.java:782)
at com.carrotsearch.randomizedtesting.ThreadLeakControl$3.evaluate(ThreadLeakControl.java:442)
at com.carrotsearch.randomizedtesting.RandomizedRunner.runSingleTest(RandomizedRunner.java:746)
at com.carrotsearch.randomizedtesting.RandomizedRunner$3.evaluate(RandomizedRunner.java:648)
at com.carrotsearch.randomizedtesting.RandomizedRunner$4.evaluate(RandomizedRunner.java:682)
at com.carrotsearch.randomizedtesting.RandomizedRunner$5.evaluate(RandomizedRunner.java:693)
at com.carrotsearch.randomizedtesting.rules.StatementAdapter.evaluate(StatementAdapter.java:36)
at com.carrotsearch.randomizedtesting.rules.SystemPropertiesRestoreRule$1.evaluate(SystemPropertiesRestoreRule.java:53)
at org.apache.lucene.util.AbstractBeforeAfterRule$1.evaluate(AbstractBeforeAfterRule.java:46)
at org.apache.lucene.util.TestRuleStoreClassName$1.evaluate(TestRuleStoreClassName.java:42)
at com.carrotsearch.randomizedtesting.rules.SystemPropertiesInvariantRule$1.evaluate(SystemPropertiesInvariantRule.java:55)
at com.carrotsearch.randomizedtesting.rules.NoShadowingOrOverridesOnMethodsRule$1.evaluate(NoShadowingOrOverridesOnMethodsRule.java:39)
at com.carrotsearch.randomizedtesting.rules.NoShadowingOrOverridesOnMethodsRule$1.evaluate(NoShadowingOrOverridesOnMethodsRule.java:39)
at com.carrotsearch.randomizedtesting.rules.StatementAdapter.evaluate(StatementAdapter.java:36)
at org.apache.lucene.util.TestRuleAssertionsRequired$1.evaluate(TestRuleAssertionsRequired.java:43)
at org.apache.lucene.util.TestRuleMarkFailure$1.evaluate(TestRuleMarkFailure.java:48)
at org.apache.lucene.util.TestRuleIgnoreAfterMaxFailures$1.evaluate(TestRuleIgnoreAfterMaxFailures.java:70)
at org.apache.lucene.util.TestRuleIgnoreTestSuites$1.evaluate(TestRuleIgnoreTestSuites.java:55)
at com.carrotsearch.randomizedtesting.rules.StatementAdapter.evaluate(StatementAdapter.java:36)
at com.carrotsearch.randomizedtesting.ThreadLeakControl$StatementRunner.run(ThreadLeakControl.java:358)
at java.lang.Thread.run(Thread.java:780)
Build Log:
[...truncated 10003 lines...]
[junit4] Suite: org.apache.solr.cloud.ChaosMonkeyNothingIsSafeTest
[junit4] 2> 3964 T34 oas.BaseDistributedSearchTestCase.initHostContext Setting hostContext system property: /_lc/s
[junit4] 2> 3983 T34 oas.SolrTestCaseJ4.setUp ###Starting testDistribSearch
[junit4] 2> Creating dataDir: /mnt/ssd/jenkins/workspace/Lucene-Solr-trunk-Linux/solr/build/solr-core/test/J1/./solrtest-ChaosMonkeyNothingIsSafeTest-1391308519816
[junit4] 2> 3986 T34 oasc.ZkTestServer.run STARTING ZK TEST SERVER
[junit4] 2> 3988 T35 oasc.ZkTestServer$ZKServerMain.runFromConfig Starting server
[junit4] 2> 4088 T34 oasc.ZkTestServer.run start zk server on port:47690
[junit4] 2> 4145 T34 oascc.ConnectionManager.waitForConnected Waiting for client to connect to ZooKeeper
[junit4] 2> 4266 T43 oascc.ConnectionManager.process Watcher org.apache.solr.common.cloud.ConnectionManager@f8aa3df7 name:ZooKeeperConnection Watcher:127.0.0.1:47690 got event WatchedEvent state:SyncConnected type:None path:null path:null type:None
[junit4] 2> 4267 T34 oascc.ConnectionManager.waitForConnected Client is connected to ZooKeeper
[junit4] 2> 4268 T34 oascc.SolrZkClient.makePath makePath: /solr
[junit4] 2> 4288 T34 oascc.ConnectionManager.waitForConnected Waiting for client to connect to ZooKeeper
[junit4] 2> 4292 T45 oascc.ConnectionManager.process Watcher org.apache.solr.common.cloud.ConnectionManager@49d747a6 name:ZooKeeperConnection Watcher:127.0.0.1:47690/solr got event WatchedEvent state:SyncConnected type:None path:null path:null type:None
[junit4] 2> 4292 T34 oascc.ConnectionManager.waitForConnected Client is connected to ZooKeeper
[junit4] 2> 4297 T34 oascc.SolrZkClient.makePath makePath: /collections/collection1
[junit4] 2> 4305 T34 oascc.SolrZkClient.makePath makePath: /collections/collection1/shards
[junit4] 2> 4310 T34 oascc.SolrZkClient.makePath makePath: /collections/control_collection
[junit4] 2> 4314 T34 oascc.SolrZkClient.makePath makePath: /collections/control_collection/shards
[junit4] 2> 4320 T34 oasc.AbstractZkTestCase.putConfig put /mnt/ssd/jenkins/workspace/Lucene-Solr-trunk-Linux/solr/build/solr-core/test-files/solr/collection1/conf/solrconfig-tlog.xml to /configs/conf1/solrconfig.xml
[junit4] 2> 4333 T34 oascc.SolrZkClient.makePath makePath: /configs/conf1/solrconfig.xml
[junit4] 2> 4345 T34 oasc.AbstractZkTestCase.putConfig put /mnt/ssd/jenkins/workspace/Lucene-Solr-trunk-Linux/solr/build/solr-core/test-files/solr/collection1/conf/schema15.xml to /configs/conf1/schema.xml
[junit4] 2> 4346 T34 oascc.SolrZkClient.makePath makePath: /configs/conf1/schema.xml
[junit4] 2> 4355 T34 oasc.AbstractZkTestCase.putConfig put /mnt/ssd/jenkins/workspace/Lucene-Solr-trunk-Linux/solr/build/solr-core/test-files/solr/collection1/conf/solrconfig.snippet.randomindexconfig.xml to /configs/conf1/solrconfig.snippet.randomindexconfig.xml
[junit4] 2> 4356 T34 oascc.SolrZkClient.makePath makePath: /configs/conf1/solrconfig.snippet.randomindexconfig.xml
[junit4] 2> 4362 T34 oasc.AbstractZkTestCase.putConfig put /mnt/ssd/jenkins/workspace/Lucene-Solr-trunk-Linux/solr/build/solr-core/test-files/solr/collection1/conf/stopwords.txt to /configs/conf1/stopwords.txt
[junit4] 2> 4365 T34 oascc.SolrZkClient.makePath makePath: /configs/conf1/stopwords.txt
[junit4] 2> 4385 T34 oasc.AbstractZkTestCase.putConfig put /mnt/ssd/jenkins/workspace/Lucene-Solr-trunk-Linux/solr/build/solr-core/test-files/solr/collection1/conf/protwords.txt to /configs/conf1/protwords.txt
[junit4] 2> 4387 T34 oascc.SolrZkClient.makePath makePath: /configs/conf1/protwords.txt
[junit4] 2> 4393 T34 oasc.AbstractZkTestCase.putConfig put /mnt/ssd/jenkins/workspace/Lucene-Solr-trunk-Linux/solr/build/solr-core/test-files/solr/collection1/conf/currency.xml to /configs/conf1/currency.xml
[junit4] 2> 4394 T34 oascc.SolrZkClient.makePath makePath: /configs/conf1/currency.xml
[junit4] 2> 4406 T34 oasc.AbstractZkTestCase.putConfig put /mnt/ssd/jenkins/workspace/Lucene-Solr-trunk-Linux/solr/build/solr-core/test-files/solr/collection1/conf/enumsConfig.xml to /configs/conf1/enumsConfig.xml
[junit4] 2> 4407 T34 oascc.SolrZkClient.makePath makePath: /configs/conf1/enumsConfig.xml
[junit4] 2> 4421 T34 oasc.AbstractZkTestCase.putConfig put /mnt/ssd/jenkins/workspace/Lucene-Solr-trunk-Linux/solr/build/solr-core/test-files/solr/collection1/conf/open-exchange-rates.json to /configs/conf1/open-exchange-rates.json
[junit4] 2> 4422 T34 oascc.SolrZkClient.makePath makePath: /configs/conf1/open-exchange-rates.json
[junit4] 2> 4428 T34 oasc.AbstractZkTestCase.putConfig put /mnt/ssd/jenkins/workspace/Lucene-Solr-trunk-Linux/solr/build/solr-core/test-files/solr/collection1/conf/mapping-ISOLatin1Accent.txt to /configs/conf1/mapping-ISOLatin1Accent.txt
[junit4] 2> 4429 T34 oascc.SolrZkClient.makePath makePath: /configs/conf1/mapping-ISOLatin1Accent.txt
[junit4] 2> 4435 T34 oasc.AbstractZkTestCase.putConfig put /mnt/ssd/jenkins/workspace/Lucene-Solr-trunk-Linux/solr/build/solr-core/test-files/solr/collection1/conf/old_synonyms.txt to /configs/conf1/old_synonyms.txt
[junit4] 2> 4437 T34 oascc.SolrZkClient.makePath makePath: /configs/conf1/old_synonyms.txt
[junit4] 2> 4443 T34 oasc.AbstractZkTestCase.putConfig put /mnt/ssd/jenkins/workspace/Lucene-Solr-trunk-Linux/solr/build/solr-core/test-files/solr/collection1/conf/synonyms.txt to /configs/conf1/synonyms.txt
[junit4] 2> 4444 T34 oascc.SolrZkClient.makePath makePath: /configs/conf1/synonyms.txt
[junit4] 2> 4829 T34 oejs.Server.doStart jetty-8.1.10.v20130312
[junit4] 2> 4919 T34 oejs.AbstractConnector.doStart Started SelectChannelConnector@127.0.0.1:38454
[junit4] 2> 4933 T34 oass.SolrDispatchFilter.init SolrDispatchFilter.init()
[junit4] 2> 4934 T34 oasc.SolrResourceLoader.locateSolrHome JNDI not configured for solr (NoInitialContextEx)
[junit4] 2> 4935 T34 oasc.SolrResourceLoader.locateSolrHome using system property solr.solr.home: ./org.apache.solr.cloud.ChaosMonkeyNothingIsSafeTest-controljetty-1391308520282
[junit4] 2> 4937 T34 oasc.SolrResourceLoader.<init> new SolrResourceLoader for directory: './org.apache.solr.cloud.ChaosMonkeyNothingIsSafeTest-controljetty-1391308520282/'
[junit4] 2> 4967 T34 oasc.ConfigSolr.fromFile Loading container configuration from /mnt/ssd/jenkins/workspace/Lucene-Solr-trunk-Linux/solr/build/solr-core/test/J1/./org.apache.solr.cloud.ChaosMonkeyNothingIsSafeTest-controljetty-1391308520282/solr.xml
[junit4] 2> 5089 T34 oasc.CoreContainer.<init> New CoreContainer -1109288059
[junit4] 2> 5090 T34 oasc.CoreContainer.load Loading cores into CoreContainer [instanceDir=./org.apache.solr.cloud.ChaosMonkeyNothingIsSafeTest-controljetty-1391308520282/]
[junit4] 2> 5098 T34 oashc.HttpShardHandlerFactory.getParameter Setting socketTimeout to: 90000
[junit4] 2> 5100 T34 oashc.HttpShardHandlerFactory.getParameter Setting urlScheme to: http://
[junit4] 2> 5101 T34 oashc.HttpShardHandlerFactory.getParameter Setting connTimeout to: 15000
[junit4] 2> 5103 T34 oashc.HttpShardHandlerFactory.getParameter Setting maxConnectionsPerHost to: 20
[junit4] 2> 5104 T34 oashc.HttpShardHandlerFactory.getParameter Setting corePoolSize to: 0
[junit4] 2> 5105 T34 oashc.HttpShardHandlerFactory.getParameter Setting maximumPoolSize to: 2147483647
[junit4] 2> 5110 T34 oashc.HttpShardHandlerFactory.getParameter Setting maxThreadIdleTime to: 5
[junit4] 2> 5113 T34 oashc.HttpShardHandlerFactory.getParameter Setting sizeOfQueue to: -1
[junit4] 2> 5115 T34 oashc.HttpShardHandlerFactory.getParameter Setting fairnessPolicy to: false
[junit4] 2> 5136 T34 oasl.LogWatcher.createWatcher SLF4J impl is org.slf4j.impl.Log4jLoggerFactory
[junit4] 2> 5137 T34 oasl.LogWatcher.newRegisteredLogWatcher Registering Log Listener [Log4j (org.slf4j.impl.Log4jLoggerFactory)]
[junit4] 2> 5138 T34 oasc.CoreContainer.load Host Name: 127.0.0.1
[junit4] 2> 5139 T34 oasc.ZkContainer.initZooKeeper Zookeeper client=127.0.0.1:47690/solr
[junit4] 2> 5145 T34 oasc.ZkController.checkChrootPath zkHost includes chroot
[junit4] 2> 5148 T34 oascc.ConnectionManager.waitForConnected Waiting for client to connect to ZooKeeper
[junit4] 2> 5153 T57 oascc.ConnectionManager.process Watcher org.apache.solr.common.cloud.ConnectionManager@ea877992 name:ZooKeeperConnection Watcher:127.0.0.1:47690 got event WatchedEvent state:SyncConnected type:None path:null path:null type:None
[junit4] 2> 5154 T34 oascc.ConnectionManager.waitForConnected Client is connected to ZooKeeper
[junit4] 2> 5161 T34 oascc.ConnectionManager.waitForConnected Waiting for client to connect to ZooKeeper
[junit4] 2> 5166 T59 oascc.ConnectionManager.process Watcher org.apache.solr.common.cloud.ConnectionManager@63036da8 name:ZooKeeperConnection Watcher:127.0.0.1:47690/solr got event WatchedEvent state:SyncConnected type:None path:null path:null type:None
[junit4] 2> 5167 T34 oascc.ConnectionManager.waitForConnected Client is connected to ZooKeeper
[junit4] 2> 5175 T34 oascc.SolrZkClient.makePath makePath: /overseer/queue
[junit4] 2> 5187 T34 oascc.SolrZkClient.makePath makePath: /overseer/collection-queue-work
[junit4] 2> 5196 T34 oascc.SolrZkClient.makePath makePath: /live_nodes
[junit4] 2> 5201 T34 oasc.ZkController.createEphemeralLiveNode Register node as live in ZooKeeper:/live_nodes/127.0.0.1:38454__lc%2Fs
[junit4] 2> 5204 T34 oascc.SolrZkClient.makePath makePath: /live_nodes/127.0.0.1:38454__lc%2Fs
[junit4] 2> 5212 T34 oascc.SolrZkClient.makePath makePath: /overseer_elect
[junit4] 2> 5216 T34 oascc.SolrZkClient.makePath makePath: /overseer_elect/election
[junit4] 2> 5228 T34 oasc.OverseerElectionContext.runLeaderProcess I am going to be the leader 127.0.0.1:38454__lc%2Fs
[junit4] 2> 5229 T34 oascc.SolrZkClient.makePath makePath: /overseer_elect/leader
[junit4] 2> 5233 T34 oasc.Overseer.start Overseer (id=91180795158790147-127.0.0.1:38454__lc%2Fs-n_0000000000) starting
[junit4] 2> 5244 T34 oascc.SolrZkClient.makePath makePath: /overseer/queue-work
[junit4] 2> 5288 T34 oascc.SolrZkClient.makePath makePath: /clusterstate.json
[junit4] 2> 5288 T61 oasc.OverseerCollectionProcessor.run Process current queue of collection creations
[junit4] 2> 5300 T34 oascc.SolrZkClient.makePath makePath: /aliases.json
[junit4] 2> 5302 T61 oasc.OverseerCollectionProcessor.prioritizeOverseerNodes prioritizing overseer nodes
[junit4] 2> 5308 T34 oascc.ZkStateReader.createClusterStateWatchersAndUpdate Updating cluster state from ZooKeeper...
[junit4] 2> 5326 T60 oasc.Overseer$ClusterStateUpdater.run Starting to work on the main queue
[junit4] 2> 5330 T62 oasc.ZkController.publish publishing core=collection1 state=down
[junit4] 2> 5330 T62 oasc.ZkController.publish numShards not found on descriptor - reading it from system property
[junit4] 2> 5334 T59 oasc.DistributedQueue$LatchChildWatcher.process LatchChildWatcher fired on path: /overseer/queue state: SyncConnected type NodeChildrenChanged
[junit4] 2> 5335 T62 oasc.ZkController.waitForCoreNodeName look for our core node name
[junit4] 2> 5338 T60 oascc.ZkStateReader.updateClusterState Updating cloud state from ZooKeeper...
[junit4] 2> 5340 T60 oasc.Overseer$ClusterStateUpdater.updateState Update state numShards=1 message={
[junit4] 2> "operation":"state",
[junit4] 2> "state":"down",
[junit4] 2> "base_url":"http://127.0.0.1:38454/_lc/s",
[junit4] 2> "core":"collection1",
[junit4] 2> "roles":null,
[junit4] 2> "node_name":"127.0.0.1:38454__lc%2Fs",
[junit4] 2> "shard":null,
[junit4] 2> "shard_range":null,
[junit4] 2> "shard_state":"active",
[junit4] 2> "shard_parent":null,
[junit4] 2> "collection":"control_collection",
[junit4] 2> "numShards":"1",
[junit4] 2> "core_node_name":null}
[junit4] 2> 5340 T60 oasc.Overseer$ClusterStateUpdater.createCollection Create collection control_collection with shards [shard1]
[junit4] 2> 5344 T60 oasc.Overseer$ClusterStateUpdater.updateState Assigning new node to shard shard=shard1
[junit4] 2> 5351 T59 oasc.DistributedQueue$LatchChildWatcher.process LatchChildWatcher fired on path: /overseer/queue state: SyncConnected type NodeChildrenChanged
[junit4] 2> 5355 T59 oascc.ZkStateReader$2.process A cluster state change: WatchedEvent state:SyncConnected type:NodeDataChanged path:/clusterstate.json, has occurred - updating... (live nodes size: 1)
[junit4] 2> 6337 T62 oasc.ZkController.waitForShardId waiting to find shard id in clusterstate for collection1
[junit4] 2> 6337 T62 oasc.CoreContainer.create Creating SolrCore 'collection1' using instanceDir: ./org.apache.solr.cloud.ChaosMonkeyNothingIsSafeTest-controljetty-1391308520282/collection1
[junit4] 2> 6338 T62 oasc.ZkController.createCollectionZkNode Check for collection zkNode:control_collection
[junit4] 2> 6339 T62 oasc.ZkController.createCollectionZkNode Collection zkNode exists
[junit4] 2> 6340 T62 oascc.ZkStateReader.readConfigName Load collection config from:/collections/control_collection
[junit4] 2> 6342 T62 oasc.SolrResourceLoader.<init> new SolrResourceLoader for directory: './org.apache.solr.cloud.ChaosMonkeyNothingIsSafeTest-controljetty-1391308520282/collection1/'
[junit4] 2> 6344 T62 oasc.SolrResourceLoader.replaceClassLoader Adding 'file:/mnt/ssd/jenkins/workspace/Lucene-Solr-trunk-Linux/solr/build/solr-core/test/J1/org.apache.solr.cloud.ChaosMonkeyNothingIsSafeTest-controljetty-1391308520282/collection1/lib/classes/' to classloader
[junit4] 2> 6345 T62 oasc.SolrResourceLoader.replaceClassLoader Adding 'file:/mnt/ssd/jenkins/workspace/Lucene-Solr-trunk-Linux/solr/build/solr-core/test/J1/org.apache.solr.cloud.ChaosMonkeyNothingIsSafeTest-controljetty-1391308520282/collection1/lib/README' to classloader
[junit4] 2> 6463 T62 oasc.SolrConfig.<init> Using Lucene MatchVersion: LUCENE_50
[junit4] 2> 6591 T62 oasc.SolrConfig.<init> Loaded SolrConfig: solrconfig.xml
[junit4] 2> 6599 T62 oass.IndexSchema.readSchema Reading Solr Schema from schema.xml
[junit4] 2> 6751 T62 oass.IndexSchema.readSchema [collection1] Schema name=test
[junit4] 2> 6917 T62 oasc.SolrResourceLoader.findClass WARN Solr loaded a deprecated plugin/analysis class [solr.SortableLongField]. Please consult documentation how to replace it accordingly.
[junit4] 2> 6937 T62 oasc.SolrResourceLoader.findClass WARN Solr loaded a deprecated plugin/analysis class [solr.SortableFloatField]. Please consult documentation how to replace it accordingly.
[junit4] 2> 6957 T62 oasc.SolrResourceLoader.findClass WARN Solr loaded a deprecated plugin/analysis class [solr.SortableDoubleField]. Please consult documentation how to replace it accordingly.
[junit4] 2> 8360 T62 oass.IndexSchema.readSchema default search field in schema is text
[junit4] 2> 8380 T62 oass.IndexSchema.readSchema unique key field: id
[junit4] 2> 8395 T62 oass.FileExchangeRateProvider.reload Reloading exchange rates from file currency.xml
[junit4] 2> 8433 T62 oass.FileExchangeRateProvider.reload Reloading exchange rates from file currency.xml
[junit4] 2> 8756 T62 oasc.SolrCore.initDirectoryFactory solr.StandardDirectoryFactory
[junit4] 2> 8762 T62 oasc.SolrCore.<init> [collection1] Opening new SolrCore at ./org.apache.solr.cloud.ChaosMonkeyNothingIsSafeTest-controljetty-1391308520282/collection1/, dataDir=./org.apache.solr.cloud.ChaosMonkeyNothingIsSafeTest-1391308519816/control/data/
[junit4] 2> 8765 T62 oasc.JmxMonitoredMap.<init> JMX monitoring is enabled. Adding Solr mbeans to JMX Server: com.sun.jmx.mbeanserver.JmxMBeanServer@27cf81a
[junit4] 2> 8781 T62 oasc.CachingDirectoryFactory.get return new directory for /mnt/ssd/jenkins/workspace/Lucene-Solr-trunk-Linux/solr/build/solr-core/test/J1/org.apache.solr.cloud.ChaosMonkeyNothingIsSafeTest-1391308519816/control/data
[junit4] 2> 8782 T62 oasc.SolrCore.getNewIndexDir New index directory detected: old=null new=./org.apache.solr.cloud.ChaosMonkeyNothingIsSafeTest-1391308519816/control/data/index/
[junit4] 2> 8783 T62 oasc.SolrCore.initIndex WARN [collection1] Solr index directory './org.apache.solr.cloud.ChaosMonkeyNothingIsSafeTest-1391308519816/control/data/index' doesn't exist. Creating new index...
[junit4] 2> 8784 T62 oasc.CachingDirectoryFactory.get return new directory for /mnt/ssd/jenkins/workspace/Lucene-Solr-trunk-Linux/solr/build/solr-core/test/J1/org.apache.solr.cloud.ChaosMonkeyNothingIsSafeTest-1391308519816/control/data/index
[junit4] 2> 8790 T62 oasu.RandomMergePolicy.<init> RandomMergePolicy wrapping class org.apache.lucene.index.TieredMergePolicy: [TieredMergePolicy: maxMergeAtOnce=42, maxMergeAtOnceExplicit=11, maxMergedSegmentMB=0.13671875, floorSegmentMB=0.685546875, forceMergeDeletesPctAllowed=17.103103346102017, segmentsPerTier=23.0, maxCFSSegmentSizeMB=8.796093022207999E12, noCFSRatio=0.15009279913781573
[junit4] 2> 8811 T62 oasc.SolrDeletionPolicy.onCommit SolrDeletionPolicy.onCommit: commits: num=1
[junit4] 2> commit{dir=/mnt/ssd/jenkins/workspace/Lucene-Solr-trunk-Linux/solr/build/solr-core/test/J1/org.apache.solr.cloud.ChaosMonkeyNothingIsSafeTest-1391308519816/control/data/index,segFN=segments_1,generation=1}
[junit4] 2> 8812 T62 oasc.SolrDeletionPolicy.updateCommits newest commit generation = 1
[junit4] 2> 8873 T62 oasup.UpdateRequestProcessorChain.init creating updateRequestProcessorChain "nodistrib"
[junit4] 2> 8881 T62 oasup.UpdateRequestProcessorChain.init creating updateRequestProcessorChain "dedupe"
[junit4] 2> 8918 T62 oasup.UpdateRequestProcessorChain.init inserting DistributedUpdateProcessorFactory into updateRequestProcessorChain "dedupe"
[junit4] 2> 8919 T62 oasup.UpdateRequestProcessorChain.init creating updateRequestProcessorChain "stored_sig"
[junit4] 2> 8920 T62 oasup.UpdateRequestProcessorChain.init inserting DistributedUpdateProcessorFactory into updateRequestProcessorChain "stored_sig"
[junit4] 2> 8920 T62 oasup.UpdateRequestProcessorChain.init creating updateRequestProcessorChain "distrib-dup-test-chain-explicit"
[junit4] 2> 8921 T62 oasup.UpdateRequestProcessorChain.init creating updateRequestProcessorChain "distrib-dup-test-chain-implicit"
[junit4] 2> 8922 T62 oasup.UpdateRequestProcessorChain.init inserting DistributedUpdateProcessorFactory into updateRequestProcessorChain "distrib-dup-test-chain-implicit"
[junit4] 2> 8923 T62 oasc.SolrCore.loadUpdateProcessorChains no updateRequestProcessorChain defined as default, creating implicit default
[junit4] 2> 8951 T62 oasc.RequestHandlers.initHandlersFromConfig created standard: solr.StandardRequestHandler
[junit4] 2> 8954 T62 oasc.RequestHandlers.initHandlersFromConfig created /get: solr.RealTimeGetHandler
[junit4] 2> 8959 T62 oasc.RequestHandlers.initHandlersFromConfig adding lazy requestHandler: solr.ReplicationHandler
[junit4] 2> 8960 T62 oasc.RequestHandlers.initHandlersFromConfig created /replication: solr.ReplicationHandler
[junit4] 2> 8963 T62 oasc.RequestHandlers.initHandlersFromConfig created /update: solr.UpdateRequestHandler
[junit4] 2> 8965 T62 oasc.RequestHandlers.initHandlersFromConfig created /admin/: org.apache.solr.handler.admin.AdminHandlers
[junit4] 2> 8978 T62 oasc.RequestHandlers.initHandlersFromConfig created /admin/file: solr.admin.ShowFileRequestHandler
[junit4] 2> 8981 T62 oasc.RequestHandlers.initHandlersFromConfig created /admin/fileedit: solr.admin.EditFileRequestHandler
[junit4] 2> 8984 T62 oashl.XMLLoader.init xsltCacheLifetimeSeconds=60
[junit4] 2> 9010 T62 oasu.CommitTracker.<init> Hard AutoCommit: disabled
[junit4] 2> 9015 T62 oasu.CommitTracker.<init> Soft AutoCommit: disabled
[junit4] 2> 9025 T62 oasu.RandomMergePolicy.<init> RandomMergePolicy wrapping class org.apache.lucene.index.AlcoholicMergePolicy: [AlcoholicMergePolicy: minMergeSize=0, mergeFactor=10, maxMergeSize=1621211279, maxMergeSizeForForcedMerge=9223372036854775807, calibrateSizeByDeletes=true, maxMergeDocs=2147483647, maxCFSSegmentSizeMB=8.796093022207999E12, noCFSRatio=0.1]
[junit4] 2> 9032 T62 oasc.SolrDeletionPolicy.onInit SolrDeletionPolicy.onInit: commits: num=1
[junit4] 2> commit{dir=/mnt/ssd/jenkins/workspace/Lucene-Solr-trunk-Linux/solr/build/solr-core/test/J1/org.apache.solr.cloud.ChaosMonkeyNothingIsSafeTest-1391308519816/control/data/index,segFN=segments_1,generation=1}
[junit4] 2> 9033 T62 oasc.SolrDeletionPolicy.updateCommits newest commit generation = 1
[junit4] 2> 9034 T62 oass.SolrIndexSearcher.<init> Opening Searcher@af3d70ed main
[junit4] 2> 9063 T63 oasc.SolrCore.registerSearcher [collection1] Registered new searcher Searcher@af3d70ed main{StandardDirectoryReader(segments_1:1:nrt)}
[junit4] 2> 9082 T62 oasc.CoreContainer.registerCore registering core: collection1
[junit4] 2> 9084 T34 oass.SolrDispatchFilter.init user.dir=/mnt/ssd/jenkins/workspace/Lucene-Solr-trunk-Linux/solr/build/solr-core/test/J1
[junit4] 2> 9084 T66 oasc.ZkController.register Register replica - core:collection1 address:http://127.0.0.1:38454/_lc/s collection:control_collection shard:shard1
[junit4] 2> 9085 T34 oass.SolrDispatchFilter.init SolrDispatchFilter.init() done
[junit4] 2> 9094 T66 oascc.SolrZkClient.makePath makePath: /collections/control_collection/leader_elect/shard1/election
[junit4] 2> 9127 T66 oasc.ShardLeaderElectionContext.runLeaderProcess Running the leader process for shard shard1
[junit4] 2> 9132 T34 oascc.ConnectionManager.waitForConnected Waiting for client to connect to ZooKeeper
[junit4] 2> 9136 T59 oasc.DistributedQueue$LatchChildWatcher.process LatchChildWatcher fired on path: /overseer/queue state: SyncConnected type NodeChildrenChanged
[junit4] 2> 9140 T66 oasc.ShardLeaderElectionContext.waitForReplicasToComeUp Enough replicas found to continue.
[junit4] 2> 9141 T66 oasc.ShardLeaderElectionContext.runLeaderProcess I may be the new leader - try and sync
[junit4] 2> ASYNC NEW_CORE C2 name=collection1 org.apache.solr.core.SolrCore@70c5b554 url=http://127.0.0.1:38454/_lc/s/collection1 node=127.0.0.1:38454__lc%2Fs C2_STATE=coll:control_collection core:collection1 props:{state=down, base_url=http://127.0.0.1:38454/_lc/s, core=collection1, node_name=127.0.0.1:38454__lc%2Fs}
[junit4] 2> 9142 T66 C2 P38454 oasc.SyncStrategy.sync Sync replicas to http://127.0.0.1:38454/_lc/s/collection1/
[junit4] 2> 9144 T66 C2 P38454 oasc.SyncStrategy.syncReplicas Sync Success - now sync replicas to me
[junit4] 2> 9146 T60 oascc.ZkStateReader.updateClusterState Updating cloud state from ZooKeeper...
[junit4] 2> 9147 T68 oascc.ConnectionManager.process Watcher org.apache.solr.common.cloud.ConnectionManager@1888ee07 name:ZooKeeperConnection Watcher:127.0.0.1:47690/solr got event WatchedEvent state:SyncConnected type:None path:null path:null type:None
[junit4] 2> 9148 T34 oascc.ConnectionManager.waitForConnected Client is connected to ZooKeeper
[junit4] 2> 9147 T66 C2 P38454 oasc.SyncStrategy.syncToMe http://127.0.0.1:38454/_lc/s/collection1/ has no replicas
[junit4] 2> 9150 T66 oasc.ShardLeaderElectionContext.runLeaderProcess I am the new leader: http://127.0.0.1:38454/_lc/s/collection1/ shard1
[junit4] 2> 9151 T34 oascc.ZkStateReader.createClusterStateWatchersAndUpdate Updating cluster state from ZooKeeper...
[junit4] 2> 9151 T66 oascc.SolrZkClient.makePath makePath: /collections/control_collection/leaders/shard1
[junit4] 2> 9158 T34 oasc.ChaosMonkey.monkeyLog monkey: init - expire sessions:false cause connection loss:false
[junit4] 2> 9162 T59 oasc.DistributedQueue$LatchChildWatcher.process LatchChildWatcher fired on path: /overseer/queue state: SyncConnected type NodeChildrenChanged
[junit4] 2> 9165 T68 oascc.ZkStateReader$2.process A cluster state change: WatchedEvent state:SyncConnected type:NodeDataChanged path:/clusterstate.json, has occurred - updating... (live nodes size: 1)
[junit4] 2> 9167 T59 oascc.ZkStateReader$2.process A cluster state change: WatchedEvent state:SyncConnected type:NodeDataChanged path:/clusterstate.json, has occurred - updating... (live nodes size: 1)
[junit4] 2> 9189 T60 oascc.ZkStateReader.updateClusterState Updating cloud state from ZooKeeper...
[junit4] 2> 9198 T59 oasc.DistributedQueue$LatchChildWatcher.process LatchChildWatcher fired on path: /overseer/queue state: SyncConnected type NodeChildrenChanged
[junit4] 2> 9304 T59 oascc.ZkStateReader$2.process A cluster state change: WatchedEvent state:SyncConnected type:NodeDataChanged path:/clusterstate.json, has occurred - updating... (live nodes size: 1)
[junit4] 2> 9305 T68 oascc.ZkStateReader$2.process A cluster state change: WatchedEvent state:SyncConnected type:NodeDataChanged path:/clusterstate.json, has occurred - updating... (live nodes size: 1)
[junit4] 2> 9337 T66 oasc.ZkController.register We are http://127.0.0.1:38454/_lc/s/collection1/ and leader is http://127.0.0.1:38454/_lc/s/collection1/
[junit4] 2> 9339 T66 oasc.ZkController.register No LogReplay needed for core=collection1 baseURL=http://127.0.0.1:38454/_lc/s
[junit4] 2> 9340 T66 oasc.ZkController.checkRecovery I am the leader, no recovery necessary
[junit4] 2> 9341 T66 oasc.ZkController.publish publishing core=collection1 state=active
[junit4] 2> 9341 T66 oasc.ZkController.publish numShards not found on descriptor - reading it from system property
[junit4] 2> 9347 T59 oasc.DistributedQueue$LatchChildWatcher.process LatchChildWatcher fired on path: /overseer/queue state: SyncConnected type NodeChildrenChanged
[junit4] 2> 9348 T59 oasc.DistributedQueue$LatchChildWatcher.process LatchChildWatcher fired on path: /overseer/queue state: SyncConnected type NodeChildrenChanged
[junit4] 2> 9348 T59 oasc.DistributedQueue$LatchChildWatcher.process LatchChildWatcher fired on path: /overseer/queue state: SyncConnected type NodeChildrenChanged
[junit4] 2> 9350 T66 oascc.ZkStateReader.updateClusterState Updating cloud state from ZooKeeper...
[junit4] 2> 9353 T60 oascc.ZkStateReader.updateClusterState Updating cloud state from ZooKeeper...
[junit4] 2> 9356 T60 oasc.Overseer$ClusterStateUpdater.updateState Update state numShards=2 message={
[junit4] 2> "operation":"state",
[junit4] 2> "state":"active",
[junit4] 2> "base_url":"http://127.0.0.1:38454/_lc/s",
[junit4] 2> "core":"collection1",
[junit4] 2> "roles":null,
[junit4] 2> "node_name":"127.0.0.1:38454__lc%2Fs",
[junit4] 2> "shard":"shard1",
[junit4] 2> "shard_range":null,
[junit4] 2> "shard_state":"active",
[junit4] 2> "shard_parent":null,
[junit4] 2> "collection":"control_collection",
[junit4] 2> "numShards":"2",
[junit4] 2> "core_node_name":"core_node1"}
[junit4] 2> 9361 T59 oasc.DistributedQueue$LatchChildWatcher.process LatchChildWatcher fired on path: /overseer/queue state: SyncConnected type NodeChildrenChanged
[junit4] 2> 9467 T68 oascc.ZkStateReader$2.process A cluster state change: WatchedEvent state:SyncConnected type:NodeDataChanged path:/clusterstate.json, has occurred - updating... (live nodes size: 1)
[junit4] 2> 9467 T59 oascc.ZkStateReader$2.process A cluster state change: WatchedEvent state:SyncConnected type:NodeDataChanged path:/clusterstate.json, has occurred - updating... (live nodes size: 1)
[junit4] 2> 9520 T34 oasc.AbstractFullDistribZkTestBase.createJettys create jetty 1
[junit4] 2> 9530 T34 oejs.Server.doStart jetty-8.1.10.v20130312
[junit4] 2> 9560 T34 oejs.AbstractConnector.doStart Started SelectChannelConnector@127.0.0.1:50908
[junit4] 2> 9562 T34 oass.SolrDispatchFilter.init SolrDispatchFilter.init()
[junit4] 2> 9563 T34 oasc.SolrResourceLoader.locateSolrHome JNDI not configured for solr (NoInitialContextEx)
[junit4] 2> 9564 T34 oasc.SolrResourceLoader.locateSolrHome using system property solr.solr.home: ./org.apache.solr.cloud.ChaosMonkeyNothingIsSafeTest-jetty1-1391308524991
[junit4] 2> 9571 T34 oasc.SolrResourceLoader.<init> new SolrResourceLoader for directory: './org.apache.solr.cloud.ChaosMonkeyNothingIsSafeTest-jetty1-1391308524991/'
[junit4] 2> 9609 T34 oasc.ConfigSolr.fromFile Loading container configuration from /mnt/ssd/jenkins/workspace/Lucene-Solr-trunk-Linux/solr/build/solr-core/test/J1/./org.apache.solr.cloud.ChaosMonkeyNothingIsSafeTest-jetty1-1391308524991/solr.xml
[junit4] 2> 9772 T34 oasc.CoreContainer.<init> New CoreContainer -1316911962
[junit4] 2> 9773 T34 oasc.CoreContainer.load Loading cores into CoreContainer [instanceDir=./org.apache.solr.cloud.ChaosMonkeyNothingIsSafeTest-jetty1-1391308524991/]
[junit4] 2> 9781 T34 oashc.HttpShardHandlerFactory.getParameter Setting socketTimeout to: 90000
[junit4] 2> 9785 T34 oashc.HttpShardHandlerFactory.getParameter Setting urlScheme to: http://
[junit4] 2> 9788 T34 oashc.HttpShardHandlerFactory.getParameter Setting connTimeout to: 15000
[junit4] 2> 9792 T34 oashc.HttpShardHandlerFactory.getParameter Setting maxConnectionsPerHost to: 20
[junit4] 2> 9796 T34 oashc.HttpShardHandlerFactory.getParameter Setting corePoolSize to: 0
[junit4] 2> 9798 T34 oashc.HttpShardHandlerFactory.getParameter Setting maximumPoolSize to: 2147483647
[junit4] 2> 9802 T34 oashc.HttpShardHandlerFactory.getParameter Setting maxThreadIdleTime to: 5
[junit4] 2> 9803 T34 oashc.HttpShardHandlerFactory.getParameter Setting sizeOfQueue to: -1
[junit4] 2> 9804 T34 oashc.HttpShardHandlerFactory.getParameter Setting fairnessPolicy to: false
[junit4] 2> 9844 T34 oasl.LogWatcher.createWatcher SLF4J impl is org.slf4j.impl.Log4jLoggerFactory
[junit4] 2> 9846 T34 oasl.LogWatcher.newRegisteredLogWatcher Registering Log Listener [Log4j (org.slf4j.impl.Log4jLoggerFactory)]
[junit4] 2> 9847 T34 oasc.CoreContainer.load Host Name: 127.0.0.1
[junit4] 2> 9848 T34 oasc.ZkContainer.initZooKeeper Zookeeper client=127.0.0.1:47690/solr
[junit4] 2> 9849 T34 oasc.ZkController.checkChrootPath zkHost includes chroot
[junit4] 2> 9863 T34 oascc.ConnectionManager.waitForConnected Waiting for client to connect to ZooKeeper
[junit4] 2> 9884 T79 oascc.ConnectionManager.process Watcher org.apache.solr.common.cloud.ConnectionManager@3e9cd054 name:ZooKeeperConnection Watcher:127.0.0.1:47690 got event WatchedEvent state:SyncConnected type:None path:null path:null type:None
[junit4] 2> 9885 T34 oascc.ConnectionManager.waitForConnected Client is connected to ZooKeeper
[junit4] 2> 9890 T34 oascc.ConnectionManager.waitForConnected Waiting for client to connect to ZooKeeper
[junit4] 2> 9907 T81 oascc.ConnectionManager.process Watcher org.apache.solr.common.cloud.ConnectionManager@772195ac name:ZooKeeperConnection Watcher:127.0.0.1:47690/solr got event WatchedEvent state:SyncConnected type:None path:null path:null type:None
[junit4] 2> 9908 T34 oascc.ConnectionManager.waitForConnected Client is connected to ZooKeeper
[junit4] 2> 9916 T34 oascc.ZkStateReader.createClusterStateWatchersAndUpdate Updating cluster state from ZooKeeper...
[junit4] 2> 10924 T34 oasc.ZkController.createEphemeralLiveNode Register node as live in ZooKeeper:/live_nodes/127.0.0.1:50908__lc%2Fs
[junit4] 2> 10926 T34 oascc.SolrZkClient.makePath makePath: /live_nodes/127.0.0.1:50908__lc%2Fs
[junit4] 2> 10933 T59 oascc.ZkStateReader$3.process Updating live nodes... (2)
[junit4] 2> 10933 T68 oascc.ZkStateReader$3.process Updating live nodes... (2)
[junit4] 2> 10936 T81 oascc.ZkStateReader$3.process Updating live nodes... (2)
[junit4] 2> 10981 T82 oasc.ZkController.publish publishing core=collection1 state=down
[junit4] 2> 10986 T82 oasc.ZkController.publish numShards not found on descriptor - reading it from system property
[junit4] 2> 10989 T59 oasc.DistributedQueue$LatchChildWatcher.process LatchChildWatcher fired on path: /overseer/queue state: SyncConnected type NodeChildrenChanged
[junit4] 2> 10990 T59 oasc.DistributedQueue$LatchChildWatcher.process LatchChildWatcher fired on path: /overseer/queue state: SyncConnected type NodeChildrenChanged
[junit4] 2> 10990 T59 oasc.DistributedQueue$LatchChildWatcher.process LatchChildWatcher fired on path: /overseer/queue state: SyncConnected type NodeChildrenChanged
[junit4] 2> 10994 T60 oascc.ZkStateReader.updateClusterState Updating cloud state from ZooKeeper...
[junit4] 2> 10997 T60 oasc.Overseer$ClusterStateUpdater.updateState Update state numShards=2 message={
[junit4] 2> "operation":"state",
[junit4] 2> "state":"down",
[junit4] 2> "base_url":"http://127.0.0.1:50908/_lc/s",
[junit4] 2> "core":"collection1",
[junit4] 2> "roles":null,
[junit4] 2> "node_name":"127.0.0.1:50908__lc%2Fs",
[junit4] 2> "shard":null,
[junit4] 2> "shard_range":null,
[junit4] 2> "shard_state":"active",
[junit4] 2> "shard_parent":null,
[junit4] 2> "collection":"collection1",
[junit4] 2> "numShards":"2",
[junit4] 2> "core_node_name":null}
[junit4] 2> 10997 T60 oasc.Overseer$ClusterStateUpdater.createCollection Create collection collection1 with shards [shard1, shard2]
[junit4] 2> 10998 T60 oasc.Overseer$ClusterStateUpdater.updateState Assigning new node to shard shard=shard2
[junit4] 2> 10999 T82 oasc.ZkController.waitForCoreNodeName look for our core node name
[junit4] 2> 11007 T59 oasc.DistributedQueue$LatchChildWatcher.process LatchChildWatcher fired on path: /overseer/queue state: SyncConnected type NodeChildrenChanged
[junit4] 2> 11010 T81 oascc.ZkStateReader$2.process A cluster state change: WatchedEvent state:SyncConnected type:NodeDataChanged path:/clusterstate.json, has occurred - updating... (live nodes size: 2)
[junit4] 2> 11010 T59 oascc.ZkStateReader$2.process A cluster state change: WatchedEvent state:SyncConnected type:NodeDataChanged path:/clusterstate.json, has occurred - updating... (live nodes size: 2)
[junit4] 2> 11014 T68 oascc.ZkStateReader$2.process A cluster state change: WatchedEvent state:SyncConnected type:NodeDataChanged path:/clusterstate.json, has occurred - updating... (live nodes size: 2)
[junit4] 2> 12000 T82 oasc.ZkController.waitForShardId waiting to find shard id in clusterstate for collection1
[junit4] 2> 12001 T82 oasc.CoreContainer.create Creating SolrCore 'collection1' using instanceDir: ./org.apache.solr.cloud.ChaosMonkeyNothingIsSafeTest-jetty1-1391308524991/collection1
[junit4] 2> 12001 T82 oasc.ZkController.createCollectionZkNode Check for collection zkNode:collection1
[junit4] 2> 12003 T82 oasc.ZkController.createCollectionZkNode Collection zkNode exists
[junit4] 2> 12003 T82 oascc.ZkStateReader.readConfigName Load collection config from:/collections/collection1
[junit4] 2> 12006 T82 oasc.SolrResourceLoader.<init> new SolrResourceLoader for directory: './org.apache.solr.cloud.ChaosMonkeyNothingIsSafeTest-jetty1-1391308524991/collection1/'
[junit4] 2> 12007 T82 oasc.SolrResourceLoader.replaceClassLoader Adding 'file:/mnt/ssd/jenkins/workspace/Lucene-Solr-trunk-Linux/solr/build/solr-core/test/J1/org.apache.solr.cloud.ChaosMonkeyNothingIsSafeTest-jetty1-1391308524991/collection1/lib/classes/' to classloader
[junit4] 2> 12009 T82 oasc.SolrResourceLoader.replaceClassLoader Adding 'file:/mnt/ssd/jenkins/workspace/Lucene-Solr-trunk-Linux/solr/build/solr-core/test/J1/org.apache.solr.cloud.ChaosMonkeyNothingIsSafeTest-jetty1-1391308524991/collection1/lib/README' to classloader
[junit4] 2> 12137 T82 oasc.SolrConfig.<init> Using Lucene MatchVersion: LUCENE_50
[junit4] 2> 12287 T82 oasc.SolrConfig.<init> Loaded SolrConfig: solrconfig.xml
[junit4] 2> 12299 T82 oass.IndexSchema.readSchema Reading Solr Schema from schema.xml
[junit4] 2> 12414 T82 oass.IndexSchema.readSchema [collection1] Schema name=test
[junit4] 2> 13477 T82 oass.IndexSchema.readSchema default search field in schema is text
[junit4] 2> 13482 T82 oass.IndexSchema.readSchema unique key field: id
[junit4] 2> 13486 T82 oass.FileExchangeRateProvider.reload Reloading exchange rates from file currency.xml
[junit4] 2> 13495 T82 oass.FileExchangeRateProvider.reload Reloading exchange rates from file currency.xml
[junit4] 2> 13631 T82 oasc.SolrCore.initDirectoryFactory solr.StandardDirectoryFactory
[junit4] 2> 13632 T82 oasc.SolrCore.<init> [collection1] Opening new SolrCore at ./org.apache.solr.cloud.ChaosMonkeyNothingIsSafeTest-jetty1-1391308524991/collection1/, dataDir=./org.apache.solr.cloud.ChaosMonkeyNothingIsSafeTest-1391308519816/jetty1/
[junit4] 2> 13633 T82 oasc.JmxMonitoredMap.<init> JMX monitoring is enabled. Adding Solr mbeans to JMX Server: com.sun.jmx.mbeanserver.JmxMBeanServer@27cf81a
[junit4] 2> 13637 T82 oasc.CachingDirectoryFactory.get return new directory for /mnt/ssd/jenkins/workspace/Lucene-Solr-trunk-Linux/solr/build/solr-core/test/J1/org.apache.solr.cloud.ChaosMonkeyNothingIsSafeTest-1391308519816/jetty1
[junit4] 2> 13638 T82 oasc.SolrCore.getNewIndexDir New index directory detected: old=null new=./org.apache.solr.cloud.ChaosMonkeyNothingIsSafeTest-1391308519816/jetty1/index/
[junit4] 2> 13638 T82 oasc.SolrCore.initIndex WARN [collection1] Solr index directory './org.apache.solr.cloud.ChaosMonkeyNothingIsSafeTest-1391308519816/jetty1/index' doesn't exist. Creating new index...
[junit4] 2> 13639 T82 oasc.CachingDirectoryFactory.get return new directory for /mnt/ssd/jenkins/workspace/Lucene-Solr-trunk-Linux/solr/build/solr-core/test/J1/org.apache.solr.cloud.ChaosMonkeyNothingIsSafeTest-1391308519816/jetty1/index
[junit4] 2> 13641 T82 oasu.RandomMergePolicy.<init> RandomMergePolicy wrapping class org.apache.lucene.index.TieredMergePolicy: [TieredMergePolicy: maxMergeAtOnce=42, maxMergeAtOnceExplicit=11, maxMergedSegmentMB=0.13671875, floorSegmentMB=0.685546875, forceMergeDeletesPctAllowed=17.103103346102017, segmentsPerTier=23.0, maxCFSSegmentSizeMB=8.796093022207999E12, noCFSRatio=0.15009279913781573
[junit4] 2> 13655 T82 oasc.SolrDeletionPolicy.onCommit SolrDeletionPolicy.onCommit: commits: num=1
[junit4] 2> commit{dir=/mnt/ssd/jenkins/workspace/Lucene-Solr-trunk-Linux/solr/build/solr-core/test/J1/org.apache.solr.cloud.ChaosMonkeyNothingIsSafeTest-1391308519816/jetty1/index,segFN=segments_1,generation=1}
[junit4] 2> 13656 T82 oasc.SolrDeletionPolicy.updateCommits newest commit generation = 1
[junit4] 2> 13687 T82 oasup.UpdateRequestProcessorChain.init creating updateRequestProcessorChain "nodistrib"
[junit4] 2> 13689 T82 oasup.UpdateRequestProcessorChain.init creating updateRequestProcessorChain "dedupe"
[junit4] 2> 13691 T82 oasup.UpdateRequestProcessorChain.init inserting DistributedUpdateProcessorFactory into updateRequestProcessorChain "dedupe"
[junit4] 2> 13693 T82 oasup.UpdateRequestProcessorChain.init creating updateRequestProcessorChain "stored_sig"
[junit4] 2> 13695 T82 oasup.UpdateRequestProcessorChain.init inserting DistributedUpdateProcessorFactory into updateRequestProcessorChain "stored_sig"
[junit4] 2> 13708 T82 oasup.UpdateRequestProcessorChain.init creating updateRequestProcessorChain "distrib-dup-test-chain-explicit"
[junit4] 2> 13710 T82 oasup.UpdateRequestProcessorChain.init creating updateRequestProcessorChain "distrib-dup-test-chain-implicit"
[junit4] 2> 13712 T82 oasup.UpdateRequestProcessorChain.init inserting DistributedUpdateProcessorFactory into updateRequestProcessorChain "distrib-dup-test-chain-implicit"
[junit4] 2> 13714 T82 oasc.SolrCore.loadUpdateProcessorChains no updateRequestProcessorChain defined as default, creating implicit default
[junit4] 2> 13718 T82 oasc.RequestHandlers.initHandlersFromConfig created standard: solr.StandardRequestHandler
[junit4] 2> 13722 T82 oasc.RequestHandlers.initHandlersFromConfig created /get: solr.RealTimeGetHandler
[junit4] 2> 13723 T82 oasc.RequestHandlers.initHandlersFromConfig adding lazy requestHandler: solr.ReplicationHandler
[junit4] 2> 13725 T82 oasc.RequestHandlers.initHandlersFromConfig created /replication: solr.ReplicationHandler
[junit4] 2> 13730 T82 oasc.RequestHandlers.initHandlersFromConfig created /update: solr.UpdateRequestHandler
[junit4] 2> 13732 T82 oasc.RequestHandlers.initHandlersFromConfig created /admin/: org.apache.solr.handler.admin.AdminHandlers
[junit4] 2> 13736 T82 oasc.RequestHandlers.initHandlersFromConfig created /admin/file: solr.admin.ShowFileRequestHandler
[junit4] 2> 13740 T82 oasc.RequestHandlers.initHandlersFromConfig created /admin/fileedit: solr.admin.EditFileRequestHandler
[junit4] 2> 13745 T82 oashl.XMLLoader.init xsltCacheLifetimeSeconds=60
[junit4] 2> 13756 T82 oasu.CommitTracker.<init> Hard AutoCommit: disabled
[junit4] 2> 13757 T82 oasu.CommitTracker.<init> Soft AutoCommit: disabled
[junit4] 2> 13763 T82 oasu.RandomMergePolicy.<init> RandomMergePolicy wrapping class org.apache.lucene.index.AlcoholicMergePolicy: [AlcoholicMergePolicy: minMergeSize=0, mergeFactor=10, maxMergeSize=1621211279, maxMergeSizeForForcedMerge=9223372036854775807, calibrateSizeByDeletes=true, maxMergeDocs=2147483647, maxCFSSegmentSizeMB=8.796093022207999E12, noCFSRatio=0.1]
[junit4] 2> 13768 T82 oasc.SolrDeletionPolicy.onInit SolrDeletionPolicy.onInit: commits: num=1
[junit4] 2> commit{dir=/mnt/ssd/jenkins/workspace/Lucene-Solr-trunk-Linux/solr/build/solr-core/test/J1/org.apache.solr.cloud.ChaosMonkeyNothingIsSafeTest-1391308519816/jetty1/index,segFN=segments_1,generation=1}
[junit4] 2> 13770 T82 oasc.SolrDeletionPolicy.updateCommits newest commit generation = 1
[junit4] 2> 13772 T82 oass.SolrIndexSearcher.<init> Opening Searcher@abfb1c45 main
[junit4] 2> 13798 T83 oasc.SolrCore.registerSearcher [collection1] Registered new searcher Searcher@abfb1c45 main{StandardDirectoryReader(segments_1:1:nrt)}
[junit4] 2> 13822 T82 oasc.CoreContainer.registerCore registering core: collection1
[junit4] 2> 13825 T34 oass.SolrDispatchFilter.init user.dir=/mnt/ssd/jenkins/workspace/Lucene-Solr-trunk-Linux/solr/build/solr-core/test/J1
[junit4] 2> 13826 T34 oass.SolrDispatchFilter.init SolrDispatchFilter.init() done
[junit4] 2> 13828 T86 oasc.ZkController.register Register replica - core:collection1 address:http://127.0.0.1:50908/_lc/s collection:collection1 shard:shard2
[junit4] 2> 13830 T86 oascc.SolrZkClient.makePath makePath: /collections/collection1/leader_elect/shard2/election
[junit4] 2> 13854 T86 oasc.ShardLeaderElectionContext.runLeaderProcess Running the leader process for shard shard2
[junit4] 2> 13858 T59 oasc.DistributedQueue$LatchChildWatcher.process LatchChildWatcher fired on path: /overseer/queue state: SyncConnected type NodeChildrenChanged
[junit4] 2> 13859 T86 oasc.ShardLeaderElectionContext.waitForReplicasToComeUp Enough replicas found to continue.
[junit4] 2> 13865 T86 oasc.ShardLeaderElectionContext.runLeaderProcess I may be the new leader - try and sync
[junit4] 2> 13865 T60 oascc.ZkStateReader.updateClusterState Updating cloud state from ZooKeeper...
[junit4] 2> ASYNC NEW_CORE C3 name=collection1 org.apache.solr.core.SolrCore@e531882c url=http://127.0.0.1:50908/_lc/s/collection1 node=127.0.0.1:50908__lc%2Fs C3_STATE=coll:collection1 core:collection1 props:{state=down, base_url=http://127.0.0.1:50908/_lc/s, core=collection1, node_
[...truncated too long message...]
st>
[junit4] > <lst name="ar">
[junit4] > <long name="count">100</long>
[junit4] > <null name="mcm"/>
[junit4] > <null name="mean"/>
[junit4] > <null name="median"/>
[junit4] > <null name="su"/>
[junit4] > <null name="sum"/>
[junit4] > <null name="unique"/>
[junit4] > </lst>
[junit4] > </lst>
[junit4] > </response>
[junit4] > at __randomizedtesting.SeedInfo.seed([31E8FA9B808C782B:39E0923E24A1289B]:0)
[junit4] > at org.apache.solr.analytics.AbstractAnalyticsStatsTest.getStatResult(AbstractAnalyticsStatsTest.java:114)
[junit4] > at org.apache.solr.analytics.expression.ExpressionTest.negateTest(ExpressionTest.java:132)
[junit4] > at java.lang.Thread.run(Thread.java:780)
[junit4] 2> 1352415 T5298 oas.SolrTestCaseJ4.setUp ###Starting powerTest
[junit4] 2> 1352420 T5298 oas.SolrTestCaseJ4.tearDown ###Ending powerTest
[junit4] 2> 1352424 T5298 oas.SolrTestCaseJ4.setUp ###Starting multiplyTest
[junit4] 2> 1352430 T5298 oas.SolrTestCaseJ4.tearDown ###Ending multiplyTest
[junit4] 2> 1352435 T5298 oas.SolrTestCaseJ4.setUp ###Starting constantStringTest
[junit4] 2> 1352437 T5298 oas.SolrTestCaseJ4.tearDown ###Ending constantStringTest
[junit4] 2> 1352442 T5298 oas.SolrTestCaseJ4.setUp ###Starting dateMathTest
[junit4] 2> 1352447 T5298 oas.SolrTestCaseJ4.tearDown ###Ending dateMathTest
[junit4] 2> 1352452 T5298 oas.SolrTestCaseJ4.setUp ###Starting constantDateTest
[junit4] 2> 1352455 T5298 oas.SolrTestCaseJ4.tearDown ###Ending constantDateTest
[junit4] 2> 1352457 T5298 oas.SolrTestCaseJ4.deleteCore ###deleteCore
[junit4] 2> 1352458 T5298 oasc.CoreContainer.shutdown Shutting down CoreContainer instance=697415115
[junit4] 2> 1352458 T5298 oasc.SolrCore.close [collection1] CLOSING SolrCore org.apache.solr.core.SolrCore@1c07ce15
[junit4] 2> 1352459 T5298 oasu.DirectUpdateHandler2.close closing DirectUpdateHandler2{commits=99,autocommits=0,soft autocommits=0,optimizes=0,rollbacks=0,expungeDeletes=0,docsPending=0,adds=0,deletesById=0,deletesByQuery=0,errors=0,cumulative_adds=100,cumulative_deletesById=0,cumulative_deletesByQuery=1,cumulative_errors=0}
[junit4] 2> 1352459 T5298 oasu.SolrCoreState.decrefSolrCoreState Closing SolrCoreState
[junit4] 2> 1352459 T5298 oasu.DefaultSolrCoreState.closeIndexWriter SolrCoreState ref count has reached 0 - closing IndexWriter
[junit4] 2> 1352460 T5298 oasu.DefaultSolrCoreState.closeIndexWriter closing IndexWriter with IndexWriterCloser
[junit4] 2> 1352461 T5298 oasc.SolrCore.closeSearcher [collection1] Closing main searcher on request.
[junit4] 2> 1352511 T5298 oasc.CachingDirectoryFactory.close Closing MockDirectoryFactory - 2 directories currently being tracked
[junit4] 2> 1352512 T5298 oasc.CachingDirectoryFactory.closeCacheValue looking to close /mnt/ssd/jenkins/workspace/Lucene-Solr-trunk-Linux/solr/build/solr-core/test/J1/./solrtest-ExpressionTest-1391309866038/index [CachedDir<<refCount=0;path=/mnt/ssd/jenkins/workspace/Lucene-Solr-trunk-Linux/solr/build/solr-core/test/J1/./solrtest-ExpressionTest-1391309866038/index;done=false>>]
[junit4] 2> 1352513 T5298 oasc.CachingDirectoryFactory.close Closing directory: /mnt/ssd/jenkins/workspace/Lucene-Solr-trunk-Linux/solr/build/solr-core/test/J1/./solrtest-ExpressionTest-1391309866038/index
[junit4] 2> 1352514 T5298 oasc.CachingDirectoryFactory.closeCacheValue looking to close /mnt/ssd/jenkins/workspace/Lucene-Solr-trunk-Linux/solr/build/solr-core/test/J1/./solrtest-ExpressionTest-1391309866038 [CachedDir<<refCount=0;path=/mnt/ssd/jenkins/workspace/Lucene-Solr-trunk-Linux/solr/build/solr-core/test/J1/./solrtest-ExpressionTest-1391309866038;done=false>>]
[junit4] 2> 1352514 T5298 oasc.CachingDirectoryFactory.close Closing directory: /mnt/ssd/jenkins/workspace/Lucene-Solr-trunk-Linux/solr/build/solr-core/test/J1/./solrtest-ExpressionTest-1391309866038
[junit4] 2> NOTE: test params are: codec=Lucene46: {double_dd=Pulsing41(freqCutoff=10 minBlockSize=14 maxBlockSize=105), long_ld=PostingsFormat(name=Lucene41VarGapFixedInterval), date_dtd=PostingsFormat(name=Lucene41VarGapFixedInterval), float_fd=PostingsFormat(name=NestedPulsing), string_sd=PostingsFormat(name=NestedPulsing), int_id=PostingsFormat(name=NestedPulsing), id=PostingsFormat(name=Lucene41VarGapFixedInterval)}, docValues:{int_id=DocValuesFormat(name=Disk), stringdv=DocValuesFormat(name=Disk), doubledv=DocValuesFormat(name=SimpleText), stringdvm=DocValuesFormat(name=Memory), floatdv=DocValuesFormat(name=Memory), string_sd=DocValuesFormat(name=Disk), long_ld=DocValuesFormat(name=SimpleText), double_dd=DocValuesFormat(name=Memory), intdv=DocValuesFormat(name=Disk), float_fd=DocValuesFormat(name=Disk), datedv=DocValuesFormat(name=Lucene45), date_dtd=DocValuesFormat(name=Disk), longdv=DocValuesFormat(name=Memory)}, sim=DefaultSimilarity, locale=et_EE_PREEURO, timezone=Asia/Qatar
[junit4] 2> NOTE: Linux 3.8.0-35-generic x86/IBM Corporation 1.7.0 (32-bit)/cpus=8,threads=1,free=102231648,total=224002048
[junit4] 2> NOTE: All tests run in this JVM: [TestFileDictionaryLookup, NotRequiredUniqueKeyTest, ChaosMonkeyNothingIsSafeTest, TestStressRecovery, TestImplicitCoreProperties, TestArbitraryIndexDir, TestCollationField, SolrRequestParserTest, BlockCacheTest, TestLazyCores, TestFastWriter, FunctionTest, TestComponentsName, TestNumberUtils, NoCacheHeaderTest, BasicZkTest, SortByFunctionTest, TestNoOpRegenerator, PathHierarchyTokenizerFactoryTest, TestFieldTypeCollectionResource, TestUtils, TestBinaryResponseWriter, DefaultValueUpdateProcessorTest, QueryFacetTest, TestSolrQueryParserResource, TestCSVResponseWriter, TestDefaultSimilarityFactory, DebugComponentTest, TestDocBasedVersionConstraints, TestFiltering, SuggesterTSTTest, PreAnalyzedUpdateProcessorTest, TestDistributedSearch, IndexBasedSpellCheckerTest, TestPhraseSuggestions, ShardRoutingCustomTest, TestXIncludeConfig, TestDefaultSearchFieldResource, BasicDistributedZk2Test, MultiTermTest, TestHashPartitioner, SpellingQueryConverterTest, TermVectorComponentDistributedTest, OutputWriterTest, TestInfoStreamLogging, NumericFieldsTest, TestRandomMergePolicy, SpellCheckComponentTest, TestModifyConfFiles, PluginInfoTest, DisMaxRequestHandlerTest, CurrencyFieldXmlFileTest, TestSolrJ, PrimUtilsTest, SolrPluginUtilsTest, SpellCheckCollatorTest, TestPartialUpdateDeduplication, CollectionsAPIDistributedZkTest, HdfsLockFactoryTest, OpenExchangeRatesOrgProviderTest, TestSerializedLuceneMatchVersion, SolrCoreCheckLockOnStartupTest, ConvertedLegacyTest, HighlighterConfigTest, TestAtomicUpdateErrorCases, RequestHandlersTest, FullSolrCloudDistribCmdsTest, DistributedQueryComponentCustomSortTest, SolrIndexConfigTest, DeleteShardTest, TestSolr4Spatial, TestIBSimilarityFactory, TestSolrXml, SimplePostToolTest, TestStressLucene, TestWordDelimiterFilterFactory, RAMDirectoryFactoryTest, UniqFieldsUpdateProcessorFactoryTest, TestRandomFaceting, CustomCollectionTest, SolrTestCaseJ4Test, TestCustomSort, CachingDirectoryFactoryTest, DistanceFunctionTest, TriLevelCompositeIdRoutingTest, TestBinaryField, TestDFRSimilarityFactory, OpenCloseCoreStressTest, LeaderElectionIntegrationTest, ClusterStateUpdateTest, TestZkChroot, TestDistributedGrouping, ZkControllerTest, TestRealTimeGet, TestJoin, HardAutoCommitTest, DistributedTermsComponentTest, TestRangeQuery, SimpleFacetsTest, SolrCoreTest, SolrCmdDistributorTest, QueryElevationComponentTest, BadIndexSchemaTest, TestSort, OverseerCollectionProcessorTest, TestIndexSearcher, SoftAutoCommitTest, TestTrie, SuggesterWFSTTest, PolyFieldTest, SchemaVersionSpecificBehaviorTest, TestUpdate, DocValuesMultiTest, XsltUpdateRequestHandlerTest, LukeRequestHandlerTest, TestReversedWildcardFilterFactory, TestQueryTypes, TestOmitPositions, DocumentBuilderTest, TestIndexingPerformance, RequiredFieldsTest, TestSolrQueryParser, RegexBoostProcessorTest, TestJmxIntegration, MBeansHandlerTest, TestAnalyzedSuggestions, TestPHPSerializedResponseWriter, CoreContainerCoreInitFailuresTest, SOLR749Test, UpdateParamsTest, TestQuerySenderNoQuery, ResponseLogComponentTest, SampleTest, TestDocSet, TestSolrCoreProperties, TestSweetSpotSimilarityFactory, TestLMJelinekMercerSimilarityFactory, TestJmxMonitoredMap, ScriptEngineTest, TestFastLRUCache, PreAnalyzedFieldTest, CircularListTest, TestCursorMarkWithoutUniqueKey, ExpressionTest]
[junit4] Completed on J1 in 2.35s, 12 tests, 3 failures <<< FAILURES!
[...truncated 173 lines...]
BUILD FAILED
/mnt/ssd/jenkins/workspace/Lucene-Solr-trunk-Linux/build.xml:453: The following error occurred while executing this line:
/mnt/ssd/jenkins/workspace/Lucene-Solr-trunk-Linux/build.xml:446: The following error occurred while executing this line:
/mnt/ssd/jenkins/workspace/Lucene-Solr-trunk-Linux/build.xml:39: The following error occurred while executing this line:
/mnt/ssd/jenkins/workspace/Lucene-Solr-trunk-Linux/extra-targets.xml:37: The following error occurred while executing this line:
/mnt/ssd/jenkins/workspace/Lucene-Solr-trunk-Linux/solr/build.xml:189: The following error occurred while executing this line:
/mnt/ssd/jenkins/workspace/Lucene-Solr-trunk-Linux/solr/common-build.xml:491: The following error occurred while executing this line:
/mnt/ssd/jenkins/workspace/Lucene-Solr-trunk-Linux/lucene/common-build.xml:1268: The following error occurred while executing this line:
/mnt/ssd/jenkins/workspace/Lucene-Solr-trunk-Linux/lucene/common-build.xml:901: There were test failures: 365 suites, 1590 tests, 6 failures, 35 ignored (7 assumptions)
Total time: 54 minutes 58 seconds
Build step 'Invoke Ant' marked build as failure
Description set: Java: 32bit/ibm-j9-jdk7 -Xjit:exclude={org/apache/lucene/util/fst/FST.pack(IIF)Lorg/apache/lucene/util/fst/FST;}
Archiving artifacts
Recording test results
Email was triggered for: Failure
Sending email for trigger: Failure