You are viewing a plain text version of this content. The canonical link for it is here.
Posted to dev@pdfbox.apache.org by Apache Jenkins Server <je...@builds.apache.org> on 2020/11/11 08:00:24 UTC

Build failed in Jenkins: PDFBox » PDFBox-trunk #221

See <https://ci-builds.apache.org/job/PDFBox/job/PDFBox-trunk/221/display/redirect?page=changes>

Changes:

[Andreas Lehmkühler] PDFBOX-5001: unify boolean setter, DRY refactoring, add more tests


------------------------------------------
[...truncated 21.32 KB...]
[INFO] Tests run: 1, Failures: 0, Errors: 0, Skipped: 0, Time elapsed: 0 s - in org.apache.fontbox.ttf.TestMemoryTTFDataStream
[INFO] Running org.apache.fontbox.ttf.RAFDataStreamTest
[INFO] Tests run: 1, Failures: 0, Errors: 0, Skipped: 0, Time elapsed: 0 s - in org.apache.fontbox.ttf.RAFDataStreamTest
[INFO] Running org.apache.fontbox.ttf.TestTTFParser
[INFO] Tests run: 1, Failures: 0, Errors: 0, Skipped: 0, Time elapsed: 0.008 s - in org.apache.fontbox.ttf.TestTTFParser
[INFO] Running org.apache.fontbox.cmap.TestCMap
[INFO] Tests run: 2, Failures: 0, Errors: 0, Skipped: 0, Time elapsed: 0.008 s - in org.apache.fontbox.cmap.TestCMap
[INFO] Running org.apache.fontbox.cmap.TestCMapParser
[INFO] Tests run: 8, Failures: 0, Errors: 0, Skipped: 0, Time elapsed: 0.759 s - in org.apache.fontbox.cmap.TestCMapParser
[INFO] Running org.apache.fontbox.cmap.TestCodespaceRange
[INFO] Tests run: 3, Failures: 0, Errors: 0, Skipped: 0, Time elapsed: 0.002 s - in org.apache.fontbox.cmap.TestCodespaceRange
[INFO] Running org.apache.fontbox.afm.AFMParserTest
[INFO] Tests run: 6, Failures: 0, Errors: 0, Skipped: 0, Time elapsed: 0.229 s - in org.apache.fontbox.afm.AFMParserTest
[INFO] Running org.apache.fontbox.afm.CompositeTest
[INFO] Tests run: 1, Failures: 0, Errors: 0, Skipped: 0, Time elapsed: 0.002 s - in org.apache.fontbox.afm.CompositeTest
[INFO] Running org.apache.fontbox.afm.LigatureTest
[INFO] Tests run: 1, Failures: 0, Errors: 0, Skipped: 0, Time elapsed: 0.001 s - in org.apache.fontbox.afm.LigatureTest
[INFO] Running org.apache.fontbox.afm.FontMetricsTest
[INFO] Tests run: 8, Failures: 0, Errors: 0, Skipped: 0, Time elapsed: 0.005 s - in org.apache.fontbox.afm.FontMetricsTest
[INFO] Running org.apache.fontbox.afm.CharMetricTest
[INFO] Tests run: 3, Failures: 0, Errors: 0, Skipped: 0, Time elapsed: 0.001 s - in org.apache.fontbox.afm.CharMetricTest
[INFO] Running org.apache.fontbox.afm.CompositePartTest
[INFO] Tests run: 1, Failures: 0, Errors: 0, Skipped: 0, Time elapsed: 0 s - in org.apache.fontbox.afm.CompositePartTest
[INFO] Running org.apache.fontbox.afm.TrackKernTest
[INFO] Tests run: 1, Failures: 0, Errors: 0, Skipped: 0, Time elapsed: 0 s - in org.apache.fontbox.afm.TrackKernTest
[INFO] Running org.apache.fontbox.afm.KernPairTest
[INFO] Tests run: 1, Failures: 0, Errors: 0, Skipped: 0, Time elapsed: 0 s - in org.apache.fontbox.afm.KernPairTest
[INFO] 
[INFO] Results:
[INFO] 
[INFO] Tests run: 66, Failures: 0, Errors: 0, Skipped: 0
[INFO] 
[JENKINS] Recording test results
[INFO] 
[INFO] --- jacoco-maven-plugin:0.8.6:report (report) @ fontbox ---
[INFO] Loading execution data file <https://ci-builds.apache.org/job/PDFBox/job/PDFBox-trunk/ws/fontbox/target/jacoco.exec>
[INFO] Analyzed bundle 'Apache FontBox' with 156 classes
[INFO] 
[INFO] --- animal-sniffer-maven-plugin:1.19:check (check-java-version) @ fontbox ---
[INFO] Checking unresolved references to org.codehaus.mojo.signature:java18:1.0
[INFO] 
[INFO] --- maven-bundle-plugin:5.1.1:bundle (default-bundle) @ fontbox ---
[INFO] 
[INFO] --- maven-site-plugin:3.7.1:attach-descriptor (attach-descriptor) @ fontbox ---
[INFO] Skipping because packaging 'bundle' is not pom.
[INFO] 
[INFO] >>> maven-source-plugin:3.2.1:jar (attach-sources) > generate-sources @ fontbox >>>
[INFO] 
[INFO] --- maven-enforcer-plugin:3.0.0-M3:enforce (default) @ fontbox ---
[INFO] 
[INFO] --- maven-enforcer-plugin:3.0.0-M3:enforce (enforce-maven-version) @ fontbox ---
[INFO] 
[INFO] --- jacoco-maven-plugin:0.8.6:prepare-agent (default) @ fontbox ---
[INFO] surefireArgLine set to -javaagent:/home/jenkins/.m2/repository/org/jacoco/org.jacoco.agent/0.8.6/org.jacoco.agent-0.8.6-runtime.jar=destfile=<https://ci-builds.apache.org/job/PDFBox/job/PDFBox-trunk/ws/fontbox/target/jacoco.exec>
[WARNING] Failed to getClass for org.apache.maven.plugins.source.SourceJarMojo
[INFO] 
[INFO] <<< maven-source-plugin:3.2.1:jar (attach-sources) < generate-sources @ fontbox <<<
[INFO] 
[INFO] 
[INFO] --- maven-source-plugin:3.2.1:jar (attach-sources) @ fontbox ---
[INFO] Skipping source per configuration.
[INFO] 
[INFO] --- apache-rat-plugin:0.13:check (default) @ fontbox ---
[INFO] Enabled default license matchers.
[INFO] Will parse SCM ignores for exclusions...
[INFO] Finished adding exclusions from SCM ignore files.
[INFO] 62 implicit excludes (use -debug for more details).
[INFO] 2 explicit excludes (use -debug for more details).
[INFO] 198 resources included (use -debug for more details)
[INFO] Rat check: Summary over all files. Unapproved: 4, unknown: 4, generated: 0, approved: 189 licenses.
[INFO] ------------------------------------------------------------------------
[INFO] Reactor Summary for Apache PDFBox 3.0.0-SNAPSHOT:
[INFO] 
[INFO] PDFBox parent ...................................... SUCCESS [ 52.009 s]
[INFO] Apache FontBox ..................................... FAILURE [ 46.223 s]
[INFO] Apache XmpBox ...................................... SKIPPED
[INFO] Apache PDFBox ...................................... SKIPPED
[INFO] Apache Preflight ................................... SKIPPED
[INFO] Apache Preflight application ....................... SKIPPED
[INFO] Apache PDFBox Debugger ............................. SKIPPED
[INFO] Apache PDFBox tools ................................ SKIPPED
[INFO] Apache PDFBox application .......................... SKIPPED
[INFO] Apache PDFBox Debugger application ................. SKIPPED
[INFO] Apache PDFBox examples ............................. SKIPPED
[INFO] Apache PDFBox ...................................... SKIPPED
[INFO] ------------------------------------------------------------------------
[INFO] BUILD FAILURE
[INFO] ------------------------------------------------------------------------
[INFO] Total time:  02:08 min
[INFO] Finished at: 2020-11-11T08:00:05Z
[INFO] ------------------------------------------------------------------------
ERROR: Asynchronous execution failure
java.util.concurrent.ExecutionException: java.io.IOException: Unexpected Fingerprint type. Expected class hudson.model.Fingerprint or subclass but got class hudson.model.Fingerprint$RangeSet
	at hudson.remoting.Channel$2.adapt(Channel.java:1035)
	at hudson.remoting.Channel$2.adapt(Channel.java:1029)
	at hudson.remoting.FutureAdapter.get(FutureAdapter.java:55)
	at hudson.maven.AbstractMavenBuilder.waitForAsynchronousExecutions(AbstractMavenBuilder.java:186)
	at hudson.maven.Maven3Builder.call(Maven3Builder.java:146)
	at hudson.maven.Maven3Builder.call(Maven3Builder.java:70)
	at hudson.remoting.UserRequest.perform(UserRequest.java:211)
	at hudson.remoting.UserRequest.perform(UserRequest.java:54)
	at hudson.remoting.Request$2.run(Request.java:369)
	at hudson.remoting.InterceptingExecutorService$1.call(InterceptingExecutorService.java:72)
	at java.util.concurrent.FutureTask.run(FutureTask.java:266)
	at java.util.concurrent.ThreadPoolExecutor.runWorker(ThreadPoolExecutor.java:1149)
	at java.util.concurrent.ThreadPoolExecutor$Worker.run(ThreadPoolExecutor.java:624)
	at java.lang.Thread.run(Thread.java:748)
Caused by: java.io.IOException: Unexpected Fingerprint type. Expected class hudson.model.Fingerprint or subclass but got class hudson.model.Fingerprint$RangeSet
	at hudson.model.Fingerprint.load(Fingerprint.java:1387)
	at hudson.model.Fingerprint.load(Fingerprint.java:1372)
	at hudson.model.FingerprintMap.load(FingerprintMap.java:97)
	at hudson.model.FingerprintMap.load(FingerprintMap.java:47)
	at hudson.util.KeyedDataStorage.get(KeyedDataStorage.java:161)
	at hudson.model.FingerprintMap.get(FingerprintMap.java:82)
	at hudson.model.FingerprintMap.get(FingerprintMap.java:47)
	at hudson.util.KeyedDataStorage.getOrCreate(KeyedDataStorage.java:111)
	at hudson.model.FingerprintMap.getOrCreate(FingerprintMap.java:68)
	at hudson.maven.reporters.MavenFingerprinter$PostBuildCallable.call(MavenFingerprinter.java:249)
	at hudson.maven.reporters.MavenFingerprinter$PostBuildCallable.call(MavenFingerprinter.java:236)
	at hudson.maven.MavenBuild$ProxyImpl.execute(MavenBuild.java:454)
	at hudson.maven.MavenBuild$ProxyImpl2.execute(MavenBuild.java:586)
	at sun.reflect.GeneratedMethodAccessor1162.invoke(Unknown Source)
	at sun.reflect.DelegatingMethodAccessorImpl.invoke(DelegatingMethodAccessorImpl.java:43)
	at java.lang.reflect.Method.invoke(Method.java:498)
	at hudson.model.Executor$2.call(Executor.java:932)
	at hudson.util.InterceptingProxy$1.invoke(InterceptingProxy.java:23)
	at com.sun.proxy.$Proxy180.execute(Unknown Source)
	at hudson.maven.MavenBuildProxy$Filter$AsyncInvoker.call(MavenBuildProxy.java:294)
	at hudson.remoting.UserRequest.perform(UserRequest.java:211)
	at hudson.remoting.UserRequest.perform(UserRequest.java:54)
	at hudson.remoting.Request$2.run(Request.java:369)
	at hudson.remoting.InterceptingExecutorService$1.call(InterceptingExecutorService.java:72)
	at org.jenkinsci.remoting.CallableDecorator.call(CallableDecorator.java:18)
	at hudson.remoting.CallableDecoratorList$1.call(CallableDecoratorList.java:21)
	at jenkins.util.ContextResettingExecutorService$2.call(ContextResettingExecutorService.java:46)
	at jenkins.security.ImpersonatingExecutorService$2.call(ImpersonatingExecutorService.java:71)
	... 4 more
	Suppressed: hudson.remoting.Channel$CallSiteStackTrace: Remote call to channel
		at hudson.remoting.Channel.attachCallSiteStackTrace(Channel.java:1788)
		at hudson.remoting.UserRequest$ExceptionResponse.retrieve(UserRequest.java:356)
		at hudson.remoting.Channel$2.adapt(Channel.java:1033)
		at hudson.remoting.Channel$2.adapt(Channel.java:1029)
		at hudson.remoting.FutureAdapter.get(FutureAdapter.java:55)
		at hudson.maven.AbstractMavenBuilder.waitForAsynchronousExecutions(AbstractMavenBuilder.java:186)
		at hudson.maven.Maven3Builder.call(Maven3Builder.java:146)
		at hudson.maven.Maven3Builder.call(Maven3Builder.java:70)
		at hudson.remoting.UserRequest.perform(UserRequest.java:211)
		at hudson.remoting.UserRequest.perform(UserRequest.java:54)
		at hudson.remoting.Request$2.run(Request.java:369)
[ERROR] Failed to execute goal org.apache.rat:apache-rat-plugin:0.13:check (default) on project fontbox: Too many files with unapproved license: 4 See RAT report in: <https://ci-builds.apache.org/job/PDFBox/job/PDFBox-trunk/ws/fontbox/target/rat.txt> -> [Help 1]
		at hudson.remoting.InterceptingExecutorService$1.call(InterceptingExecutorService.java:72)
[ERROR] 
		... 4 more
ERROR: Asynchronous execution failure[ERROR] To see the full stack trace of the errors, re-run Maven with the -e switch.

java.util.concurrent.ExecutionException: java.io.IOException: Unexpected Fingerprint type. Expected class hudson.model.Fingerprint or subclass but got class hudson.model.Fingerprint$RangeSet
[ERROR] Re-run Maven using the -X switch to enable full debug logging.
	at hudson.remoting.Channel$2.adapt(Channel.java:1035)
[ERROR] 
	at hudson.remoting.Channel$2.adapt(Channel.java:1029)
[ERROR] For more information about the errors and possible solutions, please read the following articles:
	at hudson.remoting.FutureAdapter.get(FutureAdapter.java:55)
[ERROR] [Help 1] http://cwiki.apache.org/confluence/display/MAVEN/MojoFailureException
	at hudson.maven.AbstractMavenBuilder.waitForAsynchronousExecutions(AbstractMavenBuilder.java:186)
[ERROR] 
	at hudson.maven.Maven3Builder.call(Maven3Builder.java:146)
[ERROR] After correcting the problems, you can resume the build with the command
	at hudson.maven.Maven3Builder.call(Maven3Builder.java:70)
	at hudson.remoting.UserRequest.perform(UserRequest.java:211)
[ERROR]   mvn <goals> -rf :fontbox
	at hudson.remoting.UserRequest.perform(UserRequest.java:54)
	at hudson.remoting.Request$2.run(Request.java:369)
	at hudson.remoting.InterceptingExecutorService$1.call(InterceptingExecutorService.java:72)
	at java.util.concurrent.FutureTask.run(FutureTask.java:266)
	at java.util.concurrent.ThreadPoolExecutor.runWorker(ThreadPoolExecutor.java:1149)
	at java.util.concurrent.ThreadPoolExecutor$Worker.run(ThreadPoolExecutor.java:624)
	at java.lang.Thread.run(Thread.java:748)
Caused by: java.io.IOException: Unexpected Fingerprint type. Expected class hudson.model.Fingerprint or subclass but got class hudson.model.Fingerprint$RangeSet
	at hudson.model.Fingerprint.load(Fingerprint.java:1387)
	at hudson.model.Fingerprint.load(Fingerprint.java:1372)
	at hudson.model.FingerprintMap.load(FingerprintMap.java:97)
	at hudson.model.FingerprintMap.load(FingerprintMap.java:47)
	at hudson.util.KeyedDataStorage.get(KeyedDataStorage.java:161)
	at hudson.model.FingerprintMap.get(FingerprintMap.java:82)
	at hudson.model.FingerprintMap.get(FingerprintMap.java:47)
	at hudson.util.KeyedDataStorage.getOrCreate(KeyedDataStorage.java:111)
	at hudson.model.FingerprintMap.getOrCreate(FingerprintMap.java:68)
	at hudson.maven.reporters.MavenFingerprinter$PostBuildCallable.call(MavenFingerprinter.java:249)
	at hudson.maven.reporters.MavenFingerprinter$PostBuildCallable.call(MavenFingerprinter.java:236)
	at hudson.maven.MavenBuild$ProxyImpl.execute(MavenBuild.java:454)
	at hudson.maven.MavenBuild$ProxyImpl2.execute(MavenBuild.java:586)
	at sun.reflect.GeneratedMethodAccessor1162.invoke(Unknown Source)
	at sun.reflect.DelegatingMethodAccessorImpl.invoke(DelegatingMethodAccessorImpl.java:43)
	at java.lang.reflect.Method.invoke(Method.java:498)
	at hudson.model.Executor$2.call(Executor.java:932)
	at hudson.util.InterceptingProxy$1.invoke(InterceptingProxy.java:23)
	at com.sun.proxy.$Proxy180.execute(Unknown Source)
	at hudson.maven.MavenBuildProxy$Filter$AsyncInvoker.call(MavenBuildProxy.java:294)
	at hudson.remoting.UserRequest.perform(UserRequest.java:211)
	at hudson.remoting.UserRequest.perform(UserRequest.java:54)
	at hudson.remoting.Request$2.run(Request.java:369)
	at hudson.remoting.InterceptingExecutorService$1.call(InterceptingExecutorService.java:72)
	at org.jenkinsci.remoting.CallableDecorator.call(CallableDecorator.java:18)
	at hudson.remoting.CallableDecoratorList$1.call(CallableDecoratorList.java:21)
	at jenkins.util.ContextResettingExecutorService$2.call(ContextResettingExecutorService.java:46)
	at jenkins.security.ImpersonatingExecutorService$2.call(ImpersonatingExecutorService.java:71)
	... 4 more
	Suppressed: hudson.remoting.Channel$CallSiteStackTrace: Remote call to channel
		at hudson.remoting.Channel.attachCallSiteStackTrace(Channel.java:1788)
		at hudson.remoting.UserRequest$ExceptionResponse.retrieve(UserRequest.java:356)
		at hudson.remoting.Channel$2.adapt(Channel.java:1033)
		at hudson.remoting.Channel$2.adapt(Channel.java:1029)
		at hudson.remoting.FutureAdapter.get(FutureAdapter.java:55)
		at hudson.maven.AbstractMavenBuilder.waitForAsynchronousExecutions(AbstractMavenBuilder.java:186)
		at hudson.maven.Maven3Builder.call(Maven3Builder.java:146)
		at hudson.maven.Maven3Builder.call(Maven3Builder.java:70)
		at hudson.remoting.UserRequest.perform(UserRequest.java:211)
		at hudson.remoting.UserRequest.perform(UserRequest.java:54)
		at hudson.remoting.Request$2.run(Request.java:369)
		at hudson.remoting.InterceptingExecutorService$1.call(InterceptingExecutorService.java:72)
		... 4 more
[JENKINS] Archiving <https://ci-builds.apache.org/job/PDFBox/job/PDFBox-trunk/ws/xmpbox/pom.xml> to org.apache.pdfbox/xmpbox/3.0.0-SNAPSHOT/xmpbox-3.0.0-SNAPSHOT.pom
[JENKINS] Archiving <https://ci-builds.apache.org/job/PDFBox/job/PDFBox-trunk/ws/tools/pom.xml> to org.apache.pdfbox/pdfbox-tools/3.0.0-SNAPSHOT/pdfbox-tools-3.0.0-SNAPSHOT.pom
[JENKINS] Archiving <https://ci-builds.apache.org/job/PDFBox/job/PDFBox-trunk/ws/debugger/pom.xml> to org.apache.pdfbox/pdfbox-debugger/3.0.0-SNAPSHOT/pdfbox-debugger-3.0.0-SNAPSHOT.pom
[JENKINS] Archiving <https://ci-builds.apache.org/job/PDFBox/job/PDFBox-trunk/ws/preflight-app/pom.xml> to org.apache.pdfbox/preflight-app/3.0.0-SNAPSHOT/preflight-app-3.0.0-SNAPSHOT.pom
[JENKINS] Archiving <https://ci-builds.apache.org/job/PDFBox/job/PDFBox-trunk/ws/app/pom.xml> to org.apache.pdfbox/pdfbox-app/3.0.0-SNAPSHOT/pdfbox-app-3.0.0-SNAPSHOT.pom
[JENKINS] Archiving <https://ci-builds.apache.org/job/PDFBox/job/PDFBox-trunk/ws/examples/pom.xml> to org.apache.pdfbox/pdfbox-examples/3.0.0-SNAPSHOT/pdfbox-examples-3.0.0-SNAPSHOT.pom
[JENKINS] Archiving <https://ci-builds.apache.org/job/PDFBox/job/PDFBox-trunk/ws/preflight/pom.xml> to org.apache.pdfbox/preflight/3.0.0-SNAPSHOT/preflight-3.0.0-SNAPSHOT.pom
[JENKINS] Archiving <https://ci-builds.apache.org/job/PDFBox/job/PDFBox-trunk/ws/pom.xml> to org.apache.pdfbox/pdfbox-reactor/3.0.0-SNAPSHOT/pdfbox-reactor-3.0.0-SNAPSHOT.pom
[JENKINS] Archiving <https://ci-builds.apache.org/job/PDFBox/job/PDFBox-trunk/ws/parent/pom.xml> to org.apache.pdfbox/pdfbox-parent/3.0.0-SNAPSHOT/pdfbox-parent-3.0.0-SNAPSHOT.pom
[JENKINS] Archiving <https://ci-builds.apache.org/job/PDFBox/job/PDFBox-trunk/ws/pdfbox/pom.xml> to org.apache.pdfbox/pdfbox/3.0.0-SNAPSHOT/pdfbox-3.0.0-SNAPSHOT.pom
[Fast Archiver] Compressed 40.60 KB of artifacts by 78.8% relative to #220
[JENKINS] Archiving <https://ci-builds.apache.org/job/PDFBox/job/PDFBox-trunk/ws/debugger-app/pom.xml> to org.apache.pdfbox/debugger-app/3.0.0-SNAPSHOT/debugger-app-3.0.0-SNAPSHOT.pom
[JENKINS] Archiving <https://ci-builds.apache.org/job/PDFBox/job/PDFBox-trunk/ws/fontbox/pom.xml> to org.apache.pdfbox/fontbox/3.0.0-SNAPSHOT/fontbox-3.0.0-SNAPSHOT.pom
[JENKINS] Archiving <https://ci-builds.apache.org/job/PDFBox/job/PDFBox-trunk/ws/fontbox/target/fontbox-3.0.0-SNAPSHOT.jar> to org.apache.pdfbox/fontbox/3.0.0-SNAPSHOT/fontbox-3.0.0-SNAPSHOT.jar
[Fast Archiver] Compressed 1.53 MB of artifacts by 71.4% relative to #220
No mail will be sent out, as 'PDFBox » PDFBox-trunk » Apache PDFBox examples #221' does not have a result yet. Please make sure you set a proper result in case of pipeline/build scripts.
No mail will be sent out, as 'PDFBox » PDFBox-trunk » Apache PDFBox #221' does not have a result yet. Please make sure you set a proper result in case of pipeline/build scripts.
No mail will be sent out, as 'PDFBox » PDFBox-trunk » Apache PDFBox Debugger application #221' does not have a result yet. Please make sure you set a proper result in case of pipeline/build scripts.
Sending e-mails to: dev@pdfbox.apache.org
No mail will be sent out, as 'PDFBox » PDFBox-trunk » Apache XmpBox #221' does not have a result yet. Please make sure you set a proper result in case of pipeline/build scripts.
No mail will be sent out, as 'PDFBox » PDFBox-trunk » Apache PDFBox tools #221' does not have a result yet. Please make sure you set a proper result in case of pipeline/build scripts.
No mail will be sent out, as 'PDFBox » PDFBox-trunk » Apache PDFBox Debugger #221' does not have a result yet. Please make sure you set a proper result in case of pipeline/build scripts.
No mail will be sent out, as 'PDFBox » PDFBox-trunk » Apache Preflight application #221' does not have a result yet. Please make sure you set a proper result in case of pipeline/build scripts.
No mail will be sent out, as 'PDFBox » PDFBox-trunk » Apache PDFBox application #221' does not have a result yet. Please make sure you set a proper result in case of pipeline/build scripts.
No mail will be sent out, as 'PDFBox » PDFBox-trunk » Apache Preflight #221' does not have a result yet. Please make sure you set a proper result in case of pipeline/build scripts.
No mail will be sent out, as 'PDFBox » PDFBox-trunk » Apache PDFBox #221' does not have a result yet. Please make sure you set a proper result in case of pipeline/build scripts.
channel stopped
Archiving artifacts

---------------------------------------------------------------------
To unsubscribe, e-mail: dev-unsubscribe@pdfbox.apache.org
For additional commands, e-mail: dev-help@pdfbox.apache.org


Jenkins build is back to normal : PDFBox » PDFBox-trunk #222

Posted by Apache Jenkins Server <je...@builds.apache.org>.
See <https://ci-builds.apache.org/job/PDFBox/job/PDFBox-trunk/222/display/redirect?page=changes>


---------------------------------------------------------------------
To unsubscribe, e-mail: dev-unsubscribe@pdfbox.apache.org
For additional commands, e-mail: dev-help@pdfbox.apache.org