You are viewing a plain text version of this content. The canonical link for it is here.
Posted to issues@tez.apache.org by Apache Jenkins Server <je...@builds.apache.org> on 2015/02/10 20:30:11 UTC
Failed: TEZ-1914 PreCommit Build #159
Jira: https://issues.apache.org/jira/browse/TEZ-1914
Build: https://builds.apache.org/job/PreCommit-TEZ-Build/159/
###################################################################################
########################## LAST 60 LINES OF THE CONSOLE ###########################
[...truncated 2434 lines...]
{color:red}-1 overall{color}. Here are the results of testing the latest attachment
http://issues.apache.org/jira/secure/attachment/12697838/TEZ-1914.4.patch
against master revision 12c31ab.
{color:green}+1 @author{color}. The patch does not contain any @author tags.
{color:green}+1 tests included{color}. The patch appears to include 5 new or modified test files.
{color:green}+1 javac{color}. The applied patch does not increase the total number of javac compiler warnings.
{color:green}+1 javadoc{color}. There were no new javadoc warning messages.
{color:green}+1 findbugs{color}. The patch does not introduce any new Findbugs (version 2.0.3) warnings.
{color:green}+1 release audit{color}. The applied patch does not increase the total number of release audit warnings.
{color:red}-1 core tests{color}. The patch failed these unit tests in :
org.apache.tez.test.TestTezJobs
Test results: https://builds.apache.org/job/PreCommit-TEZ-Build/159//testReport/
Console output: https://builds.apache.org/job/PreCommit-TEZ-Build/159//console
This message is automatically generated.
======================================================================
======================================================================
Adding comment to Jira.
======================================================================
======================================================================
Comment added.
043da44a8b73ef07bf568e8cf252de60b4e56c52 logged out
======================================================================
======================================================================
Finished build.
======================================================================
======================================================================
Build step 'Execute shell' marked build as failure
Archiving artifacts
Sending artifact delta relative to PreCommit-TEZ-Build #156
Archived 41 artifacts
Archive block size is 32768
Received 2 blocks and 2570377 bytes
Compression is 2.5%
Took 0.96 sec
[description-setter] Could not determine description.
Recording test results
Email was triggered for: Failure
Sending email for trigger: Failure
###################################################################################
############################## FAILED TESTS (if any) ##############################
1 tests failed.
FAILED: org.apache.tez.test.TestTezJobs.testInvalidQueueSubmission
Error Message:
Job submission should have thrown an exception
Stack Trace:
java.lang.AssertionError: Job submission should have thrown an exception
at org.junit.Assert.fail(Assert.java:88)
at org.apache.tez.test.TestTezJobs.testInvalidQueueSubmission(TestTezJobs.java:699)
Success: TEZ-2045 PreCommit Build #160
Posted by Apache Jenkins Server <je...@builds.apache.org>.
Jira: https://issues.apache.org/jira/browse/TEZ-2045
Build: https://builds.apache.org/job/PreCommit-TEZ-Build/160/
###################################################################################
########################## LAST 60 LINES OF THE CONSOLE ###########################
[...truncated 2618 lines...]
[INFO] Final Memory: 69M/932M
[INFO] ------------------------------------------------------------------------
{color:green}+1 overall{color}. Here are the results of testing the latest attachment
http://issues.apache.org/jira/secure/attachment/12697837/TEZ-2045.3.txt
against master revision 12c31ab.
{color:green}+1 @author{color}. The patch does not contain any @author tags.
{color:green}+1 tests included{color}. The patch appears to include 2 new or modified test files.
{color:green}+1 javac{color}. The applied patch does not increase the total number of javac compiler warnings.
{color:green}+1 javadoc{color}. There were no new javadoc warning messages.
{color:green}+1 findbugs{color}. The patch does not introduce any new Findbugs (version 2.0.3) warnings.
{color:green}+1 release audit{color}. The applied patch does not increase the total number of release audit warnings.
{color:green}+1 core tests{color}. The patch passed unit tests in .
Test results: https://builds.apache.org/job/PreCommit-TEZ-Build/160//testReport/
Console output: https://builds.apache.org/job/PreCommit-TEZ-Build/160//console
This message is automatically generated.
======================================================================
======================================================================
Adding comment to Jira.
======================================================================
======================================================================
Comment added.
f413ec5144eac4b24745e4d5fbcee1854a03ed6f logged out
======================================================================
======================================================================
Finished build.
======================================================================
======================================================================
Archiving artifacts
Sending artifact delta relative to PreCommit-TEZ-Build #156
Archived 41 artifacts
Archive block size is 32768
Received 19 blocks and 2020700 bytes
Compression is 23.6%
Took 0.81 sec
Description set: TEZ-2045
Recording test results
Email was triggered for: Success
Sending email for trigger: Success
###################################################################################
############################## FAILED TESTS (if any) ##############################
All tests passed