You are viewing a plain text version of this content. The canonical link for it is here.
Posted to dev@kafka.apache.org by Apache Jenkins Server <je...@builds.apache.org> on 2018/12/06 00:49:56 UTC
Build failed in Jenkins: kafka-1.1-jdk7 #235
See <https://builds.apache.org/job/kafka-1.1-jdk7/235/display/redirect?page=changes>
Changes:
[matthias] KAFKA-7678: Avoid NPE when closing the RecordCollector (#5993)
------------------------------------------
[...truncated 424.83 KB...]
kafka.utils.json.JsonValueTest > testDecodeMap PASSED
kafka.utils.json.JsonValueTest > testDecodeSeq STARTED
kafka.utils.json.JsonValueTest > testDecodeSeq PASSED
kafka.utils.json.JsonValueTest > testJsonObjectGet STARTED
kafka.utils.json.JsonValueTest > testJsonObjectGet PASSED
kafka.utils.json.JsonValueTest > testJsonValueEquals STARTED
kafka.utils.json.JsonValueTest > testJsonValueEquals PASSED
kafka.utils.json.JsonValueTest > testJsonArrayIterator STARTED
kafka.utils.json.JsonValueTest > testJsonArrayIterator PASSED
kafka.utils.json.JsonValueTest > testJsonObjectApply STARTED
kafka.utils.json.JsonValueTest > testJsonObjectApply PASSED
kafka.utils.json.JsonValueTest > testDecodeBoolean STARTED
kafka.utils.json.JsonValueTest > testDecodeBoolean PASSED
kafka.utils.SchedulerTest > testMockSchedulerNonPeriodicTask STARTED
kafka.utils.SchedulerTest > testMockSchedulerNonPeriodicTask PASSED
kafka.utils.SchedulerTest > testMockSchedulerPeriodicTask STARTED
kafka.utils.SchedulerTest > testMockSchedulerPeriodicTask PASSED
kafka.utils.SchedulerTest > testNonPeriodicTask STARTED
kafka.utils.SchedulerTest > testNonPeriodicTask PASSED
kafka.utils.SchedulerTest > testRestart STARTED
kafka.utils.SchedulerTest > testRestart PASSED
kafka.utils.SchedulerTest > testReentrantTaskInMockScheduler STARTED
kafka.utils.SchedulerTest > testReentrantTaskInMockScheduler PASSED
kafka.utils.SchedulerTest > testPeriodicTask STARTED
kafka.utils.SchedulerTest > testPeriodicTask PASSED
kafka.utils.JsonTest > testJsonParse STARTED
kafka.utils.JsonTest > testJsonParse PASSED
kafka.utils.JsonTest > testLegacyEncodeAsString STARTED
kafka.utils.JsonTest > testLegacyEncodeAsString PASSED
kafka.utils.JsonTest > testEncodeAsBytes STARTED
kafka.utils.JsonTest > testEncodeAsBytes PASSED
kafka.utils.JsonTest > testEncodeAsString STARTED
kafka.utils.JsonTest > testEncodeAsString PASSED
kafka.utils.CommandLineUtilsTest > testParseEmptyArg STARTED
kafka.utils.CommandLineUtilsTest > testParseEmptyArg PASSED
kafka.utils.CommandLineUtilsTest > testParseSingleArg STARTED
kafka.utils.CommandLineUtilsTest > testParseSingleArg PASSED
kafka.utils.CommandLineUtilsTest > testParseArgs STARTED
kafka.utils.CommandLineUtilsTest > testParseArgs PASSED
kafka.utils.CommandLineUtilsTest > testParseEmptyArgAsValid STARTED
kafka.utils.CommandLineUtilsTest > testParseEmptyArgAsValid PASSED
kafka.utils.CoreUtilsTest > testGenerateUuidAsBase64 STARTED
kafka.utils.CoreUtilsTest > testGenerateUuidAsBase64 PASSED
kafka.utils.CoreUtilsTest > testAbs STARTED
kafka.utils.CoreUtilsTest > testAbs PASSED
kafka.utils.CoreUtilsTest > testReplaceSuffix STARTED
kafka.utils.CoreUtilsTest > testReplaceSuffix PASSED
kafka.utils.CoreUtilsTest > testCircularIterator STARTED
kafka.utils.CoreUtilsTest > testCircularIterator PASSED
kafka.utils.CoreUtilsTest > testReadBytes STARTED
kafka.utils.CoreUtilsTest > testReadBytes PASSED
kafka.utils.CoreUtilsTest > testCsvList STARTED
kafka.utils.CoreUtilsTest > testCsvList PASSED
kafka.utils.CoreUtilsTest > testReadInt STARTED
kafka.utils.CoreUtilsTest > testReadInt PASSED
kafka.utils.CoreUtilsTest > testAtomicGetOrUpdate STARTED
kafka.utils.CoreUtilsTest > testAtomicGetOrUpdate PASSED
kafka.utils.CoreUtilsTest > testUrlSafeBase64EncodeUUID STARTED
kafka.utils.CoreUtilsTest > testUrlSafeBase64EncodeUUID PASSED
kafka.utils.CoreUtilsTest > testCsvMap STARTED
kafka.utils.CoreUtilsTest > testCsvMap PASSED
kafka.utils.CoreUtilsTest > testInLock STARTED
kafka.utils.CoreUtilsTest > testInLock PASSED
kafka.utils.CoreUtilsTest > testTryAll STARTED
kafka.utils.CoreUtilsTest > testTryAll PASSED
kafka.utils.CoreUtilsTest > testSwallow STARTED
kafka.utils.CoreUtilsTest > testSwallow PASSED
kafka.utils.timer.TimerTaskListTest > testAll STARTED
kafka.utils.timer.TimerTaskListTest > testAll PASSED
kafka.utils.timer.TimerTest > testAlreadyExpiredTask STARTED
kafka.utils.timer.TimerTest > testAlreadyExpiredTask PASSED
kafka.utils.timer.TimerTest > testTaskExpiration STARTED
kafka.utils.timer.TimerTest > testTaskExpiration PASSED
kafka.utils.IteratorTemplateTest > testIterator STARTED
kafka.utils.IteratorTemplateTest > testIterator PASSED
kafka.utils.LoggingTest > testLog4jControllerIsRegistered STARTED
kafka.utils.LoggingTest > testLog4jControllerIsRegistered PASSED
kafka.utils.LoggingTest > testLogName STARTED
kafka.utils.LoggingTest > testLogName PASSED
kafka.utils.LoggingTest > testLogNameOverride STARTED
kafka.utils.LoggingTest > testLogNameOverride PASSED
unit.kafka.admin.DeleteConsumerGroupTest > testDeleteCmdInvalidGroupId STARTED
unit.kafka.admin.DeleteConsumerGroupTest > testDeleteCmdInvalidGroupId PASSED
unit.kafka.admin.DeleteConsumerGroupTest > testDeleteNonEmptyGroup STARTED
unit.kafka.admin.DeleteConsumerGroupTest > testDeleteNonEmptyGroup PASSED
unit.kafka.admin.DeleteConsumerGroupTest > testDeleteCmdWithMixOfSuccessAndError STARTED
unit.kafka.admin.DeleteConsumerGroupTest > testDeleteCmdWithMixOfSuccessAndError PASSED
unit.kafka.admin.DeleteConsumerGroupTest > testDeleteWithShortInitialization STARTED
unit.kafka.admin.DeleteConsumerGroupTest > testDeleteWithShortInitialization PASSED
unit.kafka.admin.DeleteConsumerGroupTest > testDeleteCmdWithShortInitialization STARTED
unit.kafka.admin.DeleteConsumerGroupTest > testDeleteCmdWithShortInitialization PASSED
unit.kafka.admin.DeleteConsumerGroupTest > testDeleteWithTopicOption STARTED
unit.kafka.admin.DeleteConsumerGroupTest > testDeleteWithTopicOption PASSED
unit.kafka.admin.DeleteConsumerGroupTest > testDeleteNonExistingGroup STARTED
unit.kafka.admin.DeleteConsumerGroupTest > testDeleteNonExistingGroup PASSED
unit.kafka.admin.DeleteConsumerGroupTest > testDeleteCmdNonEmptyGroup STARTED
unit.kafka.admin.DeleteConsumerGroupTest > testDeleteCmdNonEmptyGroup PASSED
unit.kafka.admin.DeleteConsumerGroupTest > testDeleteCmdNonExistingGroup STARTED
unit.kafka.admin.DeleteConsumerGroupTest > testDeleteCmdNonExistingGroup PASSED
unit.kafka.admin.DeleteConsumerGroupTest > testDeleteEmptyGroup STARTED
unit.kafka.admin.DeleteConsumerGroupTest > testDeleteEmptyGroup PASSED
unit.kafka.admin.DeleteConsumerGroupTest > testDeleteWithMixOfSuccessAndError STARTED
unit.kafka.admin.DeleteConsumerGroupTest > testDeleteWithMixOfSuccessAndError PASSED
unit.kafka.admin.DeleteConsumerGroupTest > testDeleteCmdEmptyGroup STARTED
unit.kafka.admin.DeleteConsumerGroupTest > testDeleteCmdEmptyGroup PASSED
unit.kafka.admin.DeleteConsumerGroupTest > testDeleteInvalidGroupId STARTED
unit.kafka.admin.DeleteConsumerGroupTest > testDeleteInvalidGroupId PASSED
1927 tests completed, 1 failed, 6 skipped
> Task :kafka-1.1-jdk7:core:test FAILED
> Task :test_core_2_11 FAILED
FAILURE: Build failed with an exception.
* What went wrong:
Execution failed for task ':kafka-1.1-jdk7:core:test'.
> There were failing tests. See the report at: file://<https://builds.apache.org/job/kafka-1.1-jdk7/ws/core/build/reports/tests/test/index.html>
* Try:
Run with --stacktrace option to get the stack trace. Run with --info or --debug option to get more log output. Run with --scan to get full insights.
* Get more help at https://help.gradle.org
Deprecated Gradle features were used in this build, making it incompatible with Gradle 5.0.
See https://docs.gradle.org/4.8.1/userguide/command_line_interface.html#sec:command_line_warnings
BUILD FAILED in 1h 39m 57s
22 actionable tasks: 2 executed, 20 up-to-date
Build step 'Execute shell' marked build as failure
[FINDBUGS] Collecting findbugs analysis files...
Setting GRADLE_4_8_1_HOME=/home/jenkins/tools/gradle/4.8.1
[FINDBUGS] Searching for all files in <https://builds.apache.org/job/kafka-1.1-jdk7/ws/> that match the pattern **/build/reports/findbugs/*.xml
[FINDBUGS] Parsing 1 file in <https://builds.apache.org/job/kafka-1.1-jdk7/ws/>
[FINDBUGS] Successfully parsed file <https://builds.apache.org/job/kafka-1.1-jdk7/ws/core/build/reports/findbugs/main.xml> with 0 unique warnings and 0 duplicates.
Setting GRADLE_4_8_1_HOME=/home/jenkins/tools/gradle/4.8.1
Setting GRADLE_4_8_1_HOME=/home/jenkins/tools/gradle/4.8.1
<Git Blamer> Using GitBlamer to create author and commit information for all warnings.
<Git Blamer> GIT_COMMIT=69a4b2ceacfae108be99ec0f63fdf2d6efd0dfcb, workspace=<https://builds.apache.org/job/kafka-1.1-jdk7/ws/>
[FINDBUGS] Computing warning deltas based on reference build #234
Recording test results
Setting GRADLE_4_8_1_HOME=/home/jenkins/tools/gradle/4.8.1
Setting GRADLE_4_8_1_HOME=/home/jenkins/tools/gradle/4.8.1
Jenkins build is back to normal : kafka-1.1-jdk7 #236
Posted by Apache Jenkins Server <je...@builds.apache.org>.
See <https://builds.apache.org/job/kafka-1.1-jdk7/236/display/redirect?page=changes>