You are viewing a plain text version of this content. The canonical link for it is here.
Posted to commits@sling.apache.org by Apache Jenkins Server <je...@builds.apache.org> on 2018/10/19 22:04:33 UTC
Build failed in Jenkins:
sling-org-apache-sling-launchpad-testing-11 #39
See <https://builds.apache.org/job/sling-org-apache-sling-launchpad-testing-11/39/display/redirect?page=changes>
Changes:
[rombert] SLING-7935 - Consolidate all 'launchpad-testing' modules into a single
------------------------------------------
Started by an SCM change
Started by an SCM change
Started by upstream project "sling-org-apache-sling-launchpad-test-bundles-1.8" build number 65
originally caused by:
Started by an SCM change
Started by an SCM change
[EnvInject] - Loading node environment variables.
Building remotely on ubuntu-eu2 (ubuntu trusty) in workspace <https://builds.apache.org/job/sling-org-apache-sling-launchpad-testing-11/ws/>
[WS-CLEANUP] Deleting project workspace...
Cloning the remote Git repository
Cloning repository https://github.com/apache/sling-org-apache-sling-launchpad-testing.git
> git init <https://builds.apache.org/job/sling-org-apache-sling-launchpad-testing-11/ws/> # timeout=10
Fetching upstream changes from https://github.com/apache/sling-org-apache-sling-launchpad-testing.git
> git --version # timeout=10
> git fetch --tags --progress https://github.com/apache/sling-org-apache-sling-launchpad-testing.git +refs/heads/*:refs/remotes/origin/*
> git config remote.origin.url https://github.com/apache/sling-org-apache-sling-launchpad-testing.git # timeout=10
> git config --add remote.origin.fetch +refs/heads/*:refs/remotes/origin/* # timeout=10
> git config remote.origin.url https://github.com/apache/sling-org-apache-sling-launchpad-testing.git # timeout=10
Fetching upstream changes from https://github.com/apache/sling-org-apache-sling-launchpad-testing.git
> git fetch --tags --progress https://github.com/apache/sling-org-apache-sling-launchpad-testing.git +refs/heads/*:refs/remotes/origin/*
> git rev-parse origin/master^{commit} # timeout=10
Checking out Revision 11a7575dedfad03e7e357506e8a44bc30a7b9de1 (origin/master)
> git config core.sparsecheckout # timeout=10
> git checkout -f 11a7575dedfad03e7e357506e8a44bc30a7b9de1
Commit message: "SLING-7935 - Consolidate all 'launchpad-testing' modules into a single git repository"
> git rev-list --no-walk 19f71e11e2fa56ba723cb1797cb2c91e9ae3dd0a # timeout=10
Parsing POMs
Established TCP socket on 46137
maven33-agent.jar already up to date
maven33-interceptor.jar already up to date
maven3-interceptor-commons.jar already up to date
[sling-org-apache-sling-launchpad-testing-11] $ /home/jenkins/tools/java/latest11/bin/java -Xmx4g -Xms4g -cp /home/jenkins/jenkins-slave/maven33-agent.jar:/home/jenkins/tools/maven/apache-maven-3.3.9/boot/plexus-classworlds-2.5.2.jar:/home/jenkins/tools/maven/apache-maven-3.3.9/conf/logging jenkins.maven3.agent.Maven33Main /home/jenkins/tools/maven/apache-maven-3.3.9 /home/jenkins/jenkins-slave/slave.jar /home/jenkins/jenkins-slave/maven33-interceptor.jar /home/jenkins/jenkins-slave/maven3-interceptor-commons.jar 46137
<===[JENKINS REMOTING CAPACITY]===> channel started
Executing Maven: -B -f <https://builds.apache.org/job/sling-org-apache-sling-launchpad-testing-11/ws/pom.xml> -Dmaven.repo.local=/home/jenkins/jenkins-slave/maven-repositories/1 -U clean verify
[INFO] Scanning for projects...
[INFO] Downloading: http://repository.apache.org/snapshots/org/apache/sling/org.apache.sling.launchpad.test-bundles/12-SNAPSHOT/maven-metadata.xml
[INFO] Downloaded: http://repository.apache.org/snapshots/org/apache/sling/org.apache.sling.launchpad.test-bundles/12-SNAPSHOT/maven-metadata.xml (1007 B at 2.0 KB/sec)
[INFO] Downloading: http://repository.apache.org/snapshots/org/apache/sling/org.apache.sling.starter/12-SNAPSHOT/maven-metadata.xml
[INFO] Downloaded: http://repository.apache.org/snapshots/org/apache/sling/org.apache.sling.starter/12-SNAPSHOT/maven-metadata.xml (2 KB at 3.5 KB/sec)
[INFO] Extended Maven classpath (scope 'provided') by the dependencies extracted from the Sling model.
[INFO]
[INFO] ------------------------------------------------------------------------
[INFO] Building Apache Sling Launchpad Testing 12-SNAPSHOT
[INFO] ------------------------------------------------------------------------
[INFO] Downloading: http://repository.apache.org/snapshots/org/apache/sling/org.apache.sling.launchpad.integration-tests/12-SNAPSHOT/maven-metadata.xml
[INFO] Downloading: http://repository.apache.org/snapshots/org/apache/sling/org.apache.sling.launchpad.integration-tests/12-SNAPSHOT/org.apache.sling.launchpad.integration-tests-12-SNAPSHOT.pom
[WARNING] The POM for org.apache.sling:org.apache.sling.launchpad.integration-tests:jar:12-SNAPSHOT is missing, no dependency information available
[INFO] Downloading: http://repository.apache.org/snapshots/org/apache/sling/org.apache.sling.launchpad.test-fragment/12-SNAPSHOT/maven-metadata.xml
[INFO] Downloaded: http://repository.apache.org/snapshots/org/apache/sling/org.apache.sling.launchpad.test-fragment/12-SNAPSHOT/maven-metadata.xml (1008 B at 2.6 KB/sec)
[INFO] Downloading: http://repository.apache.org/snapshots/org/apache/sling/org.apache.sling.launchpad.test-services-war/12-SNAPSHOT/maven-metadata.xml
[INFO] Downloaded: http://repository.apache.org/snapshots/org/apache/sling/org.apache.sling.launchpad.test-services-war/12-SNAPSHOT/maven-metadata.xml (1012 B at 2.6 KB/sec)
[INFO] Downloading: http://repository.apache.org/snapshots/org/apache/sling/org.apache.sling.launchpad.test-services/12-SNAPSHOT/maven-metadata.xml
[INFO] Downloaded: http://repository.apache.org/snapshots/org/apache/sling/org.apache.sling.launchpad.test-services/12-SNAPSHOT/maven-metadata.xml (1008 B at 2.5 KB/sec)
[INFO] Downloading: http://repository.apache.org/snapshots/org/apache/sling/org.apache.sling.launchpad.integration-tests/12-SNAPSHOT/org.apache.sling.launchpad.integration-tests-12-SNAPSHOT.jar
[WARNING] Attempt to (de-)serialize anonymous class hudson.maven.reporters.MavenArtifactArchiver$2; see: https://jenkins.io/redirect/serialization-of-anonymous-classes/
[JENKINS] Archiving disabled
[WARNING] Attempt to (de-)serialize anonymous class hudson.maven.reporters.MavenFingerprinter$1; see: https://jenkins.io/redirect/serialization-of-anonymous-classes/
[JENKINS] Archiving disabled[INFO] ------------------------------------------------------------------------
[INFO] BUILD FAILURE
[INFO] ------------------------------------------------------------------------
[INFO] Total time: 9.705 s
[INFO] Finished at: 2018-10-19T22:04:32+00:00
[INFO] Final Memory: 31M/4096M
[INFO] ------------------------------------------------------------------------
Waiting for Jenkins to finish collecting data[ERROR] Failed to execute goal on project org.apache.sling.launchpad.testing: Could not resolve dependencies for project org.apache.sling:org.apache.sling.launchpad.testing:slingstart:12-SNAPSHOT: Could not find artifact org.apache.sling:org.apache.sling.launchpad.integration-tests:jar:12-SNAPSHOT in Nexus (http://repository.apache.org/snapshots) -> [Help 1]
[ERROR]
[ERROR] To see the full stack trace of the errors, re-run Maven with the -e switch.
[ERROR] Re-run Maven using the -X switch to enable full debug logging.
[ERROR]
[ERROR] For more information about the errors and possible solutions, please read the following articles:
[ERROR] [Help 1] http://cwiki.apache.org/confluence/display/MAVEN/DependencyResolutionException
channel stopped
Archiving artifacts
Recording test results
Jenkins build is back to stable :
sling-org-apache-sling-launchpad-testing-11 #61
Posted by Apache Jenkins Server <je...@builds.apache.org>.
See <https://builds.apache.org/job/sling-org-apache-sling-launchpad-testing-11/61/display/redirect?page=changes>
Jenkins build is still unstable:
sling-org-apache-sling-launchpad-testing-11 #60
Posted by Apache Jenkins Server <je...@builds.apache.org>.
See <https://builds.apache.org/job/sling-org-apache-sling-launchpad-testing-11/60/display/redirect>
Jenkins build is still unstable:
sling-org-apache-sling-launchpad-testing-11 #59
Posted by Apache Jenkins Server <je...@builds.apache.org>.
See <https://builds.apache.org/job/sling-org-apache-sling-launchpad-testing-11/59/display/redirect>
Jenkins build is still unstable:
sling-org-apache-sling-launchpad-testing-11 #58
Posted by Apache Jenkins Server <je...@builds.apache.org>.
See <https://builds.apache.org/job/sling-org-apache-sling-launchpad-testing-11/58/display/redirect>
Jenkins build is still unstable:
sling-org-apache-sling-launchpad-testing-11 #57
Posted by Apache Jenkins Server <je...@builds.apache.org>.
See <https://builds.apache.org/job/sling-org-apache-sling-launchpad-testing-11/57/display/redirect>
Jenkins build is still unstable:
sling-org-apache-sling-launchpad-testing-11 #56
Posted by Apache Jenkins Server <je...@builds.apache.org>.
See <https://builds.apache.org/job/sling-org-apache-sling-launchpad-testing-11/56/display/redirect>
Jenkins build is still unstable:
sling-org-apache-sling-launchpad-testing-11 #55
Posted by Apache Jenkins Server <je...@builds.apache.org>.
See <https://builds.apache.org/job/sling-org-apache-sling-launchpad-testing-11/55/display/redirect>
Jenkins build is still unstable:
sling-org-apache-sling-launchpad-testing-11 #54
Posted by Apache Jenkins Server <je...@builds.apache.org>.
See <https://builds.apache.org/job/sling-org-apache-sling-launchpad-testing-11/54/display/redirect>
Jenkins build is still unstable:
sling-org-apache-sling-launchpad-testing-11 #53
Posted by Apache Jenkins Server <je...@builds.apache.org>.
See <https://builds.apache.org/job/sling-org-apache-sling-launchpad-testing-11/53/display/redirect>
Jenkins build is still unstable:
sling-org-apache-sling-launchpad-testing-11 #52
Posted by Apache Jenkins Server <je...@builds.apache.org>.
See <https://builds.apache.org/job/sling-org-apache-sling-launchpad-testing-11/52/display/redirect>
Jenkins build is still unstable:
sling-org-apache-sling-launchpad-testing-11 #51
Posted by Apache Jenkins Server <je...@builds.apache.org>.
See <https://builds.apache.org/job/sling-org-apache-sling-launchpad-testing-11/51/display/redirect>
Jenkins build is still unstable:
sling-org-apache-sling-launchpad-testing-11 #50
Posted by Apache Jenkins Server <je...@builds.apache.org>.
See <https://builds.apache.org/job/sling-org-apache-sling-launchpad-testing-11/50/display/redirect>
Jenkins build is still unstable:
sling-org-apache-sling-launchpad-testing-11 #49
Posted by Apache Jenkins Server <je...@builds.apache.org>.
See <https://builds.apache.org/job/sling-org-apache-sling-launchpad-testing-11/49/display/redirect>
Jenkins build is still unstable:
sling-org-apache-sling-launchpad-testing-11 #48
Posted by Apache Jenkins Server <je...@builds.apache.org>.
See <https://builds.apache.org/job/sling-org-apache-sling-launchpad-testing-11/48/display/redirect>
Jenkins build is still unstable:
sling-org-apache-sling-launchpad-testing-11 #47
Posted by Apache Jenkins Server <je...@builds.apache.org>.
See <https://builds.apache.org/job/sling-org-apache-sling-launchpad-testing-11/47/display/redirect>
Jenkins build is still unstable:
sling-org-apache-sling-launchpad-testing-11 #46
Posted by Apache Jenkins Server <je...@builds.apache.org>.
See <https://builds.apache.org/job/sling-org-apache-sling-launchpad-testing-11/46/display/redirect>
Jenkins build is still unstable:
sling-org-apache-sling-launchpad-testing-11 #45
Posted by Apache Jenkins Server <je...@builds.apache.org>.
See <https://builds.apache.org/job/sling-org-apache-sling-launchpad-testing-11/45/display/redirect>
Jenkins build is unstable:
sling-org-apache-sling-launchpad-testing-11 #44
Posted by Apache Jenkins Server <je...@builds.apache.org>.
See <https://builds.apache.org/job/sling-org-apache-sling-launchpad-testing-11/44/display/redirect>
Build failed in Jenkins:
sling-org-apache-sling-launchpad-testing-11 #43
Posted by Apache Jenkins Server <je...@builds.apache.org>.
See <https://builds.apache.org/job/sling-org-apache-sling-launchpad-testing-11/43/display/redirect>
------------------------------------------
Started by timer
[EnvInject] - Loading node environment variables.
Building remotely on H37 (ubuntu xenial) in workspace <https://builds.apache.org/job/sling-org-apache-sling-launchpad-testing-11/ws/>
[WS-CLEANUP] Deleting project workspace...
Cloning the remote Git repository
Cloning repository https://github.com/apache/sling-org-apache-sling-launchpad-testing.git
> git init <https://builds.apache.org/job/sling-org-apache-sling-launchpad-testing-11/ws/> # timeout=10
Fetching upstream changes from https://github.com/apache/sling-org-apache-sling-launchpad-testing.git
> git --version # timeout=10
> git fetch --tags --progress https://github.com/apache/sling-org-apache-sling-launchpad-testing.git +refs/heads/*:refs/remotes/origin/*
> git config remote.origin.url https://github.com/apache/sling-org-apache-sling-launchpad-testing.git # timeout=10
> git config --add remote.origin.fetch +refs/heads/*:refs/remotes/origin/* # timeout=10
> git config remote.origin.url https://github.com/apache/sling-org-apache-sling-launchpad-testing.git # timeout=10
Fetching upstream changes from https://github.com/apache/sling-org-apache-sling-launchpad-testing.git
> git fetch --tags --progress https://github.com/apache/sling-org-apache-sling-launchpad-testing.git +refs/heads/*:refs/remotes/origin/*
> git rev-parse origin/master^{commit} # timeout=10
Checking out Revision 11a7575dedfad03e7e357506e8a44bc30a7b9de1 (origin/master)
> git config core.sparsecheckout # timeout=10
> git checkout -f 11a7575dedfad03e7e357506e8a44bc30a7b9de1
Commit message: "SLING-7935 - Consolidate all 'launchpad-testing' modules into a single git repository"
> git rev-list --no-walk 11a7575dedfad03e7e357506e8a44bc30a7b9de1 # timeout=10
Parsing POMs
Established TCP socket on 37635
maven33-agent.jar already up to date
maven33-interceptor.jar already up to date
maven3-interceptor-commons.jar already up to date
[sling-org-apache-sling-launchpad-testing-11] $ /home/jenkins/tools/java/latest11/bin/java -Xmx4g -Xms4g -cp /home/jenkins/jenkins-slave/maven33-agent.jar:/home/jenkins/tools/maven/apache-maven-3.3.9/boot/plexus-classworlds-2.5.2.jar:/home/jenkins/tools/maven/apache-maven-3.3.9/conf/logging jenkins.maven3.agent.Maven33Main /home/jenkins/tools/maven/apache-maven-3.3.9 /home/jenkins/jenkins-slave/slave.jar /home/jenkins/jenkins-slave/maven33-interceptor.jar /home/jenkins/jenkins-slave/maven3-interceptor-commons.jar 37635
<===[JENKINS REMOTING CAPACITY]===> channel started
Executing Maven: -B -f <https://builds.apache.org/job/sling-org-apache-sling-launchpad-testing-11/ws/pom.xml> -Dmaven.repo.local=/home/jenkins/jenkins-slave/maven-repositories/1 -U clean verify
[INFO] Scanning for projects...
[INFO] Downloading: http://repository.apache.org/snapshots/org/apache/sling/org.apache.sling.launchpad.test-bundles/12-SNAPSHOT/maven-metadata.xml
[INFO] Downloaded: http://repository.apache.org/snapshots/org/apache/sling/org.apache.sling.launchpad.test-bundles/12-SNAPSHOT/maven-metadata.xml (1007 B at 2.3 KB/sec)
[INFO] Downloading: http://repository.apache.org/snapshots/org/apache/sling/org.apache.sling.launchpad.test-bundles/12-SNAPSHOT/org.apache.sling.launchpad.test-bundles-12-20181022.062540-4.txt
[INFO] Downloaded: http://repository.apache.org/snapshots/org/apache/sling/org.apache.sling.launchpad.test-bundles/12-SNAPSHOT/org.apache.sling.launchpad.test-bundles-12-20181022.062540-4.txt (2 KB at 5.5 KB/sec)
[INFO] Downloading: http://repository.apache.org/snapshots/org/apache/sling/org.apache.sling.starter/12-SNAPSHOT/maven-metadata.xml
[INFO] Downloaded: http://repository.apache.org/snapshots/org/apache/sling/org.apache.sling.starter/12-SNAPSHOT/maven-metadata.xml (2 KB at 4.3 KB/sec)
[INFO] Extended Maven classpath (scope 'provided') by the dependencies extracted from the Sling model.
[INFO]
[INFO] ------------------------------------------------------------------------
[INFO] Building Apache Sling Launchpad Testing 12-SNAPSHOT
[INFO] ------------------------------------------------------------------------
[INFO] Downloading: http://repository.apache.org/snapshots/org/apache/sling/org.apache.sling.launchpad.integration-tests/12-SNAPSHOT/maven-metadata.xml
[INFO] Downloading: http://repository.apache.org/snapshots/org/apache/sling/org.apache.sling.launchpad.integration-tests/12-SNAPSHOT/org.apache.sling.launchpad.integration-tests-12-SNAPSHOT.pom
[WARNING] The POM for org.apache.sling:org.apache.sling.launchpad.integration-tests:jar:12-SNAPSHOT is missing, no dependency information available
[INFO] Downloading: http://repository.apache.org/snapshots/org/apache/sling/org.apache.sling.launchpad.test-bundles/12-SNAPSHOT/org.apache.sling.launchpad.test-bundles-12-20181022.062540-4.pom
[INFO] Downloaded: http://repository.apache.org/snapshots/org/apache/sling/org.apache.sling.launchpad.test-bundles/12-SNAPSHOT/org.apache.sling.launchpad.test-bundles-12-20181022.062540-4.pom (4 KB at 7.5 KB/sec)
[INFO] Downloading: http://repository.apache.org/snapshots/org/apache/sling/org.apache.sling.launchpad.test-fragment/12-SNAPSHOT/maven-metadata.xml
[INFO] Downloaded: http://repository.apache.org/snapshots/org/apache/sling/org.apache.sling.launchpad.test-fragment/12-SNAPSHOT/maven-metadata.xml (1008 B at 2.9 KB/sec)
[INFO] Downloading: http://repository.apache.org/snapshots/org/apache/sling/org.apache.sling.launchpad.test-services-war/12-SNAPSHOT/maven-metadata.xml
[INFO] Downloaded: http://repository.apache.org/snapshots/org/apache/sling/org.apache.sling.launchpad.test-services-war/12-SNAPSHOT/maven-metadata.xml (1012 B at 2.2 KB/sec)
[INFO] Downloading: http://repository.apache.org/snapshots/org/apache/sling/org.apache.sling.launchpad.test-services/12-SNAPSHOT/maven-metadata.xml
[INFO] Downloaded: http://repository.apache.org/snapshots/org/apache/sling/org.apache.sling.launchpad.test-services/12-SNAPSHOT/maven-metadata.xml (1008 B at 3.0 KB/sec)
[INFO] Downloading: http://repository.apache.org/snapshots/org/apache/sling/org.apache.sling.launchpad.test-services/12-SNAPSHOT/org.apache.sling.launchpad.test-services-12-20181022.062437-2.pom
[INFO] Downloaded: http://repository.apache.org/snapshots/org/apache/sling/org.apache.sling.launchpad.test-services/12-SNAPSHOT/org.apache.sling.launchpad.test-services-12-20181022.062437-2.pom (10 KB at 32.4 KB/sec)
[INFO] Downloading: http://repository.apache.org/snapshots/org/apache/sling/org.apache.sling.launchpad.integration-tests/12-SNAPSHOT/org.apache.sling.launchpad.integration-tests-12-SNAPSHOT.jar
[INFO] Downloading: http://repository.apache.org/snapshots/org/apache/sling/org.apache.sling.launchpad.test-services/12-SNAPSHOT/org.apache.sling.launchpad.test-services-12-20181022.062437-2.jar
[INFO] Downloaded: http://repository.apache.org/snapshots/org/apache/sling/org.apache.sling.launchpad.test-services/12-SNAPSHOT/org.apache.sling.launchpad.test-services-12-20181022.062437-2.jar (180 KB at 263.6 KB/sec)
[WARNING] Attempt to (de-)serialize anonymous class hudson.maven.reporters.MavenArtifactArchiver$2; see: https://jenkins.io/redirect/serialization-of-anonymous-classes/
[JENKINS] Archiving disabled
[WARNING] Attempt to (de-)serialize anonymous class hudson.maven.reporters.MavenFingerprinter$1; see: https://jenkins.io/redirect/serialization-of-anonymous-classes/
[JENKINS] Archiving disabled
[INFO] ------------------------------------------------------------------------
[INFO] BUILD FAILURE
[INFO] ------------------------------------------------------------------------
[INFO] Total time: 14.726 s
[INFO] Finished at: 2018-10-22T19:27:07+00:00
[INFO] Final Memory: 31M/4096M
[INFO] ------------------------------------------------------------------------
Waiting for Jenkins to finish collecting data
[ERROR] Failed to execute goal on project org.apache.sling.launchpad.testing: Could not resolve dependencies for project org.apache.sling:org.apache.sling.launchpad.testing:slingstart:12-SNAPSHOT: Could not find artifact org.apache.sling:org.apache.sling.launchpad.integration-tests:jar:12-SNAPSHOT in Nexus (http://repository.apache.org/snapshots) -> [Help 1]
[ERROR]
[ERROR] To see the full stack trace of the errors, re-run Maven with the -e switch.
[ERROR] Re-run Maven using the -X switch to enable full debug logging.
[ERROR]
[ERROR] For more information about the errors and possible solutions, please read the following articles:
[ERROR] [Help 1] http://cwiki.apache.org/confluence/display/MAVEN/DependencyResolutionException
channel stopped
Archiving artifacts
Recording test results
Build failed in Jenkins:
sling-org-apache-sling-launchpad-testing-11 #42
Posted by Apache Jenkins Server <je...@builds.apache.org>.
See <https://builds.apache.org/job/sling-org-apache-sling-launchpad-testing-11/42/display/redirect>
------------------------------------------
Started by upstream project "sling-org-apache-sling-launchpad-test-bundles-1.8" build number 67
originally caused by:
Started by upstream project "sling-org-apache-sling-launchpad-test-services-1.8" build number 65
originally caused by:
Started by timer
[EnvInject] - Loading node environment variables.
Building remotely on H41 (ubuntu xenial) in workspace <https://builds.apache.org/job/sling-org-apache-sling-launchpad-testing-11/ws/>
[WS-CLEANUP] Deleting project workspace...
[WS-CLEANUP] Done
Cloning the remote Git repository
Cloning repository https://github.com/apache/sling-org-apache-sling-launchpad-testing.git
> git init <https://builds.apache.org/job/sling-org-apache-sling-launchpad-testing-11/ws/> # timeout=10
Fetching upstream changes from https://github.com/apache/sling-org-apache-sling-launchpad-testing.git
> git --version # timeout=10
> git fetch --tags --progress https://github.com/apache/sling-org-apache-sling-launchpad-testing.git +refs/heads/*:refs/remotes/origin/*
> git config remote.origin.url https://github.com/apache/sling-org-apache-sling-launchpad-testing.git # timeout=10
> git config --add remote.origin.fetch +refs/heads/*:refs/remotes/origin/* # timeout=10
> git config remote.origin.url https://github.com/apache/sling-org-apache-sling-launchpad-testing.git # timeout=10
Fetching upstream changes from https://github.com/apache/sling-org-apache-sling-launchpad-testing.git
> git fetch --tags --progress https://github.com/apache/sling-org-apache-sling-launchpad-testing.git +refs/heads/*:refs/remotes/origin/*
> git rev-parse origin/master^{commit} # timeout=10
Checking out Revision 11a7575dedfad03e7e357506e8a44bc30a7b9de1 (origin/master)
> git config core.sparsecheckout # timeout=10
> git checkout -f 11a7575dedfad03e7e357506e8a44bc30a7b9de1
Commit message: "SLING-7935 - Consolidate all 'launchpad-testing' modules into a single git repository"
> git rev-list --no-walk 11a7575dedfad03e7e357506e8a44bc30a7b9de1 # timeout=10
Parsing POMs
Established TCP socket on 40941
maven33-agent.jar already up to date
maven33-interceptor.jar already up to date
maven3-interceptor-commons.jar already up to date
[sling-org-apache-sling-launchpad-testing-11] $ /home/jenkins/tools/java/latest11/bin/java -Xmx4g -Xms4g -cp /home/jenkins/jenkins-slave/maven33-agent.jar:/home/jenkins/tools/maven/apache-maven-3.3.9/boot/plexus-classworlds-2.5.2.jar:/home/jenkins/tools/maven/apache-maven-3.3.9/conf/logging jenkins.maven3.agent.Maven33Main /home/jenkins/tools/maven/apache-maven-3.3.9 /home/jenkins/jenkins-slave/slave.jar /home/jenkins/jenkins-slave/maven33-interceptor.jar /home/jenkins/jenkins-slave/maven3-interceptor-commons.jar 40941
<===[JENKINS REMOTING CAPACITY]===> channel started
Executing Maven: -B -f <https://builds.apache.org/job/sling-org-apache-sling-launchpad-testing-11/ws/pom.xml> -Dmaven.repo.local=/home/jenkins/jenkins-slave/maven-repositories/0 -U clean verify
[INFO] Scanning for projects...
[INFO] Downloading: http://repository.apache.org/snapshots/org/apache/sling/org.apache.sling.launchpad.test-bundles/12-SNAPSHOT/maven-metadata.xml
[INFO] Downloaded: http://repository.apache.org/snapshots/org/apache/sling/org.apache.sling.launchpad.test-bundles/12-SNAPSHOT/maven-metadata.xml (1007 B at 2.6 KB/sec)
[INFO] Downloading: http://repository.apache.org/snapshots/org/apache/sling/org.apache.sling.launchpad.test-bundles/12-SNAPSHOT/org.apache.sling.launchpad.test-bundles-12-20181022.062540-4.txt
[INFO] Downloaded: http://repository.apache.org/snapshots/org/apache/sling/org.apache.sling.launchpad.test-bundles/12-SNAPSHOT/org.apache.sling.launchpad.test-bundles-12-20181022.062540-4.txt (2 KB at 5.4 KB/sec)
[INFO] Downloading: http://repository.apache.org/snapshots/org/apache/sling/org.apache.sling.starter/12-SNAPSHOT/maven-metadata.xml
[INFO] Downloaded: http://repository.apache.org/snapshots/org/apache/sling/org.apache.sling.starter/12-SNAPSHOT/maven-metadata.xml (2 KB at 4.7 KB/sec)
[INFO] Extended Maven classpath (scope 'provided') by the dependencies extracted from the Sling model.
[INFO]
[INFO] ------------------------------------------------------------------------
[INFO] Building Apache Sling Launchpad Testing 12-SNAPSHOT
[INFO] ------------------------------------------------------------------------
[INFO] Downloading: https://repo.maven.apache.org/maven2/org/apache/maven/plugins/maven-failsafe-plugin/2.21.0/maven-failsafe-plugin-2.21.0.pom
[INFO] Downloaded: https://repo.maven.apache.org/maven2/org/apache/maven/plugins/maven-failsafe-plugin/2.21.0/maven-failsafe-plugin-2.21.0.pom (12 KB at 53.1 KB/sec)
[INFO] Downloading: https://repo.maven.apache.org/maven2/org/apache/maven/surefire/surefire/2.21.0/surefire-2.21.0.pom
[INFO] Downloaded: https://repo.maven.apache.org/maven2/org/apache/maven/surefire/surefire/2.21.0/surefire-2.21.0.pom (28 KB at 969.4 KB/sec)
[INFO] Downloading: https://repo.maven.apache.org/maven2/org/apache/maven/plugins/maven-failsafe-plugin/2.21.0/maven-failsafe-plugin-2.21.0.jar
[INFO] Downloaded: https://repo.maven.apache.org/maven2/org/apache/maven/plugins/maven-failsafe-plugin/2.21.0/maven-failsafe-plugin-2.21.0.jar (288 KB at 4629.9 KB/sec)
[INFO] Downloading: http://repository.apache.org/snapshots/org/apache/sling/org.apache.sling.launchpad.integration-tests/12-SNAPSHOT/maven-metadata.xml
[INFO] Downloading: http://repository.apache.org/snapshots/org/apache/sling/org.apache.sling.launchpad.integration-tests/12-SNAPSHOT/org.apache.sling.launchpad.integration-tests-12-SNAPSHOT.pom
[WARNING] The POM for org.apache.sling:org.apache.sling.launchpad.integration-tests:jar:12-SNAPSHOT is missing, no dependency information available
[INFO] Downloading: http://repository.apache.org/snapshots/org/apache/sling/org.apache.sling.launchpad.test-bundles/12-SNAPSHOT/org.apache.sling.launchpad.test-bundles-12-20181022.062540-4.pom
[INFO] Downloaded: http://repository.apache.org/snapshots/org/apache/sling/org.apache.sling.launchpad.test-bundles/12-SNAPSHOT/org.apache.sling.launchpad.test-bundles-12-20181022.062540-4.pom (4 KB at 10.8 KB/sec)
[INFO] Downloading: https://repo.maven.apache.org/maven2/org/slf4j/log4j-over-slf4j/1.7.6/log4j-over-slf4j-1.7.6.pom
[INFO] Downloaded: https://repo.maven.apache.org/maven2/org/slf4j/log4j-over-slf4j/1.7.6/log4j-over-slf4j-1.7.6.pom (2 KB at 110.2 KB/sec)
[INFO] Downloading: https://repo.maven.apache.org/maven2/org/apache/sling/org.apache.sling.junit.scriptable/1.0.12/org.apache.sling.junit.scriptable-1.0.12.pom
[INFO] Downloaded: https://repo.maven.apache.org/maven2/org/apache/sling/org.apache.sling.junit.scriptable/1.0.12/org.apache.sling.junit.scriptable-1.0.12.pom (6 KB at 297.9 KB/sec)
[INFO] Downloading: http://repository.apache.org/snapshots/org/apache/sling/org.apache.sling.launchpad.test-fragment/12-SNAPSHOT/maven-metadata.xml
[INFO] Downloaded: http://repository.apache.org/snapshots/org/apache/sling/org.apache.sling.launchpad.test-fragment/12-SNAPSHOT/maven-metadata.xml (1008 B at 3.4 KB/sec)
[INFO] Downloading: http://repository.apache.org/snapshots/org/apache/sling/org.apache.sling.launchpad.test-fragment/12-SNAPSHOT/org.apache.sling.launchpad.test-fragment-12-20181021.001545-2.pom
[INFO] Downloaded: http://repository.apache.org/snapshots/org/apache/sling/org.apache.sling.launchpad.test-fragment/12-SNAPSHOT/org.apache.sling.launchpad.test-fragment-12-20181021.001545-2.pom (3 KB at 9.9 KB/sec)
[INFO] Downloading: http://repository.apache.org/snapshots/org/apache/sling/org.apache.sling.launchpad.test-services-war/12-SNAPSHOT/maven-metadata.xml
[INFO] Downloaded: http://repository.apache.org/snapshots/org/apache/sling/org.apache.sling.launchpad.test-services-war/12-SNAPSHOT/maven-metadata.xml (1012 B at 3.4 KB/sec)
[INFO] Downloading: http://repository.apache.org/snapshots/org/apache/sling/org.apache.sling.launchpad.test-services-war/12-SNAPSHOT/org.apache.sling.launchpad.test-services-war-12-20181019.171426-1.pom
[INFO] Downloaded: http://repository.apache.org/snapshots/org/apache/sling/org.apache.sling.launchpad.test-services-war/12-SNAPSHOT/org.apache.sling.launchpad.test-services-war-12-20181019.171426-1.pom (6 KB at 18.7 KB/sec)
[INFO] Downloading: http://repository.apache.org/snapshots/org/apache/sling/org.apache.sling.launchpad.test-services/12-SNAPSHOT/maven-metadata.xml
[INFO] Downloaded: http://repository.apache.org/snapshots/org/apache/sling/org.apache.sling.launchpad.test-services/12-SNAPSHOT/maven-metadata.xml (1008 B at 3.4 KB/sec)
[INFO] Downloading: https://repo.maven.apache.org/maven2/org/apache/sling/org.apache.sling.testing.samples.failingtests/1.0.6/org.apache.sling.testing.samples.failingtests-1.0.6.pom
[INFO] Downloaded: https://repo.maven.apache.org/maven2/org/apache/sling/org.apache.sling.testing.samples.failingtests/1.0.6/org.apache.sling.testing.samples.failingtests-1.0.6.pom (5 KB at 111.3 KB/sec)
[INFO] Downloading: https://repo.maven.apache.org/maven2/org/apache/sling/sling/10/sling-10.pom
[INFO] Downloaded: https://repo.maven.apache.org/maven2/org/apache/sling/sling/10/sling-10.pom (26 KB at 1319.2 KB/sec)
[INFO] Downloading: https://repo.maven.apache.org/maven2/org/apache/apache/8/apache-8.pom
[INFO] Downloaded: https://repo.maven.apache.org/maven2/org/apache/apache/8/apache-8.pom (14 KB at 857.8 KB/sec)
[INFO] Downloading: http://repository.apache.org/snapshots/org/apache/sling/org.apache.sling.launchpad.integration-tests/12-SNAPSHOT/org.apache.sling.launchpad.integration-tests-12-SNAPSHOT.jar
[INFO] Downloading: http://repository.apache.org/snapshots/org/apache/sling/org.apache.sling.starter/12-SNAPSHOT/org.apache.sling.starter-12-20181020.065851-2.jar
[INFO] Downloading: http://repository.apache.org/snapshots/org/apache/sling/org.apache.sling.launchpad.test-fragment/12-SNAPSHOT/org.apache.sling.launchpad.test-fragment-12-20181021.001545-2.jar
[INFO] Downloading: http://repository.apache.org/snapshots/org/apache/sling/org.apache.sling.launchpad.test-services-war/12-SNAPSHOT/org.apache.sling.launchpad.test-services-war-12-20181019.171426-1.war
[INFO] Downloaded: http://repository.apache.org/snapshots/org/apache/sling/org.apache.sling.launchpad.test-services-war/12-SNAPSHOT/org.apache.sling.launchpad.test-services-war-12-20181019.171426-1.war (14 KB at 48.7 KB/sec)
[INFO] Downloaded: http://repository.apache.org/snapshots/org/apache/sling/org.apache.sling.launchpad.test-fragment/12-SNAPSHOT/org.apache.sling.launchpad.test-fragment-12-20181021.001545-2.jar (9 KB at 31.1 KB/sec)
[INFO] Downloaded: http://repository.apache.org/snapshots/org/apache/sling/org.apache.sling.starter/12-SNAPSHOT/org.apache.sling.starter-12-20181020.065851-2.jar (71851 KB at 24389.3 KB/sec)
[INFO] Downloading: https://repo.maven.apache.org/maven2/org/apache/sling/org.apache.sling.junit.scriptable/1.0.12/org.apache.sling.junit.scriptable-1.0.12.jar
[INFO] Downloading: https://repo.maven.apache.org/maven2/org/apache/jackrabbit/jackrabbit-core/2.1.1/jackrabbit-core-2.1.1.jar
[INFO] Downloading: https://repo.maven.apache.org/maven2/commons-dbcp/commons-dbcp/1.2.2/commons-dbcp-1.2.2.jar
[INFO] Downloading: https://repo.maven.apache.org/maven2/commons-pool/commons-pool/1.3/commons-pool-1.3.jar
[INFO] Downloading: https://repo.maven.apache.org/maven2/org/apache/sling/org.apache.sling.testing.samples.failingtests/1.0.6/org.apache.sling.testing.samples.failingtests-1.0.6.jar
[INFO] Downloaded: https://repo.maven.apache.org/maven2/org/apache/sling/org.apache.sling.junit.scriptable/1.0.12/org.apache.sling.junit.scriptable-1.0.12.jar (24 KB at 813.4 KB/sec)
[INFO] Downloading: https://repo.maven.apache.org/maven2/org/apache/sling/org.apache.sling.scripting.sightly.compiler.java/1.0.26-1.4.0/org.apache.sling.scripting.sightly.compiler.java-1.0.26-1.4.0.jar
[INFO] Downloaded: https://repo.maven.apache.org/maven2/org/apache/sling/org.apache.sling.testing.samples.failingtests/1.0.6/org.apache.sling.testing.samples.failingtests-1.0.6.jar (11 KB at 214.5 KB/sec)
[INFO] Downloading: https://repo.maven.apache.org/maven2/org/apache/sling/org.apache.sling.scripting.sightly.compiler/1.0.22-1.4.0/org.apache.sling.scripting.sightly.compiler-1.0.22-1.4.0.jar
[INFO] Downloaded: https://repo.maven.apache.org/maven2/org/apache/sling/org.apache.sling.scripting.sightly.compiler.java/1.0.26-1.4.0/org.apache.sling.scripting.sightly.compiler.java-1.0.26-1.4.0.jar (86 KB at 1584.9 KB/sec)
[INFO] Downloading: https://repo.maven.apache.org/maven2/org/antlr/antlr4-runtime/4.1/antlr4-runtime-4.1.jar
[INFO] Downloaded: https://repo.maven.apache.org/maven2/commons-pool/commons-pool/1.3/commons-pool-1.3.jar (61 KB at 748.5 KB/sec)
[INFO] Downloading: https://repo.maven.apache.org/maven2/org/abego/treelayout/org.abego.treelayout.core/1.0.1/org.abego.treelayout.core-1.0.1.jar
[INFO] Downloaded: https://repo.maven.apache.org/maven2/org/abego/treelayout/org.abego.treelayout.core/1.0.1/org.abego.treelayout.core-1.0.1.jar (25 KB at 256.9 KB/sec)
[INFO] Downloading: https://repo.maven.apache.org/maven2/org/apache/sling/org.apache.sling.scripting.sightly.js.provider/1.0.26/org.apache.sling.scripting.sightly.js.provider-1.0.26.jar
[INFO] Downloaded: https://repo.maven.apache.org/maven2/org/antlr/antlr4-runtime/4.1/antlr4-runtime-4.1.jar (247 KB at 2519.4 KB/sec)
[INFO] Downloaded: https://repo.maven.apache.org/maven2/commons-dbcp/commons-dbcp/1.2.2/commons-dbcp-1.2.2.jar (119 KB at 668.0 KB/sec)
[INFO] Downloaded: https://repo.maven.apache.org/maven2/org/apache/sling/org.apache.sling.scripting.sightly.js.provider/1.0.26/org.apache.sling.scripting.sightly.js.provider-1.0.26.jar (78 KB at 393.8 KB/sec)
[INFO] Downloaded: https://repo.maven.apache.org/maven2/org/apache/sling/org.apache.sling.scripting.sightly.compiler/1.0.22-1.4.0/org.apache.sling.scripting.sightly.compiler-1.0.22-1.4.0.jar (533 KB at 2441.3 KB/sec)
[INFO] Downloaded: https://repo.maven.apache.org/maven2/org/apache/jackrabbit/jackrabbit-core/2.1.1/jackrabbit-core-2.1.1.jar (1947 KB at 7183.1 KB/sec)
[WARNING] Attempt to (de-)serialize anonymous class hudson.maven.reporters.MavenArtifactArchiver$2; see: https://jenkins.io/redirect/serialization-of-anonymous-classes/
[JENKINS] Archiving disabled
[WARNING] Attempt to (de-)serialize anonymous class hudson.maven.reporters.MavenFingerprinter$1; see: https://jenkins.io/redirect/serialization-of-anonymous-classes/
[JENKINS] Archiving disabled
[INFO] ------------------------------------------------------------------------
[INFO] BUILD FAILURE
[INFO] ------------------------------------------------------------------------
[INFO] Total time: 17.525 s
[INFO] Finished at: 2018-10-22T06:26:55+00:00
[INFO] Final Memory: 32M/4096M
[INFO] ------------------------------------------------------------------------
Waiting for Jenkins to finish collecting data
[ERROR] Failed to execute goal on project org.apache.sling.launchpad.testing: Could not resolve dependencies for project org.apache.sling:org.apache.sling.launchpad.testing:slingstart:12-SNAPSHOT: Could not find artifact org.apache.sling:org.apache.sling.launchpad.integration-tests:jar:12-SNAPSHOT in Nexus (http://repository.apache.org/snapshots) -> [Help 1]
[ERROR]
[ERROR] To see the full stack trace of the errors, re-run Maven with the -e switch.
[ERROR] Re-run Maven using the -X switch to enable full debug logging.
[ERROR]
[ERROR] For more information about the errors and possible solutions, please read the following articles:
[ERROR] [Help 1] http://cwiki.apache.org/confluence/display/MAVEN/DependencyResolutionException
channel stopped
Archiving artifacts
Recording test results
Build failed in Jenkins:
sling-org-apache-sling-launchpad-testing-11 #41
Posted by Apache Jenkins Server <je...@builds.apache.org>.
See <https://builds.apache.org/job/sling-org-apache-sling-launchpad-testing-11/41/display/redirect>
------------------------------------------
[...truncated 325.64 KB...]
[INFO] Downloaded: https://repo.maven.apache.org/maven2/com/github/virtuald/curvesapi/1.04/curvesapi-1.04.jar (97 KB at 51.5 KB/sec)
[INFO] Downloading: https://repo.maven.apache.org/maven2/org/ccil/cowan/tagsoup/tagsoup/1.2.1/tagsoup-1.2.1.jar
[INFO] Downloaded: https://repo.maven.apache.org/maven2/org/apache/poi/poi/4.0.0/poi-4.0.0.jar (2653 KB at 1415.9 KB/sec)
[INFO] Downloading: https://repo.maven.apache.org/maven2/org/ow2/asm/asm/6.2/asm-6.2.jar
[INFO] Downloaded: https://repo.maven.apache.org/maven2/org/ccil/cowan/tagsoup/tagsoup/1.2.1/tagsoup-1.2.1.jar (89 KB at 47.0 KB/sec)
[INFO] Downloading: https://repo.maven.apache.org/maven2/com/googlecode/mp4parser/isoparser/1.1.22/isoparser-1.1.22.jar
[INFO] Downloaded: https://repo.maven.apache.org/maven2/org/ow2/asm/asm/6.2/asm-6.2.jar (109 KB at 57.2 KB/sec)
[INFO] Downloading: https://repo.maven.apache.org/maven2/com/drewnoakes/metadata-extractor/2.11.0/metadata-extractor-2.11.0.jar
[INFO] Downloaded: https://repo.maven.apache.org/maven2/org/bouncycastle/bcprov-jdk15on/1.60/bcprov-jdk15on-1.60.jar (4092 KB at 2128.9 KB/sec)
[INFO] Downloading: https://repo.maven.apache.org/maven2/com/adobe/xmp/xmpcore/5.1.3/xmpcore-5.1.3.jar
[INFO] Downloaded: https://repo.maven.apache.org/maven2/com/adobe/xmp/xmpcore/5.1.3/xmpcore-5.1.3.jar (90 KB at 46.0 KB/sec)
[INFO] Downloading: https://repo.maven.apache.org/maven2/de/l3s/boilerpipe/boilerpipe/1.1.0/boilerpipe-1.1.0.jar
[INFO] Downloaded: https://repo.maven.apache.org/maven2/com/drewnoakes/metadata-extractor/2.11.0/metadata-extractor-2.11.0.jar (657 KB at 336.5 KB/sec)
[INFO] Downloading: https://repo.maven.apache.org/maven2/com/rometools/rome/1.5.1/rome-1.5.1.jar
[INFO] Downloaded: https://repo.maven.apache.org/maven2/com/googlecode/mp4parser/isoparser/1.1.22/isoparser-1.1.22.jar (1037 KB at 530.5 KB/sec)
[INFO] Downloading: https://repo.maven.apache.org/maven2/com/rometools/rome-utils/1.5.1/rome-utils-1.5.1.jar
[INFO] Downloaded: https://repo.maven.apache.org/maven2/org/apache/xmlbeans/xmlbeans/3.0.1/xmlbeans-3.0.1.jar (2522 KB at 1284.7 KB/sec)
[INFO] Downloading: https://repo.maven.apache.org/maven2/org/gagravarr/vorbis-java-core/0.8/vorbis-java-core-0.8.jar
[INFO] Downloaded: https://repo.maven.apache.org/maven2/com/rometools/rome-utils/1.5.1/rome-utils-1.5.1.jar (7 KB at 3.4 KB/sec)
[INFO] Downloading: https://repo.maven.apache.org/maven2/com/googlecode/juniversalchardet/juniversalchardet/1.0.3/juniversalchardet-1.0.3.jar
[INFO] Downloaded: https://repo.maven.apache.org/maven2/de/l3s/boilerpipe/boilerpipe/1.1.0/boilerpipe-1.1.0.jar (90 KB at 45.6 KB/sec)
[INFO] Downloading: https://repo.maven.apache.org/maven2/org/codelibs/jhighlight/1.0.3/jhighlight-1.0.3.jar
[INFO] Downloaded: https://repo.maven.apache.org/maven2/com/rometools/rome/1.5.1/rome-1.5.1.jar (238 KB at 119.9 KB/sec)
[INFO] Downloading: https://repo.maven.apache.org/maven2/com/pff/java-libpst/0.8.1/java-libpst-0.8.1.jar
[INFO] Downloaded: https://repo.maven.apache.org/maven2/org/gagravarr/vorbis-java-core/0.8/vorbis-java-core-0.8.jar (119 KB at 59.5 KB/sec)
[INFO] Downloading: https://repo.maven.apache.org/maven2/com/github/junrar/junrar/2.0.0/junrar-2.0.0.jar
[INFO] Downloaded: https://repo.maven.apache.org/maven2/com/googlecode/juniversalchardet/juniversalchardet/1.0.3/juniversalchardet-1.0.3.jar (216 KB at 108.3 KB/sec)
[INFO] Downloading: https://repo.maven.apache.org/maven2/org/apache/cxf/cxf-rt-rs-client/3.2.6/cxf-rt-rs-client-3.2.6.jar
[INFO] Downloaded: https://repo.maven.apache.org/maven2/org/codelibs/jhighlight/1.0.3/jhighlight-1.0.3.jar (229 KB at 114.6 KB/sec)
[INFO] Downloading: https://repo.maven.apache.org/maven2/org/apache/cxf/cxf-rt-transports-http/3.2.6/cxf-rt-transports-http-3.2.6.jar
[INFO] Downloaded: https://repo.maven.apache.org/maven2/com/pff/java-libpst/0.8.1/java-libpst-0.8.1.jar (84 KB at 41.8 KB/sec)
[INFO] Downloading: https://repo.maven.apache.org/maven2/org/apache/cxf/cxf-core/3.2.6/cxf-core-3.2.6.jar
[INFO] Downloaded: https://repo.maven.apache.org/maven2/org/apache/cxf/cxf-rt-rs-client/3.2.6/cxf-rt-rs-client-3.2.6.jar (176 KB at 87.1 KB/sec)
[INFO] Downloading: https://repo.maven.apache.org/maven2/com/fasterxml/woodstox/woodstox-core/5.1.0/woodstox-core-5.1.0.jar
[INFO] Downloaded: https://repo.maven.apache.org/maven2/com/github/junrar/junrar/2.0.0/junrar-2.0.0.jar (160 KB at 79.3 KB/sec)
[INFO] Downloading: https://repo.maven.apache.org/maven2/org/codehaus/woodstox/stax2-api/4.1/stax2-api-4.1.jar
[INFO] Downloaded: https://repo.maven.apache.org/maven2/org/apache/cxf/cxf-rt-transports-http/3.2.6/cxf-rt-transports-http-3.2.6.jar (355 KB at 175.2 KB/sec)
[INFO] Downloading: https://repo.maven.apache.org/maven2/org/apache/ws/xmlschema/xmlschema-core/2.2.3/xmlschema-core-2.2.3.jar
[INFO] Downloaded: https://repo.maven.apache.org/maven2/org/codehaus/woodstox/stax2-api/4.1/stax2-api-4.1.jar (166 KB at 81.0 KB/sec)
[INFO] Downloading: https://repo.maven.apache.org/maven2/org/apache/cxf/cxf-rt-frontend-jaxrs/3.2.6/cxf-rt-frontend-jaxrs-3.2.6.jar
[INFO] Downloaded: https://repo.maven.apache.org/maven2/org/apache/ws/xmlschema/xmlschema-core/2.2.3/xmlschema-core-2.2.3.jar (169 KB at 82.6 KB/sec)
[INFO] Downloading: https://repo.maven.apache.org/maven2/javax/ws/rs/javax.ws.rs-api/2.1/javax.ws.rs-api-2.1.jar
[INFO] Downloaded: https://repo.maven.apache.org/maven2/com/fasterxml/woodstox/woodstox-core/5.1.0/woodstox-core-5.1.0.jar (502 KB at 244.7 KB/sec)
[INFO] Downloading: https://repo.maven.apache.org/maven2/javax/annotation/javax.annotation-api/1.3/javax.annotation-api-1.3.jar
[INFO] Downloaded: https://repo.maven.apache.org/maven2/org/apache/cxf/cxf-core/3.2.6/cxf-core-3.2.6.jar (1368 KB at 665.5 KB/sec)
[INFO] Downloading: https://repo.maven.apache.org/maven2/org/apache/commons/commons-exec/1.3/commons-exec-1.3.jar
[INFO] Downloaded: https://repo.maven.apache.org/maven2/javax/ws/rs/javax.ws.rs-api/2.1/javax.ws.rs-api-2.1.jar (125 KB at 60.3 KB/sec)
[INFO] Downloading: https://repo.maven.apache.org/maven2/org/apache/opennlp/opennlp-tools/1.9.0/opennlp-tools-1.9.0.jar
[INFO] Downloaded: https://repo.maven.apache.org/maven2/javax/annotation/javax.annotation-api/1.3/javax.annotation-api-1.3.jar (26 KB at 12.5 KB/sec)
[INFO] Downloading: https://repo.maven.apache.org/maven2/com/googlecode/json-simple/json-simple/1.1.1/json-simple-1.1.1.jar
[INFO] Downloaded: https://repo.maven.apache.org/maven2/org/apache/commons/commons-exec/1.3/commons-exec-1.3.jar (54 KB at 25.7 KB/sec)
[INFO] Downloading: https://repo.maven.apache.org/maven2/com/github/openjson/openjson/1.0.10/openjson-1.0.10.jar
[INFO] Downloaded: https://repo.maven.apache.org/maven2/org/apache/cxf/cxf-rt-frontend-jaxrs/3.2.6/cxf-rt-frontend-jaxrs-3.2.6.jar (665 KB at 318.9 KB/sec)
[INFO] Downloading: https://repo.maven.apache.org/maven2/com/google/code/gson/gson/2.8.5/gson-2.8.5.jar
[INFO] Downloaded: https://repo.maven.apache.org/maven2/com/googlecode/json-simple/json-simple/1.1.1/json-simple-1.1.1.jar (24 KB at 11.2 KB/sec)
[INFO] Downloading: https://repo.maven.apache.org/maven2/org/slf4j/jul-to-slf4j/1.7.25/jul-to-slf4j-1.7.25.jar
[INFO] Downloaded: https://repo.maven.apache.org/maven2/com/github/openjson/openjson/1.0.10/openjson-1.0.10.jar (27 KB at 12.8 KB/sec)
[INFO] Downloading: https://repo.maven.apache.org/maven2/edu/ucar/netcdf4/4.5.5/netcdf4-4.5.5.jar
[INFO] Downloaded: https://repo.maven.apache.org/maven2/org/slf4j/jul-to-slf4j/1.7.25/jul-to-slf4j-1.7.25.jar (5 KB at 2.1 KB/sec)
[INFO] Downloading: https://repo.maven.apache.org/maven2/net/jcip/jcip-annotations/1.0/jcip-annotations-1.0.jar
[INFO] Downloaded: https://repo.maven.apache.org/maven2/edu/ucar/netcdf4/4.5.5/netcdf4-4.5.5.jar (61 KB at 28.7 KB/sec)
[INFO] Downloading: https://repo.maven.apache.org/maven2/edu/ucar/grib/4.5.5/grib-4.5.5.jar
[INFO] Downloaded: https://repo.maven.apache.org/maven2/com/google/code/gson/gson/2.8.5/gson-2.8.5.jar (236 KB at 111.8 KB/sec)
[INFO] Downloading: https://repo.maven.apache.org/maven2/com/google/protobuf/protobuf-java/2.5.0/protobuf-java-2.5.0.jar
[INFO] Downloaded: https://repo.maven.apache.org/maven2/org/apache/opennlp/opennlp-tools/1.9.0/opennlp-tools-1.9.0.jar (1217 KB at 574.4 KB/sec)
[INFO] Downloading: https://repo.maven.apache.org/maven2/org/itadaki/bzip2/0.9.1/bzip2-0.9.1.jar
[INFO] Downloaded: https://repo.maven.apache.org/maven2/net/jcip/jcip-annotations/1.0/jcip-annotations-1.0.jar (3 KB at 1.0 KB/sec)
[INFO] Downloading: https://repo.maven.apache.org/maven2/net/java/dev/jna/jna/4.3.0/jna-4.3.0.jar
[INFO] Downloaded: https://repo.maven.apache.org/maven2/org/apache/poi/poi-ooxml-schemas/4.0.0/poi-ooxml-schemas-4.0.0.jar (6326 KB at 2962.8 KB/sec)
[INFO] Downloading: https://repo.maven.apache.org/maven2/org/jsoup/jsoup/1.11.3/jsoup-1.11.3.jar
[INFO] Downloaded: https://repo.maven.apache.org/maven2/org/itadaki/bzip2/0.9.1/bzip2-0.9.1.jar (49 KB at 22.7 KB/sec)
[INFO] Downloading: https://repo.maven.apache.org/maven2/edu/ucar/cdm/4.5.5/cdm-4.5.5.jar
[INFO] Downloaded: https://repo.maven.apache.org/maven2/com/google/protobuf/protobuf-java/2.5.0/protobuf-java-2.5.0.jar (521 KB at 242.0 KB/sec)
[INFO] Downloading: https://repo.maven.apache.org/maven2/edu/ucar/udunits/4.5.5/udunits-4.5.5.jar
[INFO] Downloaded: https://repo.maven.apache.org/maven2/org/jsoup/jsoup/1.11.3/jsoup-1.11.3.jar (387 KB at 177.7 KB/sec)
[INFO] Downloading: https://repo.maven.apache.org/maven2/joda-time/joda-time/2.2/joda-time-2.2.jar
[INFO] Downloaded: https://repo.maven.apache.org/maven2/edu/ucar/udunits/4.5.5/udunits-4.5.5.jar (122 KB at 55.9 KB/sec)
[INFO] Downloading: https://repo.maven.apache.org/maven2/net/sf/ehcache/ehcache-core/2.6.2/ehcache-core-2.6.2.jar
[INFO] Downloaded: https://repo.maven.apache.org/maven2/net/java/dev/jna/jna/4.3.0/jna-4.3.0.jar (924 KB at 423.4 KB/sec)
[INFO] Downloading: https://repo.maven.apache.org/maven2/com/beust/jcommander/1.35/jcommander-1.35.jar
[INFO] Downloaded: https://repo.maven.apache.org/maven2/com/beust/jcommander/1.35/jcommander-1.35.jar (60 KB at 26.9 KB/sec)
[INFO] Downloading: https://repo.maven.apache.org/maven2/edu/ucar/httpservices/4.5.5/httpservices-4.5.5.jar
[INFO] Downloaded: https://repo.maven.apache.org/maven2/joda-time/joda-time/2.2/joda-time-2.2.jar (561 KB at 252.0 KB/sec)
[INFO] Downloading: https://repo.maven.apache.org/maven2/org/apache/commons/commons-csv/1.5/commons-csv-1.5.jar
[INFO] Downloaded: https://repo.maven.apache.org/maven2/edu/ucar/httpservices/4.5.5/httpservices-4.5.5.jar (61 KB at 27.0 KB/sec)
[INFO] Downloading: https://repo.maven.apache.org/maven2/org/apache/sis/core/sis-utility/0.8/sis-utility-0.8.jar
[INFO] Downloaded: https://repo.maven.apache.org/maven2/org/apache/commons/commons-csv/1.5/commons-csv-1.5.jar (41 KB at 18.1 KB/sec)
[INFO] Downloading: https://repo.maven.apache.org/maven2/javax/measure/unit-api/1.0/unit-api-1.0.jar
[INFO] Downloaded: https://repo.maven.apache.org/maven2/net/sf/ehcache/ehcache-core/2.6.2/ehcache-core-2.6.2.jar (1307 KB at 579.2 KB/sec)
[INFO] Downloading: https://repo.maven.apache.org/maven2/org/apache/sis/storage/sis-netcdf/0.8/sis-netcdf-0.8.jar
[INFO] Downloaded: https://repo.maven.apache.org/maven2/javax/measure/unit-api/1.0/unit-api-1.0.jar (28 KB at 12.0 KB/sec)
[INFO] Downloading: https://repo.maven.apache.org/maven2/org/apache/sis/storage/sis-storage/0.8/sis-storage-0.8.jar
[INFO] Downloaded: https://repo.maven.apache.org/maven2/org/apache/sis/storage/sis-netcdf/0.8/sis-netcdf-0.8.jar (72 KB at 31.3 KB/sec)
[INFO] Downloading: https://repo.maven.apache.org/maven2/org/apache/sis/core/sis-feature/0.8/sis-feature-0.8.jar
[INFO] Downloaded: https://repo.maven.apache.org/maven2/org/apache/sis/core/sis-utility/0.8/sis-utility-0.8.jar (813 KB at 356.7 KB/sec)
[INFO] Downloading: https://repo.maven.apache.org/maven2/org/apache/sis/core/sis-referencing/0.8/sis-referencing-0.8.jar
[INFO] Downloaded: https://repo.maven.apache.org/maven2/org/apache/sis/storage/sis-storage/0.8/sis-storage-0.8.jar (189 KB at 82.2 KB/sec)
[INFO] Downloading: https://repo.maven.apache.org/maven2/org/apache/sis/core/sis-metadata/0.8/sis-metadata-0.8.jar
[INFO] Downloaded: https://repo.maven.apache.org/maven2/org/apache/sis/core/sis-feature/0.8/sis-feature-0.8.jar (141 KB at 61.3 KB/sec)
[INFO] Downloading: https://repo.maven.apache.org/maven2/org/opengis/geoapi/3.0.1/geoapi-3.0.1.jar
[INFO] Downloaded: https://repo.maven.apache.org/maven2/edu/ucar/cdm/4.5.5/cdm-4.5.5.jar (4084 KB at 1775.6 KB/sec)
[INFO] Downloading: https://repo.maven.apache.org/maven2/edu/usc/ir/sentiment-analysis-parser/0.1/sentiment-analysis-parser-0.1.jar
[INFO] Downloaded: https://repo.maven.apache.org/maven2/edu/ucar/grib/4.5.5/grib-4.5.5.jar (5007 KB at 2172.9 KB/sec)
[INFO] Downloading: https://repo.maven.apache.org/maven2/org/apache/uima/uimafit-core/2.2.0/uimafit-core-2.2.0.jar
[INFO] Downloaded: https://repo.maven.apache.org/maven2/edu/usc/ir/sentiment-analysis-parser/0.1/sentiment-analysis-parser-0.1.jar (29 KB at 12.1 KB/sec)
[INFO] Downloading: https://repo.maven.apache.org/maven2/org/apache/uima/uimaj-core/2.9.0/uimaj-core-2.9.0.jar
[INFO] Downloaded: https://repo.maven.apache.org/maven2/org/apache/uima/uimafit-core/2.2.0/uimafit-core-2.2.0.jar (168 KB at 72.3 KB/sec)
[INFO] Downloading: https://repo.maven.apache.org/maven2/org/jdom/jdom2/2.0.6/jdom2-2.0.6.jar
[INFO] Downloaded: https://repo.maven.apache.org/maven2/org/apache/sis/core/sis-referencing/0.8/sis-referencing-0.8.jar (1093 KB at 470.2 KB/sec)
[INFO] Downloading: https://repo.maven.apache.org/maven2/org/apache/pdfbox/jbig2-imageio/3.0.2/jbig2-imageio-3.0.2.jar
[INFO] Downloaded: https://repo.maven.apache.org/maven2/org/opengis/geoapi/3.0.1/geoapi-3.0.1.jar (212 KB at 91.0 KB/sec)
[INFO] Downloading: https://repo.maven.apache.org/maven2/com/github/jai-imageio/jai-imageio-core/1.4.0/jai-imageio-core-1.4.0.jar
[INFO] Downloaded: https://repo.maven.apache.org/maven2/org/apache/sis/core/sis-metadata/0.8/sis-metadata-0.8.jar (628 KB at 269.6 KB/sec)
[INFO] Downloading: https://repo.maven.apache.org/maven2/com/google/guava/guava/15.0/guava-15.0.jar
[INFO] Downloaded: https://repo.maven.apache.org/maven2/org/apache/pdfbox/jbig2-imageio/3.0.2/jbig2-imageio-3.0.2.jar (149 KB at 63.0 KB/sec)
[INFO] Downloading: https://repo.maven.apache.org/maven2/io/dropwizard/metrics/metrics-core/3.2.6/metrics-core-3.2.6.jar
[INFO] Downloaded: https://repo.maven.apache.org/maven2/org/jdom/jdom2/2.0.6/jdom2-2.0.6.jar (298 KB at 126.2 KB/sec)
[INFO] Downloading: https://repo.maven.apache.org/maven2/org/apache/jackrabbit/jackrabbit-api/2.16.3/jackrabbit-api-2.16.3.jar
[INFO] Downloaded: https://repo.maven.apache.org/maven2/com/github/jai-imageio/jai-imageio-core/1.4.0/jai-imageio-core-1.4.0.jar (614 KB at 258.5 KB/sec)
[INFO] Downloading: https://repo.maven.apache.org/maven2/org/jetbrains/annotations/16.0.2/annotations-16.0.2.jar
[INFO] Downloaded: https://repo.maven.apache.org/maven2/io/dropwizard/metrics/metrics-core/3.2.6/metrics-core-3.2.6.jar (134 KB at 56.1 KB/sec)
[INFO] Downloading: https://repo.maven.apache.org/maven2/org/apache/jackrabbit/jackrabbit-data/2.16.3/jackrabbit-data-2.16.3.jar
[INFO] Downloaded: https://repo.maven.apache.org/maven2/org/apache/jackrabbit/jackrabbit-api/2.16.3/jackrabbit-api-2.16.3.jar (42 KB at 17.5 KB/sec)
[INFO] Downloading: https://repo.maven.apache.org/maven2/org/apache/jackrabbit/jackrabbit-jcr-commons/2.16.3/jackrabbit-jcr-commons-2.16.3.jar
[INFO] Downloaded: https://repo.maven.apache.org/maven2/org/jetbrains/annotations/16.0.2/annotations-16.0.2.jar (19 KB at 7.6 KB/sec)
[INFO] Downloading: https://repo.maven.apache.org/maven2/org/apache/jackrabbit/jackrabbit-jcr-rmi/2.16.3/jackrabbit-jcr-rmi-2.16.3.jar
[INFO] Downloaded: https://repo.maven.apache.org/maven2/org/apache/jackrabbit/jackrabbit-data/2.16.3/jackrabbit-data-2.16.3.jar (169 KB at 70.2 KB/sec)
[INFO] Downloading: https://repo.maven.apache.org/maven2/org/apache/jackrabbit/jackrabbit-spi-commons/2.16.3/jackrabbit-spi-commons-2.16.3.jar
[INFO] Downloaded: https://repo.maven.apache.org/maven2/org/apache/uima/uimaj-core/2.9.0/uimaj-core-2.9.0.jar (1554 KB at 643.6 KB/sec)
[INFO] Downloading: https://repo.maven.apache.org/maven2/org/apache/jackrabbit/jackrabbit-spi/2.16.3/jackrabbit-spi-2.16.3.jar
[INFO] Downloaded: https://repo.maven.apache.org/maven2/org/apache/jackrabbit/jackrabbit-jcr-commons/2.16.3/jackrabbit-jcr-commons-2.16.3.jar (394 KB at 163.1 KB/sec)
[INFO] Downloading: https://repo.maven.apache.org/maven2/org/apache/jackrabbit/jackrabbit-webdav/2.16.3/jackrabbit-webdav-2.16.3.jar
[INFO] Downloaded: https://repo.maven.apache.org/maven2/org/apache/jackrabbit/jackrabbit-jcr-rmi/2.16.3/jackrabbit-jcr-rmi-2.16.3.jar (227 KB at 93.5 KB/sec)
[INFO] Downloading: https://repo.maven.apache.org/maven2/org/apache/sling/org.apache.sling.commons.metrics/1.2.6/org.apache.sling.commons.metrics-1.2.6.jar
[INFO] Downloaded: https://repo.maven.apache.org/maven2/com/google/guava/guava/15.0/guava-15.0.jar (2122 KB at 872.2 KB/sec)
[INFO] Downloading: https://repo.maven.apache.org/maven2/org/apache/sling/org.apache.sling.jcr.api/2.4.0/org.apache.sling.jcr.api-2.4.0.jar
[INFO] Downloaded: https://repo.maven.apache.org/maven2/org/apache/jackrabbit/jackrabbit-spi/2.16.3/jackrabbit-spi-2.16.3.jar (28 KB at 11.4 KB/sec)
[INFO] Downloading: https://repo.maven.apache.org/maven2/org/apache/sling/org.apache.sling.jcr.base/3.0.4/org.apache.sling.jcr.base-3.0.4.jar
[INFO] Downloaded: https://repo.maven.apache.org/maven2/org/apache/sling/org.apache.sling.commons.metrics/1.2.6/org.apache.sling.commons.metrics-1.2.6.jar (63 KB at 25.8 KB/sec)
[INFO] Downloading: https://repo.maven.apache.org/maven2/org/apache/sling/org.apache.sling.jcr.davex/1.3.10/org.apache.sling.jcr.davex-1.3.10.jar
[INFO] Downloaded: https://repo.maven.apache.org/maven2/org/apache/jackrabbit/jackrabbit-webdav/2.16.3/jackrabbit-webdav-2.16.3.jar (319 KB at 130.4 KB/sec)
[INFO] Downloading: https://repo.maven.apache.org/maven2/org/apache/sling/org.apache.sling.jcr.jackrabbit.accessmanager/3.0.2/org.apache.sling.jcr.jackrabbit.accessmanager-3.0.2.jar
[INFO] Downloaded: https://repo.maven.apache.org/maven2/org/apache/sling/org.apache.sling.jcr.api/2.4.0/org.apache.sling.jcr.api-2.4.0.jar (14 KB at 5.4 KB/sec)
[INFO] Downloading: https://repo.maven.apache.org/maven2/org/apache/sling/org.apache.sling.jcr.jackrabbit.usermanager/2.2.8/org.apache.sling.jcr.jackrabbit.usermanager-2.2.8.jar
[INFO] Downloaded: https://repo.maven.apache.org/maven2/org/apache/jackrabbit/jackrabbit-spi-commons/2.16.3/jackrabbit-spi-commons-2.16.3.jar (785 KB at 320.3 KB/sec)
[INFO] Downloading: https://repo.maven.apache.org/maven2/org/apache/sling/org.apache.sling.jcr.jcr-wrapper/2.0.0/org.apache.sling.jcr.jcr-wrapper-2.0.0.jar
[INFO] Downloaded: https://repo.maven.apache.org/maven2/org/apache/sling/org.apache.sling.jcr.base/3.0.4/org.apache.sling.jcr.base-3.0.4.jar (60 KB at 24.1 KB/sec)
[INFO] Downloading: https://repo.maven.apache.org/maven2/org/apache/sling/org.apache.sling.jcr.registration/1.0.6/org.apache.sling.jcr.registration-1.0.6.jar
[INFO] Downloaded: https://repo.maven.apache.org/maven2/org/apache/sling/org.apache.sling.jcr.jackrabbit.accessmanager/3.0.2/org.apache.sling.jcr.jackrabbit.accessmanager-3.0.2.jar (51 KB at 20.4 KB/sec)
[INFO] Downloading: https://repo.maven.apache.org/maven2/org/apache/sling/org.apache.sling.jcr.webconsole/1.0.2/org.apache.sling.jcr.webconsole-1.0.2.jar
[INFO] Downloaded: https://repo.maven.apache.org/maven2/org/apache/sling/org.apache.sling.jcr.davex/1.3.10/org.apache.sling.jcr.davex-1.3.10.jar (268 KB at 108.5 KB/sec)
[INFO] Downloading: https://repo.maven.apache.org/maven2/org/apache/sling/org.apache.sling.jcr.webdav/2.3.8/org.apache.sling.jcr.webdav-2.3.8.jar
[INFO] Downloaded: https://repo.maven.apache.org/maven2/org/apache/sling/org.apache.sling.jcr.jackrabbit.usermanager/2.2.8/org.apache.sling.jcr.jackrabbit.usermanager-2.2.8.jar (94 KB at 37.8 KB/sec)
[INFO] Downloading: https://repo.maven.apache.org/maven2/org/apache/sling/org.apache.sling.caconfig.api/1.1.2/org.apache.sling.caconfig.api-1.1.2.jar
[INFO] Downloaded: https://repo.maven.apache.org/maven2/org/apache/sling/org.apache.sling.jcr.jcr-wrapper/2.0.0/org.apache.sling.jcr.jcr-wrapper-2.0.0.jar (73 KB at 29.5 KB/sec)
[INFO] Downloading: https://repo.maven.apache.org/maven2/org/apache/sling/org.apache.sling.caconfig.impl/1.4.14/org.apache.sling.caconfig.impl-1.4.14.jar
[INFO] Downloaded: https://repo.maven.apache.org/maven2/org/apache/sling/org.apache.sling.jcr.registration/1.0.6/org.apache.sling.jcr.registration-1.0.6.jar (33 KB at 13.2 KB/sec)
[INFO] Downloading: https://repo.maven.apache.org/maven2/org/apache/sling/org.apache.sling.caconfig.spi/1.3.4/org.apache.sling.caconfig.spi-1.3.4.jar
[INFO] Downloaded: https://repo.maven.apache.org/maven2/org/apache/sling/org.apache.sling.jcr.webconsole/1.0.2/org.apache.sling.jcr.webconsole-1.0.2.jar (20 KB at 7.7 KB/sec)
[INFO] Downloading: https://repo.maven.apache.org/maven2/org/apache/sling/org.apache.sling.discovery.api/1.0.4/org.apache.sling.discovery.api-1.0.4.jar
[INFO] Downloaded: https://repo.maven.apache.org/maven2/org/apache/sling/org.apache.sling.caconfig.api/1.1.2/org.apache.sling.caconfig.api-1.1.2.jar (13 KB at 5.1 KB/sec)
[INFO] Downloading: https://repo.maven.apache.org/maven2/org/apache/sling/org.apache.sling.discovery.base/2.0.8/org.apache.sling.discovery.base-2.0.8.jar
[INFO] Downloaded: https://repo.maven.apache.org/maven2/org/apache/sling/org.apache.sling.jcr.webdav/2.3.8/org.apache.sling.jcr.webdav-2.3.8.jar (163 KB at 65.4 KB/sec)
[INFO] Downloading: https://repo.maven.apache.org/maven2/org/apache/sling/org.apache.sling.discovery.commons/1.0.20/org.apache.sling.discovery.commons-1.0.20.jar
[INFO] Downloaded: https://repo.maven.apache.org/maven2/org/apache/sling/org.apache.sling.caconfig.impl/1.4.14/org.apache.sling.caconfig.impl-1.4.14.jar (201 KB at 80.6 KB/sec)
[INFO] Downloading: https://repo.maven.apache.org/maven2/org/apache/sling/org.apache.sling.discovery.oak/1.2.28/org.apache.sling.discovery.oak-1.2.28.jar
[INFO] Downloaded: https://repo.maven.apache.org/maven2/org/apache/sling/org.apache.sling.caconfig.spi/1.3.4/org.apache.sling.caconfig.spi-1.3.4.jar (26 KB at 10.3 KB/sec)
[INFO] Downloading: https://repo.maven.apache.org/maven2/org/apache/sling/org.apache.sling.discovery.support/1.0.4/org.apache.sling.discovery.support-1.0.4.jar
[INFO] Downloaded: https://repo.maven.apache.org/maven2/org/apache/sling/org.apache.sling.discovery.api/1.0.4/org.apache.sling.discovery.api-1.0.4.jar (14 KB at 5.3 KB/sec)
[INFO] Downloading: https://repo.maven.apache.org/maven2/org/apache/sling/org.apache.sling.event.dea/1.1.2/org.apache.sling.event.dea-1.1.2.jar
[INFO] Downloaded: https://repo.maven.apache.org/maven2/org/apache/sling/org.apache.sling.discovery.base/2.0.8/org.apache.sling.discovery.base-2.0.8.jar (84 KB at 33.4 KB/sec)
[INFO] Downloading: https://repo.maven.apache.org/maven2/org/apache/sling/org.apache.sling.event/4.2.12/org.apache.sling.event-4.2.12.jar
[INFO] Downloaded: https://repo.maven.apache.org/maven2/org/apache/sling/org.apache.sling.discovery.commons/1.0.20/org.apache.sling.discovery.commons-1.0.20.jar (91 KB at 36.3 KB/sec)
[INFO] Downloading: https://repo.maven.apache.org/maven2/org/apache/sling/org.apache.sling.event.api/1.0.0/org.apache.sling.event.api-1.0.0.jar
[INFO] Downloaded: https://repo.maven.apache.org/maven2/org/apache/sling/org.apache.sling.discovery.support/1.0.4/org.apache.sling.discovery.support-1.0.4.jar (14 KB at 5.3 KB/sec)
[INFO] Downloading: https://repo.maven.apache.org/maven2/org/apache/sling/org.apache.sling.validation.api/1.0.0/org.apache.sling.validation.api-1.0.0.jar
[INFO] Downloaded: https://repo.maven.apache.org/maven2/org/apache/sling/org.apache.sling.discovery.oak/1.2.28/org.apache.sling.discovery.oak-1.2.28.jar (75 KB at 30.0 KB/sec)
[INFO] Downloading: https://repo.maven.apache.org/maven2/org/apache/sling/org.apache.sling.validation.core/1.0.4/org.apache.sling.validation.core-1.0.4.jar
[INFO] Downloaded: https://repo.maven.apache.org/maven2/org/apache/sling/org.apache.sling.event.dea/1.1.2/org.apache.sling.event.dea-1.1.2.jar (29 KB at 11.4 KB/sec)
[INFO] Downloading: https://repo.maven.apache.org/maven2/org/apache/sling/org.apache.sling.sample.slingshot/0.9.0/org.apache.sling.sample.slingshot-0.9.0.jar
[INFO] Downloaded: https://repo.maven.apache.org/maven2/org/apache/sling/org.apache.sling.event.api/1.0.0/org.apache.sling.event.api-1.0.0.jar (26 KB at 10.1 KB/sec)
[INFO] Downloading: https://repo.maven.apache.org/maven2/org/apache/felix/org.apache.felix.http.jetty/4.0.6/org.apache.felix.http.jetty-4.0.6.jar
[INFO] Downloaded: https://repo.maven.apache.org/maven2/org/apache/sling/org.apache.sling.validation.api/1.0.0/org.apache.sling.validation.api-1.0.0.jar (21 KB at 8.1 KB/sec)
[INFO] Downloading: https://repo.maven.apache.org/maven2/org/eclipse/jetty/jetty-servlet/9.4.12.v20180830/jetty-servlet-9.4.12.v20180830.jar
[INFO] Downloaded: https://repo.maven.apache.org/maven2/org/apache/sling/org.apache.sling.event/4.2.12/org.apache.sling.event-4.2.12.jar (315 KB at 125.4 KB/sec)
[INFO] Downloading: https://repo.maven.apache.org/maven2/org/eclipse/jetty/jetty-server/9.4.12.v20180830/jetty-server-9.4.12.v20180830.jar
[INFO] Downloaded: https://repo.maven.apache.org/maven2/org/apache/sling/org.apache.sling.validation.core/1.0.4/org.apache.sling.validation.core-1.0.4.jar (67 KB at 26.5 KB/sec)
[INFO] Downloading: https://repo.maven.apache.org/maven2/javax/servlet/javax.servlet-api/3.1.0/javax.servlet-api-3.1.0.jar
[INFO] Downloaded: https://repo.maven.apache.org/maven2/org/eclipse/jetty/jetty-servlet/9.4.12.v20180830/jetty-servlet-9.4.12.v20180830.jar (109 KB at 42.7 KB/sec)
[INFO] Downloading: https://repo.maven.apache.org/maven2/org/eclipse/jetty/jetty-http/9.4.12.v20180830/jetty-http-9.4.12.v20180830.jar
[INFO] Downloaded: https://repo.maven.apache.org/maven2/javax/servlet/javax.servlet-api/3.1.0/javax.servlet-api-3.1.0.jar (94 KB at 36.5 KB/sec)
[INFO] Downloading: https://repo.maven.apache.org/maven2/org/eclipse/jetty/jetty-io/9.4.12.v20180830/jetty-io-9.4.12.v20180830.jar
[INFO] Downloaded: https://repo.maven.apache.org/maven2/org/eclipse/jetty/jetty-server/9.4.12.v20180830/jetty-server-9.4.12.v20180830.jar (596 KB at 232.1 KB/sec)
[INFO] Downloading: https://repo.maven.apache.org/maven2/org/eclipse/jetty/jetty-util/9.4.12.v20180830/jetty-util-9.4.12.v20180830.jar
[INFO] Downloaded: https://repo.maven.apache.org/maven2/org/eclipse/jetty/jetty-http/9.4.12.v20180830/jetty-http-9.4.12.v20180830.jar (192 KB at 74.3 KB/sec)
[INFO] Downloading: https://repo.maven.apache.org/maven2/org/eclipse/jetty/jetty-jmx/9.4.12.v20180830/jetty-jmx-9.4.12.v20180830.jar
[INFO] Downloaded: https://repo.maven.apache.org/maven2/org/eclipse/jetty/jetty-io/9.4.12.v20180830/jetty-io-9.4.12.v20180830.jar (137 KB at 52.5 KB/sec)
[INFO] Downloading: https://repo.maven.apache.org/maven2/org/eclipse/jetty/jetty-security/9.4.12.v20180830/jetty-security-9.4.12.v20180830.jar
[INFO] Downloaded: https://repo.maven.apache.org/maven2/org/eclipse/jetty/jetty-jmx/9.4.12.v20180830/jetty-jmx-9.4.12.v20180830.jar (25 KB at 9.5 KB/sec)
[INFO] Downloading: https://repo.maven.apache.org/maven2/org/eclipse/jetty/jetty-webapp/9.4.12.v20180830/jetty-webapp-9.4.12.v20180830.jar
[INFO] Downloaded: https://repo.maven.apache.org/maven2/org/eclipse/jetty/jetty-util/9.4.12.v20180830/jetty-util-9.4.12.v20180830.jar (492 KB at 188.6 KB/sec)
[INFO] Downloading: https://repo.maven.apache.org/maven2/org/eclipse/jetty/jetty-xml/9.4.12.v20180830/jetty-xml-9.4.12.v20180830.jar
[INFO] Downloaded: https://repo.maven.apache.org/maven2/org/eclipse/jetty/jetty-security/9.4.12.v20180830/jetty-security-9.4.12.v20180830.jar (91 KB at 34.7 KB/sec)
[INFO] Downloading: https://repo.maven.apache.org/maven2/org/eclipse/jetty/websocket/websocket-servlet/9.4.12.v20180830/websocket-servlet-9.4.12.v20180830.jar
[INFO] Downloaded: https://repo.maven.apache.org/maven2/org/eclipse/jetty/jetty-webapp/9.4.12.v20180830/jetty-webapp-9.4.12.v20180830.jar (126 KB at 47.8 KB/sec)
[INFO] Downloading: https://repo.maven.apache.org/maven2/org/eclipse/jetty/websocket/websocket-api/9.4.12.v20180830/websocket-api-9.4.12.v20180830.jar
[INFO] Downloaded: https://repo.maven.apache.org/maven2/org/eclipse/jetty/jetty-xml/9.4.12.v20180830/jetty-xml-9.4.12.v20180830.jar (51 KB at 19.3 KB/sec)
[INFO] Downloading: https://repo.maven.apache.org/maven2/org/eclipse/jetty/websocket/websocket-server/9.4.12.v20180830/websocket-server-9.4.12.v20180830.jar
[INFO] Downloaded: https://repo.maven.apache.org/maven2/org/eclipse/jetty/websocket/websocket-servlet/9.4.12.v20180830/websocket-servlet-9.4.12.v20180830.jar (21 KB at 7.9 KB/sec)
[INFO] Downloading: https://repo.maven.apache.org/maven2/org/eclipse/jetty/websocket/websocket-common/9.4.12.v20180830/websocket-common-9.4.12.v20180830.jar
[INFO] Downloaded: https://repo.maven.apache.org/maven2/org/eclipse/jetty/websocket/websocket-api/9.4.12.v20180830/websocket-api-9.4.12.v20180830.jar (43 KB at 16.2 KB/sec)
[INFO] Downloading: https://repo.maven.apache.org/maven2/org/eclipse/jetty/websocket/websocket-client/9.4.12.v20180830/websocket-client-9.4.12.v20180830.jar
[INFO] Downloaded: https://repo.maven.apache.org/maven2/org/eclipse/jetty/websocket/websocket-server/9.4.12.v20180830/websocket-server-9.4.12.v20180830.jar (35 KB at 13.1 KB/sec)
[INFO] Downloading: https://repo.maven.apache.org/maven2/org/eclipse/jetty/jetty-client/9.4.12.v20180830/jetty-client-9.4.12.v20180830.jar
[INFO] Downloaded: https://repo.maven.apache.org/maven2/org/eclipse/jetty/websocket/websocket-client/9.4.12.v20180830/websocket-client-9.4.12.v20180830.jar (36 KB at 13.2 KB/sec)
[INFO] Downloading: https://repo.maven.apache.org/maven2/org/apache/felix/org.apache.felix.http.base/4.0.4/org.apache.felix.http.base-4.0.4.jar
[INFO] Downloaded: https://repo.maven.apache.org/maven2/org/eclipse/jetty/websocket/websocket-common/9.4.12.v20180830/websocket-common-9.4.12.v20180830.jar (193 KB at 71.8 KB/sec)
[INFO] Downloading: https://repo.maven.apache.org/maven2/org/apache/felix/org.apache.felix.http.servlet-api/1.1.2/org.apache.felix.http.servlet-api-1.1.2.jar
[INFO] Downloaded: https://repo.maven.apache.org/maven2/org/apache/felix/org.apache.felix.http.jetty/4.0.6/org.apache.felix.http.jetty-4.0.6.jar (2911 KB at 1086.7 KB/sec)
[INFO] Downloading: https://repo.maven.apache.org/maven2/org/apache/tomcat/tomcat-servlet-api/8.0.9/tomcat-servlet-api-8.0.9.jar
[INFO] Downloaded: https://repo.maven.apache.org/maven2/org/eclipse/jetty/jetty-client/9.4.12.v20180830/jetty-client-9.4.12.v20180830.jar (274 KB at 102.3 KB/sec)
[INFO] Downloading: https://repo.maven.apache.org/maven2/org/apache/felix/org.apache.felix.http.bridge/4.0.4/org.apache.felix.http.bridge-4.0.4.jar
[INFO] Downloaded: https://repo.maven.apache.org/maven2/org/apache/felix/org.apache.felix.http.base/4.0.4/org.apache.felix.http.base-4.0.4.jar (238 KB at 87.6 KB/sec)
[INFO] Downloaded: https://repo.maven.apache.org/maven2/org/apache/tomcat/tomcat-servlet-api/8.0.9/tomcat-servlet-api-8.0.9.jar (239 KB at 87.9 KB/sec)
[INFO] Downloaded: https://repo.maven.apache.org/maven2/org/apache/felix/org.apache.felix.http.servlet-api/1.1.2/org.apache.felix.http.servlet-api-1.1.2.jar (238 KB at 87.6 KB/sec)
[INFO] Downloaded: https://repo.maven.apache.org/maven2/org/apache/felix/org.apache.felix.http.bridge/4.0.4/org.apache.felix.http.bridge-4.0.4.jar (493 KB at 181.1 KB/sec)
[INFO] Downloaded: https://repo.maven.apache.org/maven2/org/apache/sling/org.apache.sling.sample.slingshot/0.9.0/org.apache.sling.sample.slingshot-0.9.0.jar (4952 KB at 1801.2 KB/sec)
[WARNING] Attempt to (de-)serialize anonymous class hudson.maven.reporters.MavenArtifactArchiver$2; see: https://jenkins.io/redirect/serialization-of-anonymous-classes/
[JENKINS] Archiving disabled
[WARNING] Attempt to (de-)serialize anonymous class hudson.maven.reporters.MavenFingerprinter$1; see: https://jenkins.io/redirect/serialization-of-anonymous-classes/
[JENKINS] Archiving disabled
[INFO] ------------------------------------------------------------------------
[INFO] BUILD FAILURE
[INFO] ------------------------------------------------------------------------
[INFO] Total time: 34.963 s
[INFO] Finished at: 2018-10-21T00:18:30+00:00
[INFO] Final Memory: 35M/4096M
[INFO] ------------------------------------------------------------------------
Waiting for Jenkins to finish collecting data
[ERROR] Failed to execute goal on project org.apache.sling.launchpad.testing: Could not resolve dependencies for project org.apache.sling:org.apache.sling.launchpad.testing:slingstart:12-SNAPSHOT: Could not find artifact org.apache.sling:org.apache.sling.launchpad.integration-tests:jar:12-SNAPSHOT in Nexus (http://repository.apache.org/snapshots) -> [Help 1]
[ERROR]
[ERROR] To see the full stack trace of the errors, re-run Maven with the -e switch.
[ERROR] Re-run Maven using the -X switch to enable full debug logging.
[ERROR]
[ERROR] For more information about the errors and possible solutions, please read the following articles:
[ERROR] [Help 1] http://cwiki.apache.org/confluence/display/MAVEN/DependencyResolutionException
channel stopped
Archiving artifacts
Recording test results
Build failed in Jenkins:
sling-org-apache-sling-launchpad-testing-11 #40
Posted by Apache Jenkins Server <je...@builds.apache.org>.
See <https://builds.apache.org/job/sling-org-apache-sling-launchpad-testing-11/40/display/redirect>
------------------------------------------
Started by upstream project "sling-org-apache-sling-starter-1.8" build number 183
originally caused by:
Started by timer
[EnvInject] - Loading node environment variables.
Building remotely on H31 (ubuntu xenial) in workspace <https://builds.apache.org/job/sling-org-apache-sling-launchpad-testing-11/ws/>
[WS-CLEANUP] Deleting project workspace...
[WS-CLEANUP] Done
Cloning the remote Git repository
Cloning repository https://github.com/apache/sling-org-apache-sling-launchpad-testing.git
> git init <https://builds.apache.org/job/sling-org-apache-sling-launchpad-testing-11/ws/> # timeout=10
Fetching upstream changes from https://github.com/apache/sling-org-apache-sling-launchpad-testing.git
> git --version # timeout=10
> git fetch --tags --progress https://github.com/apache/sling-org-apache-sling-launchpad-testing.git +refs/heads/*:refs/remotes/origin/*
> git config remote.origin.url https://github.com/apache/sling-org-apache-sling-launchpad-testing.git # timeout=10
> git config --add remote.origin.fetch +refs/heads/*:refs/remotes/origin/* # timeout=10
> git config remote.origin.url https://github.com/apache/sling-org-apache-sling-launchpad-testing.git # timeout=10
Fetching upstream changes from https://github.com/apache/sling-org-apache-sling-launchpad-testing.git
> git fetch --tags --progress https://github.com/apache/sling-org-apache-sling-launchpad-testing.git +refs/heads/*:refs/remotes/origin/*
> git rev-parse origin/master^{commit} # timeout=10
Checking out Revision 11a7575dedfad03e7e357506e8a44bc30a7b9de1 (origin/master)
> git config core.sparsecheckout # timeout=10
> git checkout -f 11a7575dedfad03e7e357506e8a44bc30a7b9de1
Commit message: "SLING-7935 - Consolidate all 'launchpad-testing' modules into a single git repository"
> git rev-list --no-walk 11a7575dedfad03e7e357506e8a44bc30a7b9de1 # timeout=10
Parsing POMs
Established TCP socket on 33242
maven33-agent.jar already up to date
maven33-interceptor.jar already up to date
maven3-interceptor-commons.jar already up to date
[sling-org-apache-sling-launchpad-testing-11] $ /home/jenkins/tools/java/latest11/bin/java -Xmx4g -Xms4g -cp /home/jenkins/jenkins-slave/maven33-agent.jar:/home/jenkins/tools/maven/apache-maven-3.3.9/boot/plexus-classworlds-2.5.2.jar:/home/jenkins/tools/maven/apache-maven-3.3.9/conf/logging jenkins.maven3.agent.Maven33Main /home/jenkins/tools/maven/apache-maven-3.3.9 /home/jenkins/jenkins-slave/slave.jar /home/jenkins/jenkins-slave/maven33-interceptor.jar /home/jenkins/jenkins-slave/maven3-interceptor-commons.jar 33242
<===[JENKINS REMOTING CAPACITY]===> channel started
Executing Maven: -B -f <https://builds.apache.org/job/sling-org-apache-sling-launchpad-testing-11/ws/pom.xml> -Dmaven.repo.local=/home/jenkins/jenkins-slave/maven-repositories/0 -U clean verify
[INFO] Scanning for projects...
[INFO] Downloading: http://repository.apache.org/snapshots/org/apache/sling/org.apache.sling.launchpad.test-bundles/12-SNAPSHOT/maven-metadata.xml
[INFO] Downloaded: http://repository.apache.org/snapshots/org/apache/sling/org.apache.sling.launchpad.test-bundles/12-SNAPSHOT/maven-metadata.xml (1007 B at 2.3 KB/sec)
[INFO] Downloading: http://repository.apache.org/snapshots/org/apache/sling/org.apache.sling.launchpad.test-bundles/12-SNAPSHOT/org.apache.sling.launchpad.test-bundles-12-20181019.220256-2.txt
[INFO] Downloaded: http://repository.apache.org/snapshots/org/apache/sling/org.apache.sling.launchpad.test-bundles/12-SNAPSHOT/org.apache.sling.launchpad.test-bundles-12-20181019.220256-2.txt (2 KB at 5.4 KB/sec)
[INFO] Downloading: http://repository.apache.org/snapshots/org/apache/sling/org.apache.sling.starter/12-SNAPSHOT/maven-metadata.xml
[INFO] Downloaded: http://repository.apache.org/snapshots/org/apache/sling/org.apache.sling.starter/12-SNAPSHOT/maven-metadata.xml (2 KB at 4.6 KB/sec)
[INFO] Downloading: http://repository.apache.org/snapshots/org/apache/sling/org.apache.sling.starter/12-SNAPSHOT/org.apache.sling.starter-12-20181020.065851-2-slingfeature.txt
[INFO] Downloaded: http://repository.apache.org/snapshots/org/apache/sling/org.apache.sling.starter/12-SNAPSHOT/org.apache.sling.starter-12-20181020.065851-2-slingfeature.txt (50 KB at 160.7 KB/sec)
[INFO] Extended Maven classpath (scope 'provided') by the dependencies extracted from the Sling model.
[INFO]
[INFO] ------------------------------------------------------------------------
[INFO] Building Apache Sling Launchpad Testing 12-SNAPSHOT
[INFO] ------------------------------------------------------------------------
[INFO] Downloading: http://repository.apache.org/snapshots/org/apache/sling/org.apache.sling.launchpad.integration-tests/12-SNAPSHOT/maven-metadata.xml
[INFO] Downloading: http://repository.apache.org/snapshots/org/apache/sling/org.apache.sling.launchpad.integration-tests/12-SNAPSHOT/org.apache.sling.launchpad.integration-tests-12-SNAPSHOT.pom
[WARNING] The POM for org.apache.sling:org.apache.sling.launchpad.integration-tests:jar:12-SNAPSHOT is missing, no dependency information available
[INFO] Downloading: http://repository.apache.org/snapshots/org/apache/sling/org.apache.sling.starter/12-SNAPSHOT/org.apache.sling.starter-12-20181020.065851-2.pom
[INFO] Downloaded: http://repository.apache.org/snapshots/org/apache/sling/org.apache.sling.starter/12-SNAPSHOT/org.apache.sling.starter-12-20181020.065851-2.pom (8 KB at 24.7 KB/sec)
[INFO] Downloading: http://repository.apache.org/snapshots/org/apache/sling/org.apache.sling.launchpad.test-bundles/12-SNAPSHOT/org.apache.sling.launchpad.test-bundles-12-20181019.220256-2.pom
[INFO] Downloaded: http://repository.apache.org/snapshots/org/apache/sling/org.apache.sling.launchpad.test-bundles/12-SNAPSHOT/org.apache.sling.launchpad.test-bundles-12-20181019.220256-2.pom (4 KB at 10.3 KB/sec)
[INFO] Downloading: https://repo.maven.apache.org/maven2/org/slf4j/jcl-over-slf4j/1.7.6/jcl-over-slf4j-1.7.6.pom
[INFO] Downloaded: https://repo.maven.apache.org/maven2/org/slf4j/jcl-over-slf4j/1.7.6/jcl-over-slf4j-1.7.6.pom (2 KB at 6.8 KB/sec)
[INFO] Downloading: https://repo.maven.apache.org/maven2/org/slf4j/log4j-over-slf4j/1.7.6/log4j-over-slf4j-1.7.6.pom
[INFO] Downloaded: https://repo.maven.apache.org/maven2/org/slf4j/log4j-over-slf4j/1.7.6/log4j-over-slf4j-1.7.6.pom (2 KB at 98.0 KB/sec)
[INFO] Downloading: https://repo.maven.apache.org/maven2/org/apache/felix/org.apache.felix.configadmin/1.9.10/org.apache.felix.configadmin-1.9.10.pom
[INFO] Downloaded: https://repo.maven.apache.org/maven2/org/apache/felix/org.apache.felix.configadmin/1.9.10/org.apache.felix.configadmin-1.9.10.pom (14 KB at 344.4 KB/sec)
[INFO] Downloading: https://repo.maven.apache.org/maven2/org/apache/sling/org.apache.sling.junit.core/1.0.26/org.apache.sling.junit.core-1.0.26.pom
[INFO] Downloaded: https://repo.maven.apache.org/maven2/org/apache/sling/org.apache.sling.junit.core/1.0.26/org.apache.sling.junit.core-1.0.26.pom (9 KB at 412.5 KB/sec)
[INFO] Downloading: https://repo.maven.apache.org/maven2/org/apache/sling/org.apache.sling.commons.osgi/2.2.2/org.apache.sling.commons.osgi-2.2.2.pom
[INFO] Downloaded: https://repo.maven.apache.org/maven2/org/apache/sling/org.apache.sling.commons.osgi/2.2.2/org.apache.sling.commons.osgi-2.2.2.pom (6 KB at 269.7 KB/sec)
[INFO] Downloading: https://repo.maven.apache.org/maven2/org/apache/sling/org.apache.sling.junit.remote/1.0.12/org.apache.sling.junit.remote-1.0.12.pom
[INFO] Downloaded: https://repo.maven.apache.org/maven2/org/apache/sling/org.apache.sling.junit.remote/1.0.12/org.apache.sling.junit.remote-1.0.12.pom (6 KB at 270.4 KB/sec)
[INFO] Downloading: https://repo.maven.apache.org/maven2/org/apache/sling/org.apache.sling.testing.tools/1.0.16/org.apache.sling.testing.tools-1.0.16.pom
[INFO] Downloaded: https://repo.maven.apache.org/maven2/org/apache/sling/org.apache.sling.testing.tools/1.0.16/org.apache.sling.testing.tools-1.0.16.pom (6 KB at 281.1 KB/sec)
[INFO] Downloading: https://repo.maven.apache.org/maven2/org/apache/sling/org.apache.sling.junit.scriptable/1.0.12/org.apache.sling.junit.scriptable-1.0.12.pom
[INFO] Downloaded: https://repo.maven.apache.org/maven2/org/apache/sling/org.apache.sling.junit.scriptable/1.0.12/org.apache.sling.junit.scriptable-1.0.12.pom (6 KB at 253.2 KB/sec)
[INFO] Downloading: http://repository.apache.org/snapshots/org/apache/sling/org.apache.sling.launchpad.test-fragment/12-SNAPSHOT/maven-metadata.xml
[INFO] Downloaded: http://repository.apache.org/snapshots/org/apache/sling/org.apache.sling.launchpad.test-fragment/12-SNAPSHOT/maven-metadata.xml (1008 B at 3.4 KB/sec)
[INFO] Downloading: http://repository.apache.org/snapshots/org/apache/sling/org.apache.sling.launchpad.test-fragment/12-SNAPSHOT/org.apache.sling.launchpad.test-fragment-12-20181019.171341-1.pom
[INFO] Downloaded: http://repository.apache.org/snapshots/org/apache/sling/org.apache.sling.launchpad.test-fragment/12-SNAPSHOT/org.apache.sling.launchpad.test-fragment-12-20181019.171341-1.pom (3 KB at 9.5 KB/sec)
[INFO] Downloading: http://repository.apache.org/snapshots/org/apache/sling/org.apache.sling.launchpad.test-services-war/12-SNAPSHOT/maven-metadata.xml
[INFO] Downloaded: http://repository.apache.org/snapshots/org/apache/sling/org.apache.sling.launchpad.test-services-war/12-SNAPSHOT/maven-metadata.xml (1012 B at 3.4 KB/sec)
[INFO] Downloading: http://repository.apache.org/snapshots/org/apache/sling/org.apache.sling.launchpad.test-services-war/12-SNAPSHOT/org.apache.sling.launchpad.test-services-war-12-20181019.171426-1.pom
[INFO] Downloaded: http://repository.apache.org/snapshots/org/apache/sling/org.apache.sling.launchpad.test-services-war/12-SNAPSHOT/org.apache.sling.launchpad.test-services-war-12-20181019.171426-1.pom (6 KB at 18.8 KB/sec)
[INFO] Downloading: http://repository.apache.org/snapshots/org/apache/sling/org.apache.sling.launchpad.test-services/12-SNAPSHOT/maven-metadata.xml
[INFO] Downloaded: http://repository.apache.org/snapshots/org/apache/sling/org.apache.sling.launchpad.test-services/12-SNAPSHOT/maven-metadata.xml (1008 B at 3.2 KB/sec)
[INFO] Downloading: http://repository.apache.org/snapshots/org/apache/sling/org.apache.sling.launchpad.test-services/12-SNAPSHOT/org.apache.sling.launchpad.test-services-12-20181019.165434-1.pom
[INFO] Downloaded: http://repository.apache.org/snapshots/org/apache/sling/org.apache.sling.launchpad.test-services/12-SNAPSHOT/org.apache.sling.launchpad.test-services-12-20181019.165434-1.pom (10 KB at 35.2 KB/sec)
[INFO] Downloading: https://repo.maven.apache.org/maven2/org/apache/jackrabbit/jackrabbit-jcr-server/2.11.0/jackrabbit-jcr-server-2.11.0.pom
[INFO] Downloaded: https://repo.maven.apache.org/maven2/org/apache/jackrabbit/jackrabbit-jcr-server/2.11.0/jackrabbit-jcr-server-2.11.0.pom (9 KB at 280.2 KB/sec)
[INFO] Downloading: https://repo.maven.apache.org/maven2/org/apache/jackrabbit/jackrabbit-parent/2.11.0/jackrabbit-parent-2.11.0.pom
[INFO] Downloaded: https://repo.maven.apache.org/maven2/org/apache/jackrabbit/jackrabbit-parent/2.11.0/jackrabbit-parent-2.11.0.pom (30 KB at 1228.2 KB/sec)
[INFO] Downloading: https://repo.maven.apache.org/maven2/org/apache/jackrabbit/jackrabbit-spi-commons/2.11.0/jackrabbit-spi-commons-2.11.0.pom
[INFO] Downloaded: https://repo.maven.apache.org/maven2/org/apache/jackrabbit/jackrabbit-spi-commons/2.11.0/jackrabbit-spi-commons-2.11.0.pom (7 KB at 182.9 KB/sec)
[INFO] Downloading: https://repo.maven.apache.org/maven2/org/apache/jackrabbit/jackrabbit-spi/2.11.0/jackrabbit-spi-2.11.0.pom
[INFO] Downloaded: https://repo.maven.apache.org/maven2/org/apache/jackrabbit/jackrabbit-spi/2.11.0/jackrabbit-spi-2.11.0.pom (3 KB at 164.8 KB/sec)
[INFO] Downloading: https://repo.maven.apache.org/maven2/org/apache/jackrabbit/jackrabbit-jcr-commons/2.11.0/jackrabbit-jcr-commons-2.11.0.pom
[INFO] Downloaded: https://repo.maven.apache.org/maven2/org/apache/jackrabbit/jackrabbit-jcr-commons/2.11.0/jackrabbit-jcr-commons-2.11.0.pom (5 KB at 249.9 KB/sec)
[INFO] Downloading: https://repo.maven.apache.org/maven2/org/apache/jackrabbit/jackrabbit-webdav/2.11.0/jackrabbit-webdav-2.11.0.pom
[INFO] Downloaded: https://repo.maven.apache.org/maven2/org/apache/jackrabbit/jackrabbit-webdav/2.11.0/jackrabbit-webdav-2.11.0.pom (5 KB at 297.1 KB/sec)
[INFO] Downloading: https://repo.maven.apache.org/maven2/org/apache/jackrabbit/jackrabbit-webdav/2.2.8/jackrabbit-webdav-2.2.8.pom
[INFO] Downloaded: https://repo.maven.apache.org/maven2/org/apache/jackrabbit/jackrabbit-webdav/2.2.8/jackrabbit-webdav-2.2.8.pom (4 KB at 193.9 KB/sec)
[INFO] Downloading: https://repo.maven.apache.org/maven2/org/apache/jackrabbit/jackrabbit-parent/2.2.8/jackrabbit-parent-2.2.8.pom
[INFO] Downloaded: https://repo.maven.apache.org/maven2/org/apache/jackrabbit/jackrabbit-parent/2.2.8/jackrabbit-parent-2.2.8.pom (11 KB at 575.6 KB/sec)
[INFO] Downloading: https://repo.maven.apache.org/maven2/org/apache/jackrabbit/jackrabbit-jcr-commons/2.2.8/jackrabbit-jcr-commons-2.2.8.pom
[INFO] Downloaded: https://repo.maven.apache.org/maven2/org/apache/jackrabbit/jackrabbit-jcr-commons/2.2.8/jackrabbit-jcr-commons-2.2.8.pom (3 KB at 148.3 KB/sec)
[INFO] Downloading: https://repo.maven.apache.org/maven2/org/apache/sling/org.apache.sling.scripting.api/2.1.0/org.apache.sling.scripting.api-2.1.0.pom
[INFO] Downloaded: https://repo.maven.apache.org/maven2/org/apache/sling/org.apache.sling.scripting.api/2.1.0/org.apache.sling.scripting.api-2.1.0.pom (4 KB at 175.9 KB/sec)
[INFO] Downloading: https://repo.maven.apache.org/maven2/org/livetribe/livetribe-jsr223/2.0.6/livetribe-jsr223-2.0.6.pom
[INFO] Downloaded: https://repo.maven.apache.org/maven2/org/livetribe/livetribe-jsr223/2.0.6/livetribe-jsr223-2.0.6.pom (2 KB at 89.5 KB/sec)
[INFO] Downloading: https://repo.maven.apache.org/maven2/org/livetribe/livetribe/1.2/livetribe-1.2.pom
[INFO] Downloaded: https://repo.maven.apache.org/maven2/org/livetribe/livetribe/1.2/livetribe-1.2.pom (9 KB at 454.0 KB/sec)
[INFO] Downloading: https://repo.maven.apache.org/maven2/org/apache/sling/org.apache.sling.testing.samples.failingtests/1.0.6/org.apache.sling.testing.samples.failingtests-1.0.6.pom
[INFO] Downloaded: https://repo.maven.apache.org/maven2/org/apache/sling/org.apache.sling.testing.samples.failingtests/1.0.6/org.apache.sling.testing.samples.failingtests-1.0.6.pom (5 KB at 222.5 KB/sec)
[INFO] Downloading: https://repo.maven.apache.org/maven2/org/apache/sling/org.apache.sling.auth.form/1.0.12/org.apache.sling.auth.form-1.0.12.pom
[INFO] Downloaded: https://repo.maven.apache.org/maven2/org/apache/sling/org.apache.sling.auth.form/1.0.12/org.apache.sling.auth.form-1.0.12.pom (7 KB at 340.7 KB/sec)
[INFO] Downloading: https://repo.maven.apache.org/maven2/org/apache/sling/org.apache.sling.scripting.sightly.compiler.java/1.0.26-1.4.0/org.apache.sling.scripting.sightly.compiler.java-1.0.26-1.4.0.pom
[INFO] Downloaded: https://repo.maven.apache.org/maven2/org/apache/sling/org.apache.sling.scripting.sightly.compiler.java/1.0.26-1.4.0/org.apache.sling.scripting.sightly.compiler.java-1.0.26-1.4.0.pom (9 KB at 401.0 KB/sec)
[INFO] Downloading: https://repo.maven.apache.org/maven2/org/apache/sling/org.apache.sling.scripting.sightly.compiler/1.0.22-1.4.0/org.apache.sling.scripting.sightly.compiler-1.0.22-1.4.0.pom
[INFO] Downloaded: https://repo.maven.apache.org/maven2/org/apache/sling/org.apache.sling.scripting.sightly.compiler/1.0.22-1.4.0/org.apache.sling.scripting.sightly.compiler-1.0.22-1.4.0.pom (11 KB at 548.8 KB/sec)
[INFO] Downloading: https://repo.maven.apache.org/maven2/org/apache/sling/org.apache.sling.extensions.webconsolesecurityprovider/1.2.0/org.apache.sling.extensions.webconsolesecurityprovider-1.2.0.pom
[INFO] Downloaded: https://repo.maven.apache.org/maven2/org/apache/sling/org.apache.sling.extensions.webconsolesecurityprovider/1.2.0/org.apache.sling.extensions.webconsolesecurityprovider-1.2.0.pom (6 KB at 253.0 KB/sec)
[INFO] Downloading: https://repo.maven.apache.org/maven2/org/apache/sling/org.apache.sling.starter.content/1.0.2/org.apache.sling.starter.content-1.0.2.pom
[INFO] Downloaded: https://repo.maven.apache.org/maven2/org/apache/sling/org.apache.sling.starter.content/1.0.2/org.apache.sling.starter.content-1.0.2.pom (5 KB at 266.2 KB/sec)
[INFO] Downloading: https://repo.maven.apache.org/maven2/org/apache/felix/org.apache.felix.http.sslfilter/1.2.6/org.apache.felix.http.sslfilter-1.2.6.pom
[INFO] Downloaded: https://repo.maven.apache.org/maven2/org/apache/felix/org.apache.felix.http.sslfilter/1.2.6/org.apache.felix.http.sslfilter-1.2.6.pom (5 KB at 296.4 KB/sec)
[INFO] Downloading: https://repo.maven.apache.org/maven2/org/apache/felix/org.apache.felix.scr/2.1.12/org.apache.felix.scr-2.1.12.pom
[INFO] Downloaded: https://repo.maven.apache.org/maven2/org/apache/felix/org.apache.felix.scr/2.1.12/org.apache.felix.scr-2.1.12.pom (15 KB at 717.6 KB/sec)
[INFO] Downloading: http://repository.apache.org/snapshots/org/apache/sling/org.apache.sling.launchpad.integration-tests/12-SNAPSHOT/org.apache.sling.launchpad.integration-tests-12-SNAPSHOT.jar
[INFO] Downloading: http://repository.apache.org/snapshots/org/apache/sling/org.apache.sling.starter/12-SNAPSHOT/org.apache.sling.starter-12-20181020.065851-2.jar
[INFO] Downloading: http://repository.apache.org/snapshots/org/apache/sling/org.apache.sling.launchpad.test-fragment/12-SNAPSHOT/org.apache.sling.launchpad.test-fragment-12-20181019.171341-1.jar
[INFO] Downloading: http://repository.apache.org/snapshots/org/apache/sling/org.apache.sling.launchpad.test-services-war/12-SNAPSHOT/org.apache.sling.launchpad.test-services-war-12-20181019.171426-1.war
[INFO] Downloading: http://repository.apache.org/snapshots/org/apache/sling/org.apache.sling.launchpad.test-services/12-SNAPSHOT/org.apache.sling.launchpad.test-services-12-20181019.165434-1.jar
[INFO] Downloaded: http://repository.apache.org/snapshots/org/apache/sling/org.apache.sling.launchpad.test-services-war/12-SNAPSHOT/org.apache.sling.launchpad.test-services-war-12-20181019.171426-1.war (14 KB at 46.9 KB/sec)
[INFO] Downloaded: http://repository.apache.org/snapshots/org/apache/sling/org.apache.sling.launchpad.test-fragment/12-SNAPSHOT/org.apache.sling.launchpad.test-fragment-12-20181019.171341-1.jar (9 KB at 27.0 KB/sec)
[INFO] Downloaded: http://repository.apache.org/snapshots/org/apache/sling/org.apache.sling.launchpad.test-services/12-SNAPSHOT/org.apache.sling.launchpad.test-services-12-20181019.165434-1.jar (180 KB at 354.2 KB/sec)
[INFO] Downloaded: http://repository.apache.org/snapshots/org/apache/sling/org.apache.sling.starter/12-SNAPSHOT/org.apache.sling.starter-12-20181020.065851-2.jar (71851 KB at 24691.0 KB/sec)
[INFO] Downloading: https://repo.maven.apache.org/maven2/org/apache/felix/org.apache.felix.configadmin/1.9.10/org.apache.felix.configadmin-1.9.10.jar
[INFO] Downloading: https://repo.maven.apache.org/maven2/org/apache/sling/org.apache.sling.junit.core/1.0.26/org.apache.sling.junit.core-1.0.26.jar
[INFO] Downloading: https://repo.maven.apache.org/maven2/org/apache/sling/org.apache.sling.junit.remote/1.0.12/org.apache.sling.junit.remote-1.0.12.jar
[INFO] Downloading: https://repo.maven.apache.org/maven2/org/apache/sling/org.apache.sling.testing.tools/1.0.16/org.apache.sling.testing.tools-1.0.16.jar
[INFO] Downloading: https://repo.maven.apache.org/maven2/org/apache/sling/org.apache.sling.junit.scriptable/1.0.12/org.apache.sling.junit.scriptable-1.0.12.jar
[INFO] Downloaded: https://repo.maven.apache.org/maven2/org/apache/felix/org.apache.felix.configadmin/1.9.10/org.apache.felix.configadmin-1.9.10.jar (152 KB at 2714.0 KB/sec)
[INFO] Downloading: https://repo.maven.apache.org/maven2/org/apache/jackrabbit/jackrabbit-jcr-server/2.11.0/jackrabbit-jcr-server-2.11.0.jar
[INFO] Downloaded: https://repo.maven.apache.org/maven2/org/apache/sling/org.apache.sling.junit.remote/1.0.12/org.apache.sling.junit.remote-1.0.12.jar (33 KB at 557.3 KB/sec)
[INFO] Downloading: https://repo.maven.apache.org/maven2/org/apache/sling/org.apache.sling.testing.samples.failingtests/1.0.6/org.apache.sling.testing.samples.failingtests-1.0.6.jar
[INFO] Downloaded: https://repo.maven.apache.org/maven2/org/apache/sling/org.apache.sling.testing.tools/1.0.16/org.apache.sling.testing.tools-1.0.16.jar (79 KB at 1116.4 KB/sec)
[INFO] Downloading: https://repo.maven.apache.org/maven2/org/apache/sling/org.apache.sling.auth.form/1.0.12/org.apache.sling.auth.form-1.0.12.jar
[INFO] Downloaded: https://repo.maven.apache.org/maven2/org/apache/sling/org.apache.sling.testing.samples.failingtests/1.0.6/org.apache.sling.testing.samples.failingtests-1.0.6.jar (11 KB at 140.0 KB/sec)
[INFO] Downloading: https://repo.maven.apache.org/maven2/org/apache/sling/org.apache.sling.scripting.sightly.compiler.java/1.0.26-1.4.0/org.apache.sling.scripting.sightly.compiler.java-1.0.26-1.4.0.jar
[INFO] Downloaded: https://repo.maven.apache.org/maven2/org/apache/sling/org.apache.sling.auth.form/1.0.12/org.apache.sling.auth.form-1.0.12.jar (59 KB at 639.0 KB/sec)
[INFO] Downloading: https://repo.maven.apache.org/maven2/org/apache/sling/org.apache.sling.scripting.sightly.compiler/1.0.22-1.4.0/org.apache.sling.scripting.sightly.compiler-1.0.22-1.4.0.jar
[INFO] Downloaded: https://repo.maven.apache.org/maven2/org/apache/sling/org.apache.sling.junit.scriptable/1.0.12/org.apache.sling.junit.scriptable-1.0.12.jar (24 KB at 233.6 KB/sec)
[INFO] Downloading: https://repo.maven.apache.org/maven2/org/osgi/org.osgi.core/5.0.0/org.osgi.core-5.0.0.jar
[INFO] Downloaded: https://repo.maven.apache.org/maven2/org/apache/sling/org.apache.sling.junit.core/1.0.26/org.apache.sling.junit.core-1.0.26.jar (448 KB at 3998.9 KB/sec)
[INFO] Downloading: https://repo.maven.apache.org/maven2/org/apache/sling/org.apache.sling.extensions.webconsolesecurityprovider/1.2.0/org.apache.sling.extensions.webconsolesecurityprovider-1.2.0.jar
[INFO] Downloaded: https://repo.maven.apache.org/maven2/org/apache/jackrabbit/jackrabbit-jcr-server/2.11.0/jackrabbit-jcr-server-2.11.0.jar (360 KB at 3179.3 KB/sec)
[INFO] Downloading: https://repo.maven.apache.org/maven2/org/apache/sling/org.apache.sling.starter.content/1.0.2/org.apache.sling.starter.content-1.0.2.jar
[INFO] Downloaded: https://repo.maven.apache.org/maven2/org/apache/sling/org.apache.sling.extensions.webconsolesecurityprovider/1.2.0/org.apache.sling.extensions.webconsolesecurityprovider-1.2.0.jar (24 KB at 191.1 KB/sec)
[INFO] Downloading: https://repo.maven.apache.org/maven2/org/apache/felix/org.apache.felix.http.sslfilter/1.2.6/org.apache.felix.http.sslfilter-1.2.6.jar
[INFO] Downloaded: https://repo.maven.apache.org/maven2/org/apache/sling/org.apache.sling.starter.content/1.0.2/org.apache.sling.starter.content-1.0.2.jar (144 KB at 996.3 KB/sec)
[INFO] Downloaded: https://repo.maven.apache.org/maven2/org/apache/felix/org.apache.felix.http.sslfilter/1.2.6/org.apache.felix.http.sslfilter-1.2.6.jar (25 KB at 172.9 KB/sec)
[INFO] Downloading: https://repo.maven.apache.org/maven2/org/apache/felix/org.apache.felix.scr/2.1.12/org.apache.felix.scr-2.1.12.jar
[INFO] Downloaded: https://repo.maven.apache.org/maven2/org/osgi/org.osgi.core/5.0.0/org.osgi.core-5.0.0.jar (421 KB at 2801.8 KB/sec)
[INFO] Downloaded: https://repo.maven.apache.org/maven2/org/apache/sling/org.apache.sling.scripting.sightly.compiler.java/1.0.26-1.4.0/org.apache.sling.scripting.sightly.compiler.java-1.0.26-1.4.0.jar (86 KB at 503.4 KB/sec)
[INFO] Downloaded: https://repo.maven.apache.org/maven2/org/apache/felix/org.apache.felix.scr/2.1.12/org.apache.felix.scr-2.1.12.jar (408 KB at 2145.9 KB/sec)
[INFO] Downloaded: https://repo.maven.apache.org/maven2/org/apache/sling/org.apache.sling.scripting.sightly.compiler/1.0.22-1.4.0/org.apache.sling.scripting.sightly.compiler-1.0.22-1.4.0.jar (533 KB at 2303.9 KB/sec)
[WARNING] Attempt to (de-)serialize anonymous class hudson.maven.reporters.MavenArtifactArchiver$2; see: https://jenkins.io/redirect/serialization-of-anonymous-classes/
[JENKINS] Archiving disabled
[WARNING] Attempt to (de-)serialize anonymous class hudson.maven.reporters.MavenFingerprinter$1; see: https://jenkins.io/redirect/serialization-of-anonymous-classes/
[JENKINS] Archiving disabled
[INFO] ------------------------------------------------------------------------
[INFO] BUILD FAILURE
[INFO] ------------------------------------------------------------------------
[INFO] Total time: 21.198 s
[INFO] Finished at: 2018-10-20T07:00:24+00:00
[INFO] Final Memory: 32M/4096M
[INFO] ------------------------------------------------------------------------
Waiting for Jenkins to finish collecting data
[ERROR] Failed to execute goal on project org.apache.sling.launchpad.testing: Could not resolve dependencies for project org.apache.sling:org.apache.sling.launchpad.testing:slingstart:12-SNAPSHOT: Could not find artifact org.apache.sling:org.apache.sling.launchpad.integration-tests:jar:12-SNAPSHOT in Nexus (http://repository.apache.org/snapshots) -> [Help 1]
[ERROR]
[ERROR] To see the full stack trace of the errors, re-run Maven with the -e switch.
[ERROR] Re-run Maven using the -X switch to enable full debug logging.
[ERROR]
[ERROR] For more information about the errors and possible solutions, please read the following articles:
[ERROR] [Help 1] http://cwiki.apache.org/confluence/display/MAVEN/DependencyResolutionException
channel stopped
Archiving artifacts
Recording test results