You are viewing a plain text version of this content. The canonical link for it is here.
Posted to builds@cassandra.apache.org by Apache Jenkins Server <je...@builds.apache.org> on 2024/12/31 23:38:06 UTC
Build complete: Cassandra-5.0 #347 [UNSTABLE] 227d294986532d460ee6cadd1a237a3a10b67538
-------------------------------------------------------------------------------
Build Cassandra-5.0 #347 Still unstable
URL: https://ci-cassandra.apache.org/job/Cassandra-5.0/347/
-------------------------------------------------------------------------------
Changes:
[Michael Semb Wever] Typo in storage-engine.adoc
-------------------------------------------------------------------------------
Failed Tests:
15 tests failed.
FAILED: dtest-latest.cqlsh_tests.test_cqlsh_copy.TestCqlshCopy.Tests / dtest-latest jdk17 56/64 / test_bulk_round_trip_default
FAILED: dtest-latest.cqlsh_tests.test_cqlsh_copy.TestCqlshCopy.Tests / dtest-latest jdk17 62/64 / test_bulk_round_trip_with_single_core
FAILED: dtest-latest.global_row_key_cache_test.TestGlobalRowKeyCache.Tests / dtest-latest jdk11 49/64 / test_functional
FAILED: dtest-novnode.topology_test.TestTopology.Tests / dtest-novnode jdk11 15/64 / test_decommissioned_node_cant_rejoin
FAILED: dtest-upgrade-large.upgrade_tests.upgrade_through_versions_test.TestUpgrade_current_4_0_x_To_indev_5_0_x.Tests / dtest-upgrade-large jdk11 29/32 / test_bootstrap
FAILED: dtest-upgrade-large.upgrade_tests.upgrade_through_versions_test.TestUpgrade_current_4_1_x_To_indev_5_0_x.Tests / dtest-upgrade-large jdk11 4/32 / test_bootstrap_multidc
FAILED: dtest-upgrade-large.upgrade_tests.upgrade_through_versions_test.TestUpgrade_indev_5_0_x_To_indev_trunk.Tests / dtest-upgrade-large jdk11 29/32 / test_parallel_upgrade
FAILED: dtest.bootstrap_test.TestBootstrap.Tests / dtest jdk17 8/64 / test_rf_gt_nodes_multidc_should_succeed
FAILED: dtest.bootstrap_test.TestBootstrap.Tests / dtest jdk11 19/64 / test_simultaneous_bootstrap
FAILED: org.apache.cassandra.streaming.LongStreamingTest.Tests / long-test jdk17 2/8 / terminated successfully-cassandra.testtag_IS_UNDEFINED
FAILED: dtest-novnode.bootstrap_test.TestBootstrap.Tests / dtest-novnode jdk11 23/64 / test_simultaneous_bootstrap
FAILED: dtest-novnode.replace_address_test.TestReplaceAddress.Tests / dtest-novnode jdk11 23/64 / test_fail_when_seed
FAILED: org.apache.cassandra.distributed.test.RepairTest.Tests / jvm-dtest jdk17 1/12 / testForcedNormalRepairWithOneNodeDown-_jdk17_x86_64
FAILED: org.apache.cassandra.distributed.upgrade.MixedModeAvailabilityUpgradedCoordinatorTest.Tests / jvm-dtest-upgrade jdk11 4/8 / testAvailability-_jdk11_x86_64
FAILED: junit.framework.TestSuite.Tests / jvm-dtest jdk17 1/12 / org.apache.cassandra.distributed.test.RepairTest-_jdk17_x86_64
-------------------------------------------------------------------------------
For complete test report and logs see https://nightlies.apache.org/cassandra/Cassandra-5.0/347/