You are viewing a plain text version of this content. The canonical link for it is here.
Posted to commits@activemq.apache.org by Apache Jenkins Server <je...@builds.apache.org> on 2023/07/28 11:23:43 UTC

Build failed in Jenkins: ActiveMQ » ActiveMQ-Artemis-JDK11 #1512

See <https://ci-builds.apache.org/job/ActiveMQ/job/ActiveMQ-Artemis-JDK11/1512/display/redirect?page=changes>

Changes:

[Clebert Suconic] ARTEMIS-4376 add Dockerfile for Alpine + JRE 11


------------------------------------------
[...truncated 5.83 MB...]
[INFO] ActiveMQ Artemis JUnit 5 Extensions ................ SUCCESS [ 12.749 s]
[INFO] ActiveMQ Artemis JMS Client All .................... SUCCESS [ 28.923 s]
[INFO] ActiveMQ Artemis JMS Client OSGi ................... SUCCESS [ 11.080 s]
[INFO] ActiveMQ Artemis Jakarta Messaging Client .......... SUCCESS [ 13.967 s]
[INFO] ActiveMQ Artemis Jakarta Messaging Client All ...... SUCCESS [ 27.974 s]
[INFO] ActiveMQ Artemis Jakarta Service Extensions ........ SUCCESS [  9.644 s]
[INFO] ActiveMQ Artemis Jakarta Messaging Server .......... SUCCESS [  6.936 s]
[INFO] ActiveMQ Artemis RAR POM ........................... SUCCESS [  6.929 s]
[INFO] ActiveMQ Artemis Jakarta RAR ....................... SUCCESS [  7.279 s]
[INFO] ActiveMQ Artemis Maven Plugin ...................... SUCCESS [ 11.502 s]
[INFO] ActiveMQ Artemis Server OSGi ....................... SUCCESS [ 16.172 s]
[INFO] ActiveMQ Artemis Cons .............................. SUCCESS [  3.169 s]
[INFO] ActiveMQ Artemis HawtIO Branding ................... SUCCESS [  8.044 s]
[INFO] ActiveMQ Artemis HawtIO Plugin ..................... SUCCESS [  6.427 s]
[INFO] ActiveMQ Artemis Console ........................... SUCCESS [  7.892 s]
[INFO] ActiveMQ Artemis Spring Integration ................ SUCCESS [  5.506 s]
[INFO] ActiveMQ Artemis Quorum RI ......................... SUCCESS [ 39.901 s]
[INFO] Apache ActiveMQ Artemis Distribution ............... SUCCESS [ 27.981 s]
[INFO] ActiveMQ Artemis Tests POM ......................... SUCCESS [  2.944 s]
[INFO] ActiveMQ Artemis Test Support ...................... SUCCESS [  6.773 s]
[INFO] ActiveMQ Artemis Unit Tests ........................ SUCCESS [02:40 min]
[INFO] ActiveMQ Artemis Joram Tests ....................... SUCCESS [ 38.500 s]
[INFO] ActiveMQ Artemis timing Tests ...................... SUCCESS [  5.748 s]
[INFO] ActiveMQ Artemis JMS Tests ......................... SUCCESS [05:09 min]
[INFO] ActiveMQ Artemis Integration Tests ................. SUCCESS [04:58 min]
[INFO] ActiveMQ Artemis Isolated Integration Tests ........ SUCCESS [  7.499 s]
[INFO] ActiveMQ Artemis Features .......................... SUCCESS [01:25 min]
[INFO] ActiveMQ Artemis Karaf Client Integration Tests .... SUCCESS [02:23 min]
[INFO] ActiveMQ Artemis Karaf Server Integration Tests .... SUCCESS [01:03 min]
[INFO] ActiveMQ Artemis Compatibility Tests ............... SUCCESS [  9.092 s]
[INFO] ActiveMQ Artemis soak Tests ........................ SUCCESS [ 36.035 s]
[INFO] ActiveMQ Artemis stress Tests ...................... SUCCESS [  6.131 s]
[INFO] ActiveMQ Artemis performance Tests ................. SUCCESS [  6.063 s]
[INFO] Smoke Tests ........................................ FAILURE [01:27 min]
[INFO] End-to-End Tests ................................... SKIPPED
[INFO] ActiveMQ Artemis Leak Tests ........................ SKIPPED
[INFO] Apache ActiveMQ Artemis Image ...................... SKIPPED
[INFO] Apache ActiveMQ Artemis Image Examples ............. SKIPPED
[INFO] ------------------------------------------------------------------------
[INFO] BUILD FAILURE
[INFO] ------------------------------------------------------------------------
[INFO] Total time:  46:40 min
[INFO] Finished at: 2023-07-28T11:20:33Z
[INFO] ------------------------------------------------------------------------
Waiting for Jenkins to finish collecting data
[ERROR] Failed to execute goal org.apache.maven.plugins:maven-surefire-plugin:2.22.2:test (default-test) on project smoke-tests: There are test failures.
[ERROR] 
[ERROR] Please refer to <https://ci-builds.apache.org/job/ActiveMQ/job/ActiveMQ-Artemis-JDK11/ws/tests/smoke-tests/target/surefire-reports> for the individual test results.
[ERROR] Please refer to dump files (if any exist) [date].dump, [date]-jvmRun[N].dump and [date].dumpstream.
[ERROR] -> [Help 1]
[ERROR] 
[ERROR] To see the full stack trace of the errors, re-run Maven with the -e switch.
[ERROR] Re-run Maven using the -X switch to enable full debug logging.
[ERROR] 
[ERROR] For more information about the errors and possible solutions, please read the following articles:
[ERROR] [Help 1] http://cwiki.apache.org/confluence/display/MAVEN/MojoFailureException
[ERROR] 
[ERROR] After correcting the problems, you can resume the build with the command
[ERROR]   mvn <goals> -rf :smoke-tests
[JENKINS] Archiving <https://ci-builds.apache.org/job/ActiveMQ/job/ActiveMQ-Artemis-JDK11/ws/artemis-server/pom.xml> to org.apache.activemq/artemis-server/2.31.0-SNAPSHOT/artemis-server-2.31.0-SNAPSHOT.pom
[JENKINS] Archiving <https://ci-builds.apache.org/job/ActiveMQ/job/ActiveMQ-Artemis-JDK11/ws/artemis-server/target/artemis-server-2.31.0-SNAPSHOT.jar> to org.apache.activemq/artemis-server/2.31.0-SNAPSHOT/artemis-server-2.31.0-SNAPSHOT.jar
[JENKINS] Archiving <https://ci-builds.apache.org/job/ActiveMQ/job/ActiveMQ-Artemis-JDK11/ws/artemis-server/target/artemis-server-2.31.0-SNAPSHOT-tests.jar> to org.apache.activemq/artemis-server/2.31.0-SNAPSHOT/artemis-server-2.31.0-SNAPSHOT-tests.jar
[JENKINS] Archiving <https://ci-builds.apache.org/job/ActiveMQ/job/ActiveMQ-Artemis-JDK11/ws/artemis-server/target/artemis-server-2.31.0-SNAPSHOT-sources.jar> to org.apache.activemq/artemis-server/2.31.0-SNAPSHOT/artemis-server-2.31.0-SNAPSHOT-sources.jar
[JENKINS] Archiving <https://ci-builds.apache.org/job/ActiveMQ/job/ActiveMQ-Artemis-JDK11/ws/artemis-image/examples/pom.xml> to org.apache.activemq/artemis-image-examples/2.31.0-SNAPSHOT/artemis-image-examples-2.31.0-SNAPSHOT.pom
[JENKINS] Archiving <https://ci-builds.apache.org/job/ActiveMQ/job/ActiveMQ-Artemis-JDK11/ws/tests/compatibility-tests/pom.xml> to org.apache.activemq.tests/compatibility-tests/2.31.0-SNAPSHOT/compatibility-tests-2.31.0-SNAPSHOT.pom
[JENKINS] Archiving <https://ci-builds.apache.org/job/ActiveMQ/job/ActiveMQ-Artemis-JDK11/ws/tests/compatibility-tests/target/compatibility-tests-2.31.0-SNAPSHOT.jar> to org.apache.activemq.tests/compatibility-tests/2.31.0-SNAPSHOT/compatibility-tests-2.31.0-SNAPSHOT.jar
[JENKINS] Archiving <https://ci-builds.apache.org/job/ActiveMQ/job/ActiveMQ-Artemis-JDK11/ws/tests/compatibility-tests/target/compatibility-tests-2.31.0-SNAPSHOT-sources.jar> to org.apache.activemq.tests/compatibility-tests/2.31.0-SNAPSHOT/compatibility-tests-2.31.0-SNAPSHOT-sources.jar
[JENKINS] Archiving <https://ci-builds.apache.org/job/ActiveMQ/job/ActiveMQ-Artemis-JDK11/ws/artemis-jms-client/pom.xml> to org.apache.activemq/artemis-jms-client/2.31.0-SNAPSHOT/artemis-jms-client-2.31.0-SNAPSHOT.pom
[JENKINS] Archiving <https://ci-builds.apache.org/job/ActiveMQ/job/ActiveMQ-Artemis-JDK11/ws/artemis-jms-client/target/artemis-jms-client-2.31.0-SNAPSHOT.jar> to org.apache.activemq/artemis-jms-client/2.31.0-SNAPSHOT/artemis-jms-client-2.31.0-SNAPSHOT.jar
[JENKINS] Archiving <https://ci-builds.apache.org/job/ActiveMQ/job/ActiveMQ-Artemis-JDK11/ws/artemis-jms-client/target/artemis-jms-client-2.31.0-SNAPSHOT-sources.jar> to org.apache.activemq/artemis-jms-client/2.31.0-SNAPSHOT/artemis-jms-client-2.31.0-SNAPSHOT-sources.jar
[JENKINS] Archiving <https://ci-builds.apache.org/job/ActiveMQ/job/ActiveMQ-Artemis-JDK11/ws/artemis-hawtio/activemq-branding/pom.xml> to org.apache.activemq/activemq-branding/2.31.0-SNAPSHOT/activemq-branding-2.31.0-SNAPSHOT.pom
[JENKINS] Archiving <https://ci-builds.apache.org/job/ActiveMQ/job/ActiveMQ-Artemis-JDK11/ws/artemis-hawtio/activemq-branding/target/activemq-branding-2.31.0-SNAPSHOT.war> to org.apache.activemq/activemq-branding/2.31.0-SNAPSHOT/activemq-branding-2.31.0-SNAPSHOT.war
[JENKINS] Archiving <https://ci-builds.apache.org/job/ActiveMQ/job/ActiveMQ-Artemis-JDK11/ws/artemis-hawtio/activemq-branding/target/activemq-branding-2.31.0-SNAPSHOT-sources.jar> to org.apache.activemq/activemq-branding/2.31.0-SNAPSHOT/activemq-branding-2.31.0-SNAPSHOT-sources.jar
[JENKINS] Archiving <https://ci-builds.apache.org/job/ActiveMQ/job/ActiveMQ-Artemis-JDK11/ws/tests/smoke-tests/pom.xml> to org.apache.activemq.tests/smoke-tests/2.31.0-SNAPSHOT/smoke-tests-2.31.0-SNAPSHOT.pom
[JENKINS] Archiving <https://ci-builds.apache.org/job/ActiveMQ/job/ActiveMQ-Artemis-JDK11/ws/tests/joram-tests/pom.xml> to org.apache.activemq.tests/joram-tests/2.31.0-SNAPSHOT/joram-tests-2.31.0-SNAPSHOT.pom
[JENKINS] Archiving <https://ci-builds.apache.org/job/ActiveMQ/job/ActiveMQ-Artemis-JDK11/ws/tests/joram-tests/target/joram-tests-2.31.0-SNAPSHOT.jar> to org.apache.activemq.tests/joram-tests/2.31.0-SNAPSHOT/joram-tests-2.31.0-SNAPSHOT.jar
[JENKINS] Archiving <https://ci-builds.apache.org/job/ActiveMQ/job/ActiveMQ-Artemis-JDK11/ws/tests/joram-tests/target/joram-tests-2.31.0-SNAPSHOT-sources.jar> to org.apache.activemq.tests/joram-tests/2.31.0-SNAPSHOT/joram-tests-2.31.0-SNAPSHOT-sources.jar
[JENKINS] Archiving <https://ci-builds.apache.org/job/ActiveMQ/job/ActiveMQ-Artemis-JDK11/ws/artemis-log-annotation-processor/pom.xml> to org.apache.activemq/artemis-log-annotation-processor/2.31.0-SNAPSHOT/artemis-log-annotation-processor-2.31.0-SNAPSHOT.pom
[JENKINS] Archiving <https://ci-builds.apache.org/job/ActiveMQ/job/ActiveMQ-Artemis-JDK11/ws/artemis-log-annotation-processor/target/artemis-log-annotation-processor-2.31.0-SNAPSHOT.jar> to org.apache.activemq/artemis-log-annotation-processor/2.31.0-SNAPSHOT/artemis-log-annotation-processor-2.31.0-SNAPSHOT.jar
[JENKINS] Archiving <https://ci-builds.apache.org/job/ActiveMQ/job/ActiveMQ-Artemis-JDK11/ws/artemis-log-annotation-processor/target/artemis-log-annotation-processor-2.31.0-SNAPSHOT-sources.jar> to org.apache.activemq/artemis-log-annotation-processor/2.31.0-SNAPSHOT/artemis-log-annotation-processor-2.31.0-SNAPSHOT-sources.jar
[JENKINS] Archiving <https://ci-builds.apache.org/job/ActiveMQ/job/ActiveMQ-Artemis-JDK11/ws/artemis-jms-server/pom.xml> to org.apache.activemq/artemis-jms-server/2.31.0-SNAPSHOT/artemis-jms-server-2.31.0-SNAPSHOT.pom
[JENKINS] Archiving <https://ci-builds.apache.org/job/ActiveMQ/job/ActiveMQ-Artemis-JDK11/ws/artemis-jms-server/target/artemis-jms-server-2.31.0-SNAPSHOT.jar> to org.apache.activemq/artemis-jms-server/2.31.0-SNAPSHOT/artemis-jms-server-2.31.0-SNAPSHOT.jar
[JENKINS] Archiving <https://ci-builds.apache.org/job/ActiveMQ/job/ActiveMQ-Artemis-JDK11/ws/artemis-jms-server/target/artemis-jms-server-2.31.0-SNAPSHOT-sources.jar> to org.apache.activemq/artemis-jms-server/2.31.0-SNAPSHOT/artemis-jms-server-2.31.0-SNAPSHOT-sources.jar
[JENKINS] Archiving <https://ci-builds.apache.org/job/ActiveMQ/job/ActiveMQ-Artemis-JDK11/ws/artemis-cli/pom.xml> to org.apache.activemq/artemis-cli/2.31.0-SNAPSHOT/artemis-cli-2.31.0-SNAPSHOT.pom
[JENKINS] Archiving <https://ci-builds.apache.org/job/ActiveMQ/job/ActiveMQ-Artemis-JDK11/ws/artemis-cli/target/artemis-cli-2.31.0-SNAPSHOT.jar> to org.apache.activemq/artemis-cli/2.31.0-SNAPSHOT/artemis-cli-2.31.0-SNAPSHOT.jar
[JENKINS] Archiving <https://ci-builds.apache.org/job/ActiveMQ/job/ActiveMQ-Artemis-JDK11/ws/artemis-cli/target/artemis-cli-2.31.0-SNAPSHOT-sources.jar> to org.apache.activemq/artemis-cli/2.31.0-SNAPSHOT/artemis-cli-2.31.0-SNAPSHOT-sources.jar
[JENKINS] Archiving <https://ci-builds.apache.org/job/ActiveMQ/job/ActiveMQ-Artemis-JDK11/ws/artemis-jakarta-client-all/dependency-reduced-pom.xml> to org.apache.activemq/artemis-jakarta-client-all/2.31.0-SNAPSHOT/artemis-jakarta-client-all-2.31.0-SNAPSHOT.pom
[JENKINS] Archiving <https://ci-builds.apache.org/job/ActiveMQ/job/ActiveMQ-Artemis-JDK11/ws/artemis-jakarta-client-all/target/artemis-jakarta-client-all-2.31.0-SNAPSHOT.jar> to org.apache.activemq/artemis-jakarta-client-all/2.31.0-SNAPSHOT/artemis-jakarta-client-all-2.31.0-SNAPSHOT.jar
[JENKINS] Archiving <https://ci-builds.apache.org/job/ActiveMQ/job/ActiveMQ-Artemis-JDK11/ws/artemis-jakarta-client-all/target/artemis-jakarta-client-all-2.31.0-SNAPSHOT-sources.jar> to org.apache.activemq/artemis-jakarta-client-all/2.31.0-SNAPSHOT/artemis-jakarta-client-all-2.31.0-SNAPSHOT-sources.jar
[JENKINS] Archiving <https://ci-builds.apache.org/job/ActiveMQ/job/ActiveMQ-Artemis-JDK11/ws/artemis-core-client-all/dependency-reduced-pom.xml> to org.apache.activemq/artemis-core-client-all/2.31.0-SNAPSHOT/artemis-core-client-all-2.31.0-SNAPSHOT.pom
[JENKINS] Archiving <https://ci-builds.apache.org/job/ActiveMQ/job/ActiveMQ-Artemis-JDK11/ws/artemis-core-client-all/target/artemis-core-client-all-2.31.0-SNAPSHOT.jar> to org.apache.activemq/artemis-core-client-all/2.31.0-SNAPSHOT/artemis-core-client-all-2.31.0-SNAPSHOT.jar
[JENKINS] Archiving <https://ci-builds.apache.org/job/ActiveMQ/job/ActiveMQ-Artemis-JDK11/ws/artemis-core-client-all/target/artemis-core-client-all-2.31.0-SNAPSHOT-sources.jar> to org.apache.activemq/artemis-core-client-all/2.31.0-SNAPSHOT/artemis-core-client-all-2.31.0-SNAPSHOT-sources.jar
[JENKINS] Archiving <https://ci-builds.apache.org/job/ActiveMQ/job/ActiveMQ-Artemis-JDK11/ws/tests/pom.xml> to org.apache.activemq.tests/artemis-tests-pom/2.31.0-SNAPSHOT/artemis-tests-pom-2.31.0-SNAPSHOT.pom
[JENKINS] Archiving <https://ci-builds.apache.org/job/ActiveMQ/job/ActiveMQ-Artemis-JDK11/ws/artemis-protocols/artemis-openwire-protocol/pom.xml> to org.apache.activemq/artemis-openwire-protocol/2.31.0-SNAPSHOT/artemis-openwire-protocol-2.31.0-SNAPSHOT.pom
[JENKINS] Archiving <https://ci-builds.apache.org/job/ActiveMQ/job/ActiveMQ-Artemis-JDK11/ws/artemis-protocols/artemis-openwire-protocol/target/artemis-openwire-protocol-2.31.0-SNAPSHOT.jar> to org.apache.activemq/artemis-openwire-protocol/2.31.0-SNAPSHOT/artemis-openwire-protocol-2.31.0-SNAPSHOT.jar
[JENKINS] Archiving <https://ci-builds.apache.org/job/ActiveMQ/job/ActiveMQ-Artemis-JDK11/ws/artemis-protocols/artemis-openwire-protocol/target/artemis-openwire-protocol-2.31.0-SNAPSHOT-sources.jar> to org.apache.activemq/artemis-openwire-protocol/2.31.0-SNAPSHOT/artemis-openwire-protocol-2.31.0-SNAPSHOT-sources.jar
[JENKINS] Archiving <https://ci-builds.apache.org/job/ActiveMQ/job/ActiveMQ-Artemis-JDK11/ws/artemis-image/pom.xml> to org.apache.activemq/artemis-image/2.31.0-SNAPSHOT/artemis-image-2.31.0-SNAPSHOT.pom
[JENKINS] Archiving <https://ci-builds.apache.org/job/ActiveMQ/job/ActiveMQ-Artemis-JDK11/ws/artemis-distribution/pom.xml> to org.apache.activemq/apache-artemis/2.31.0-SNAPSHOT/apache-artemis-2.31.0-SNAPSHOT.pom
[JENKINS] Archiving <https://ci-builds.apache.org/job/ActiveMQ/job/ActiveMQ-Artemis-JDK11/ws/artemis-distribution/target/apache-artemis-2.31.0-SNAPSHOT-bin.zip> to org.apache.activemq/apache-artemis/2.31.0-SNAPSHOT/apache-artemis-2.31.0-SNAPSHOT-bin.zip
[JENKINS] Archiving <https://ci-builds.apache.org/job/ActiveMQ/job/ActiveMQ-Artemis-JDK11/ws/artemis-distribution/target/apache-artemis-2.31.0-SNAPSHOT-bin.tar.gz> to org.apache.activemq/apache-artemis/2.31.0-SNAPSHOT/apache-artemis-2.31.0-SNAPSHOT-bin.tar.gz
[JENKINS] Archiving <https://ci-builds.apache.org/job/ActiveMQ/job/ActiveMQ-Artemis-JDK11/ws/artemis-hawtio/artemis-console/pom.xml> to org.apache.activemq/artemis-console/2.31.0-SNAPSHOT/artemis-console-2.31.0-SNAPSHOT.pom
[JENKINS] Archiving <https://ci-builds.apache.org/job/ActiveMQ/job/ActiveMQ-Artemis-JDK11/ws/artemis-hawtio/artemis-console/target/artemis-console-2.31.0-SNAPSHOT.war> to org.apache.activemq/artemis-console/2.31.0-SNAPSHOT/artemis-console-2.31.0-SNAPSHOT.war
[JENKINS] Archiving <https://ci-builds.apache.org/job/ActiveMQ/job/ActiveMQ-Artemis-JDK11/ws/artemis-hawtio/artemis-console/target/artemis-console-2.31.0-SNAPSHOT-sources.jar> to org.apache.activemq/artemis-console/2.31.0-SNAPSHOT/artemis-console-2.31.0-SNAPSHOT-sources.jar
[JENKINS] Archiving <https://ci-builds.apache.org/job/ActiveMQ/job/ActiveMQ-Artemis-JDK11/ws/tests/artemis-test-support/pom.xml> to org.apache.activemq.tests/artemis-test-support/2.31.0-SNAPSHOT/artemis-test-support-2.31.0-SNAPSHOT.pom
[JENKINS] Archiving <https://ci-builds.apache.org/job/ActiveMQ/job/ActiveMQ-Artemis-JDK11/ws/tests/artemis-test-support/target/artemis-test-support-2.31.0-SNAPSHOT.jar> to org.apache.activemq.tests/artemis-test-support/2.31.0-SNAPSHOT/artemis-test-support-2.31.0-SNAPSHOT.jar
[JENKINS] Archiving <https://ci-builds.apache.org/job/ActiveMQ/job/ActiveMQ-Artemis-JDK11/ws/tests/artemis-test-support/target/artemis-test-support-2.31.0-SNAPSHOT-sources.jar> to org.apache.activemq.tests/artemis-test-support/2.31.0-SNAPSHOT/artemis-test-support-2.31.0-SNAPSHOT-sources.jar
[JENKINS] Archiving <https://ci-builds.apache.org/job/ActiveMQ/job/ActiveMQ-Artemis-JDK11/ws/artemis-selector/pom.xml> to org.apache.activemq/artemis-selector/2.31.0-SNAPSHOT/artemis-selector-2.31.0-SNAPSHOT.pom
[JENKINS] Archiving <https://ci-builds.apache.org/job/ActiveMQ/job/ActiveMQ-Artemis-JDK11/ws/artemis-selector/target/artemis-selector-2.31.0-SNAPSHOT.jar> to org.apache.activemq/artemis-selector/2.31.0-SNAPSHOT/artemis-selector-2.31.0-SNAPSHOT.jar
[JENKINS] Archiving <https://ci-builds.apache.org/job/ActiveMQ/job/ActiveMQ-Artemis-JDK11/ws/artemis-selector/target/artemis-selector-2.31.0-SNAPSHOT-sources.jar> to org.apache.activemq/artemis-selector/2.31.0-SNAPSHOT/artemis-selector-2.31.0-SNAPSHOT-sources.jar
[JENKINS] Archiving <https://ci-builds.apache.org/job/ActiveMQ/job/ActiveMQ-Artemis-JDK11/ws/artemis-jdbc-store/pom.xml> to org.apache.activemq/artemis-jdbc-store/2.31.0-SNAPSHOT/artemis-jdbc-store-2.31.0-SNAPSHOT.pom
[JENKINS] Archiving <https://ci-builds.apache.org/job/ActiveMQ/job/ActiveMQ-Artemis-JDK11/ws/artemis-jdbc-store/target/artemis-jdbc-store-2.31.0-SNAPSHOT.jar> to org.apache.activemq/artemis-jdbc-store/2.31.0-SNAPSHOT/artemis-jdbc-store-2.31.0-SNAPSHOT.jar
[JENKINS] Archiving <https://ci-builds.apache.org/job/ActiveMQ/job/ActiveMQ-Artemis-JDK11/ws/artemis-jdbc-store/target/artemis-jdbc-store-2.31.0-SNAPSHOT-sources.jar> to org.apache.activemq/artemis-jdbc-store/2.31.0-SNAPSHOT/artemis-jdbc-store-2.31.0-SNAPSHOT-sources.jar
[JENKINS] Archiving <https://ci-builds.apache.org/job/ActiveMQ/job/ActiveMQ-Artemis-JDK11/ws/integration/activemq-spring-integration/pom.xml> to org.apache.activemq/artemis-spring-integration/2.31.0-SNAPSHOT/artemis-spring-integration-2.31.0-SNAPSHOT.pom
[JENKINS] Archiving <https://ci-builds.apache.org/job/ActiveMQ/job/ActiveMQ-Artemis-JDK11/ws/integration/activemq-spring-integration/target/artemis-spring-integration-2.31.0-SNAPSHOT.jar> to org.apache.activemq/artemis-spring-integration/2.31.0-SNAPSHOT/artemis-spring-integration-2.31.0-SNAPSHOT.jar
[JENKINS] Archiving <https://ci-builds.apache.org/job/ActiveMQ/job/ActiveMQ-Artemis-JDK11/ws/integration/activemq-spring-integration/target/artemis-spring-integration-2.31.0-SNAPSHOT-sources.jar> to org.apache.activemq/artemis-spring-integration/2.31.0-SNAPSHOT/artemis-spring-integration-2.31.0-SNAPSHOT-sources.jar
[JENKINS] Archiving <https://ci-builds.apache.org/job/ActiveMQ/job/ActiveMQ-Artemis-JDK11/ws/artemis-quorum-ri/pom.xml> to org.apache.activemq/artemis-quorum-ri/2.31.0-SNAPSHOT/artemis-quorum-ri-2.31.0-SNAPSHOT.pom
[JENKINS] Archiving <https://ci-builds.apache.org/job/ActiveMQ/job/ActiveMQ-Artemis-JDK11/ws/artemis-quorum-ri/target/artemis-quorum-ri-2.31.0-SNAPSHOT.jar> to org.apache.activemq/artemis-quorum-ri/2.31.0-SNAPSHOT/artemis-quorum-ri-2.31.0-SNAPSHOT.jar
[JENKINS] Archiving <https://ci-builds.apache.org/job/ActiveMQ/job/ActiveMQ-Artemis-JDK11/ws/artemis-quorum-ri/target/artemis-quorum-ri-2.31.0-SNAPSHOT-sources.jar> to org.apache.activemq/artemis-quorum-ri/2.31.0-SNAPSHOT/artemis-quorum-ri-2.31.0-SNAPSHOT-sources.jar
[JENKINS] Archiving <https://ci-builds.apache.org/job/ActiveMQ/job/ActiveMQ-Artemis-JDK11/ws/artemis-web/pom.xml> to org.apache.activemq/artemis-web/2.31.0-SNAPSHOT/artemis-web-2.31.0-SNAPSHOT.pom
[JENKINS] Archiving <https://ci-builds.apache.org/job/ActiveMQ/job/ActiveMQ-Artemis-JDK11/ws/artemis-web/target/artemis-web-2.31.0-SNAPSHOT.jar> to org.apache.activemq/artemis-web/2.31.0-SNAPSHOT/artemis-web-2.31.0-SNAPSHOT.jar
[JENKINS] Archiving <https://ci-builds.apache.org/job/ActiveMQ/job/ActiveMQ-Artemis-JDK11/ws/artemis-web/target/artemis-web-2.31.0-SNAPSHOT-sources.jar> to org.apache.activemq/artemis-web/2.31.0-SNAPSHOT/artemis-web-2.31.0-SNAPSHOT-sources.jar
[JENKINS] Archiving <https://ci-builds.apache.org/job/ActiveMQ/job/ActiveMQ-Artemis-JDK11/ws/artemis-junit/artemis-junit-commons/pom.xml> to org.apache.activemq/artemis-junit-commons/2.31.0-SNAPSHOT/artemis-junit-commons-2.31.0-SNAPSHOT.pom
[JENKINS] Archiving <https://ci-builds.apache.org/job/ActiveMQ/job/ActiveMQ-Artemis-JDK11/ws/artemis-junit/artemis-junit-commons/target/artemis-junit-commons-2.31.0-SNAPSHOT.jar> to org.apache.activemq/artemis-junit-commons/2.31.0-SNAPSHOT/artemis-junit-commons-2.31.0-SNAPSHOT.jar
[JENKINS] Archiving <https://ci-builds.apache.org/job/ActiveMQ/job/ActiveMQ-Artemis-JDK11/ws/artemis-junit/artemis-junit-commons/target/artemis-junit-commons-2.31.0-SNAPSHOT-sources.jar> to org.apache.activemq/artemis-junit-commons/2.31.0-SNAPSHOT/artemis-junit-commons-2.31.0-SNAPSHOT-sources.jar
[JENKINS] Archiving <https://ci-builds.apache.org/job/ActiveMQ/job/ActiveMQ-Artemis-JDK11/ws/artemis-cdi-client/pom.xml> to org.apache.activemq/artemis-cdi-client/2.31.0-SNAPSHOT/artemis-cdi-client-2.31.0-SNAPSHOT.pom
[JENKINS] Archiving <https://ci-builds.apache.org/job/ActiveMQ/job/ActiveMQ-Artemis-JDK11/ws/artemis-cdi-client/target/artemis-cdi-client-2.31.0-SNAPSHOT.jar> to org.apache.activemq/artemis-cdi-client/2.31.0-SNAPSHOT/artemis-cdi-client-2.31.0-SNAPSHOT.jar
[JENKINS] Archiving <https://ci-builds.apache.org/job/ActiveMQ/job/ActiveMQ-Artemis-JDK11/ws/artemis-cdi-client/target/artemis-cdi-client-2.31.0-SNAPSHOT-sources.jar> to org.apache.activemq/artemis-cdi-client/2.31.0-SNAPSHOT/artemis-cdi-client-2.31.0-SNAPSHOT-sources.jar
[JENKINS] Archiving <https://ci-builds.apache.org/job/ActiveMQ/job/ActiveMQ-Artemis-JDK11/ws/tests/jms-tests/pom.xml> to org.apache.activemq.tests/jms-tests/2.31.0-SNAPSHOT/jms-tests-2.31.0-SNAPSHOT.pom
[JENKINS] Archiving <https://ci-builds.apache.org/job/ActiveMQ/job/ActiveMQ-Artemis-JDK11/ws/tests/jms-tests/target/jms-tests-2.31.0-SNAPSHOT.jar> to org.apache.activemq.tests/jms-tests/2.31.0-SNAPSHOT/jms-tests-2.31.0-SNAPSHOT.jar
[JENKINS] Archiving <https://ci-builds.apache.org/job/ActiveMQ/job/ActiveMQ-Artemis-JDK11/ws/tests/jms-tests/target/jms-tests-2.31.0-SNAPSHOT-sources.jar> to org.apache.activemq.tests/jms-tests/2.31.0-SNAPSHOT/jms-tests-2.31.0-SNAPSHOT-sources.jar
[JENKINS] Archiving <https://ci-builds.apache.org/job/ActiveMQ/job/ActiveMQ-Artemis-JDK11/ws/artemis-ra/pom.xml> to org.apache.activemq/artemis-ra/2.31.0-SNAPSHOT/artemis-ra-2.31.0-SNAPSHOT.pom
[JENKINS] Archiving <https://ci-builds.apache.org/job/ActiveMQ/job/ActiveMQ-Artemis-JDK11/ws/artemis-ra/target/artemis-ra-2.31.0-SNAPSHOT.jar> to org.apache.activemq/artemis-ra/2.31.0-SNAPSHOT/artemis-ra-2.31.0-SNAPSHOT.jar
[JENKINS] Archiving <https://ci-builds.apache.org/job/ActiveMQ/job/ActiveMQ-Artemis-JDK11/ws/artemis-ra/target/artemis-ra-2.31.0-SNAPSHOT-sources.jar> to org.apache.activemq/artemis-ra/2.31.0-SNAPSHOT/artemis-ra-2.31.0-SNAPSHOT-sources.jar
[JENKINS] Archiving <https://ci-builds.apache.org/job/ActiveMQ/job/ActiveMQ-Artemis-JDK11/ws/pom.xml> to org.apache.activemq/artemis-pom/2.31.0-SNAPSHOT/artemis-pom-2.31.0-SNAPSHOT.pom
[JENKINS] Archiving <https://ci-builds.apache.org/job/ActiveMQ/job/ActiveMQ-Artemis-JDK11/ws/tests/karaf-client-integration-tests/pom.xml> to org.apache.activemq.tests/karaf-client-integration-tests/2.31.0-SNAPSHOT/karaf-client-integration-tests-2.31.0-SNAPSHOT.pom
[JENKINS] Archiving <https://ci-builds.apache.org/job/ActiveMQ/job/ActiveMQ-Artemis-JDK11/ws/tests/karaf-client-integration-tests/target/karaf-client-integration-tests-2.31.0-SNAPSHOT.jar> to org.apache.activemq.tests/karaf-client-integration-tests/2.31.0-SNAPSHOT/karaf-client-integration-tests-2.31.0-SNAPSHOT.jar
[JENKINS] Archiving <https://ci-builds.apache.org/job/ActiveMQ/job/ActiveMQ-Artemis-JDK11/ws/tests/karaf-client-integration-tests/target/karaf-client-integration-tests-2.31.0-SNAPSHOT-sources.jar> to org.apache.activemq.tests/karaf-client-integration-tests/2.31.0-SNAPSHOT/karaf-client-integration-tests-2.31.0-SNAPSHOT-sources.jar
[JENKINS] Archiving <https://ci-builds.apache.org/job/ActiveMQ/job/ActiveMQ-Artemis-JDK11/ws/artemis-maven-plugin/pom.xml> to org.apache.activemq/artemis-maven-plugin/2.31.0-SNAPSHOT/artemis-maven-plugin-2.31.0-SNAPSHOT.pom
[JENKINS] Archiving <https://ci-builds.apache.org/job/ActiveMQ/job/ActiveMQ-Artemis-JDK11/ws/artemis-maven-plugin/target/artemis-maven-plugin-2.31.0-SNAPSHOT.jar> to org.apache.activemq/artemis-maven-plugin/2.31.0-SNAPSHOT/artemis-maven-plugin-2.31.0-SNAPSHOT.jar
[JENKINS] Archiving <https://ci-builds.apache.org/job/ActiveMQ/job/ActiveMQ-Artemis-JDK11/ws/artemis-maven-plugin/target/artemis-maven-plugin-2.31.0-SNAPSHOT-sources.jar> to org.apache.activemq/artemis-maven-plugin/2.31.0-SNAPSHOT/artemis-maven-plugin-2.31.0-SNAPSHOT-sources.jar
[JENKINS] Archiving <https://ci-builds.apache.org/job/ActiveMQ/job/ActiveMQ-Artemis-JDK11/ws/artemis-junit/artemis-junit-4/pom.xml> to org.apache.activemq/artemis-junit/2.31.0-SNAPSHOT/artemis-junit-2.31.0-SNAPSHOT.pom
[JENKINS] Archiving <https://ci-builds.apache.org/job/ActiveMQ/job/ActiveMQ-Artemis-JDK11/ws/artemis-junit/artemis-junit-4/target/artemis-junit-2.31.0-SNAPSHOT.jar> to org.apache.activemq/artemis-junit/2.31.0-SNAPSHOT/artemis-junit-2.31.0-SNAPSHOT.jar
[JENKINS] Archiving <https://ci-builds.apache.org/job/ActiveMQ/job/ActiveMQ-Artemis-JDK11/ws/artemis-junit/artemis-junit-4/target/artemis-junit-2.31.0-SNAPSHOT-sources.jar> to org.apache.activemq/artemis-junit/2.31.0-SNAPSHOT/artemis-junit-2.31.0-SNAPSHOT-sources.jar
[JENKINS] Archiving <https://ci-builds.apache.org/job/ActiveMQ/job/ActiveMQ-Artemis-JDK11/ws/artemis-service-extensions/pom.xml> to org.apache.activemq/artemis-service-extensions/2.31.0-SNAPSHOT/artemis-service-extensions-2.31.0-SNAPSHOT.pom
[JENKINS] Archiving <https://ci-builds.apache.org/job/ActiveMQ/job/ActiveMQ-Artemis-JDK11/ws/artemis-service-extensions/target/artemis-service-extensions-2.31.0-SNAPSHOT.jar> to org.apache.activemq/artemis-service-extensions/2.31.0-SNAPSHOT/artemis-service-extensions-2.31.0-SNAPSHOT.jar
[JENKINS] Archiving <https://ci-builds.apache.org/job/ActiveMQ/job/ActiveMQ-Artemis-JDK11/ws/artemis-service-extensions/target/artemis-service-extensions-2.31.0-SNAPSHOT-sources.jar> to org.apache.activemq/artemis-service-extensions/2.31.0-SNAPSHOT/artemis-service-extensions-2.31.0-SNAPSHOT-sources.jar
[JENKINS] Archiving <https://ci-builds.apache.org/job/ActiveMQ/job/ActiveMQ-Artemis-JDK11/ws/artemis-server-osgi/pom.xml> to org.apache.activemq/artemis-server-osgi/2.31.0-SNAPSHOT/artemis-server-osgi-2.31.0-SNAPSHOT.pom
[JENKINS] Archiving <https://ci-builds.apache.org/job/ActiveMQ/job/ActiveMQ-Artemis-JDK11/ws/artemis-server-osgi/target/artemis-server-osgi-2.31.0-SNAPSHOT.jar> to org.apache.activemq/artemis-server-osgi/2.31.0-SNAPSHOT/artemis-server-osgi-2.31.0-SNAPSHOT.jar
[JENKINS] Archiving <https://ci-builds.apache.org/job/ActiveMQ/job/ActiveMQ-Artemis-JDK11/ws/artemis-server-osgi/target/artemis-server-osgi-2.31.0-SNAPSHOT-sources.jar> to org.apache.activemq/artemis-server-osgi/2.31.0-SNAPSHOT/artemis-server-osgi-2.31.0-SNAPSHOT-sources.jar
[JENKINS] Archiving <https://ci-builds.apache.org/job/ActiveMQ/job/ActiveMQ-Artemis-JDK11/ws/artemis-junit/pom.xml> to org.apache.activemq/artemis-junit-parent/2.31.0-SNAPSHOT/artemis-junit-parent-2.31.0-SNAPSHOT.pom
[JENKINS] Archiving <https://ci-builds.apache.org/job/ActiveMQ/job/ActiveMQ-Artemis-JDK11/ws/tests/unit-tests/pom.xml> to org.apache.activemq.tests/unit-tests/2.31.0-SNAPSHOT/unit-tests-2.31.0-SNAPSHOT.pom
[JENKINS] Archiving <https://ci-builds.apache.org/job/ActiveMQ/job/ActiveMQ-Artemis-JDK11/ws/tests/unit-tests/target/unit-tests-2.31.0-SNAPSHOT.jar> to org.apache.activemq.tests/unit-tests/2.31.0-SNAPSHOT/unit-tests-2.31.0-SNAPSHOT.jar
[JENKINS] Archiving <https://ci-builds.apache.org/job/ActiveMQ/job/ActiveMQ-Artemis-JDK11/ws/tests/unit-tests/target/unit-tests-2.31.0-SNAPSHOT-tests.jar> to org.apache.activemq.tests/unit-tests/2.31.0-SNAPSHOT/unit-tests-2.31.0-SNAPSHOT-tests.jar
[JENKINS] Archiving <https://ci-builds.apache.org/job/ActiveMQ/job/ActiveMQ-Artemis-JDK11/ws/tests/unit-tests/target/unit-tests-2.31.0-SNAPSHOT-sources.jar> to org.apache.activemq.tests/unit-tests/2.31.0-SNAPSHOT/unit-tests-2.31.0-SNAPSHOT-sources.jar
[JENKINS] Archiving <https://ci-builds.apache.org/job/ActiveMQ/job/ActiveMQ-Artemis-JDK11/ws/tests/leak-tests/pom.xml> to org.apache.activemq.tests/leak-tests/2.31.0-SNAPSHOT/leak-tests-2.31.0-SNAPSHOT.pom
[JENKINS] Archiving <https://ci-builds.apache.org/job/ActiveMQ/job/ActiveMQ-Artemis-JDK11/ws/artemis-protocols/artemis-stomp-protocol/pom.xml> to org.apache.activemq/artemis-stomp-protocol/2.31.0-SNAPSHOT/artemis-stomp-protocol-2.31.0-SNAPSHOT.pom
[JENKINS] Archiving <https://ci-builds.apache.org/job/ActiveMQ/job/ActiveMQ-Artemis-JDK11/ws/artemis-protocols/artemis-stomp-protocol/target/artemis-stomp-protocol-2.31.0-SNAPSHOT.jar> to org.apache.activemq/artemis-stomp-protocol/2.31.0-SNAPSHOT/artemis-stomp-protocol-2.31.0-SNAPSHOT.jar
[JENKINS] Archiving <https://ci-builds.apache.org/job/ActiveMQ/job/ActiveMQ-Artemis-JDK11/ws/artemis-protocols/artemis-stomp-protocol/target/artemis-stomp-protocol-2.31.0-SNAPSHOT-sources.jar> to org.apache.activemq/artemis-stomp-protocol/2.31.0-SNAPSHOT/artemis-stomp-protocol-2.31.0-SNAPSHOT-sources.jar
[JENKINS] Archiving <https://ci-builds.apache.org/job/ActiveMQ/job/ActiveMQ-Artemis-JDK11/ws/artemis-protocols/artemis-hornetq-protocol/pom.xml> to org.apache.activemq/artemis-hornetq-protocol/2.31.0-SNAPSHOT/artemis-hornetq-protocol-2.31.0-SNAPSHOT.pom
[JENKINS] Archiving <https://ci-builds.apache.org/job/ActiveMQ/job/ActiveMQ-Artemis-JDK11/ws/artemis-protocols/artemis-hornetq-protocol/target/artemis-hornetq-protocol-2.31.0-SNAPSHOT.jar> to org.apache.activemq/artemis-hornetq-protocol/2.31.0-SNAPSHOT/artemis-hornetq-protocol-2.31.0-SNAPSHOT.jar
[JENKINS] Archiving <https://ci-builds.apache.org/job/ActiveMQ/job/ActiveMQ-Artemis-JDK11/ws/artemis-protocols/artemis-hornetq-protocol/target/artemis-hornetq-protocol-2.31.0-SNAPSHOT-sources.jar> to org.apache.activemq/artemis-hornetq-protocol/2.31.0-SNAPSHOT/artemis-hornetq-protocol-2.31.0-SNAPSHOT-sources.jar
[JENKINS] Archiving <https://ci-builds.apache.org/job/ActiveMQ/job/ActiveMQ-Artemis-JDK11/ws/artemis-core-client-osgi/pom.xml> to org.apache.activemq/artemis-core-client-osgi/2.31.0-SNAPSHOT/artemis-core-client-osgi-2.31.0-SNAPSHOT.pom
[JENKINS] Archiving <https://ci-builds.apache.org/job/ActiveMQ/job/ActiveMQ-Artemis-JDK11/ws/artemis-core-client-osgi/target/artemis-core-client-osgi-2.31.0-SNAPSHOT.jar> to org.apache.activemq/artemis-core-client-osgi/2.31.0-SNAPSHOT/artemis-core-client-osgi-2.31.0-SNAPSHOT.jar
[JENKINS] Archiving <https://ci-builds.apache.org/job/ActiveMQ/job/ActiveMQ-Artemis-JDK11/ws/artemis-core-client-osgi/target/artemis-core-client-osgi-2.31.0-SNAPSHOT-sources.jar> to org.apache.activemq/artemis-core-client-osgi/2.31.0-SNAPSHOT/artemis-core-client-osgi-2.31.0-SNAPSHOT-sources.jar
[JENKINS] Archiving <https://ci-builds.apache.org/job/ActiveMQ/job/ActiveMQ-Artemis-JDK11/ws/tests/performance-tests/pom.xml> to org.apache.activemq.tests/performance-tests/2.31.0-SNAPSHOT/performance-tests-2.31.0-SNAPSHOT.pom
[JENKINS] Archiving <https://ci-builds.apache.org/job/ActiveMQ/job/ActiveMQ-Artemis-JDK11/ws/tests/performance-tests/target/performance-tests-2.31.0-SNAPSHOT.jar> to org.apache.activemq.tests/performance-tests/2.31.0-SNAPSHOT/performance-tests-2.31.0-SNAPSHOT.jar
[JENKINS] Archiving <https://ci-builds.apache.org/job/ActiveMQ/job/ActiveMQ-Artemis-JDK11/ws/tests/performance-tests/target/performance-tests-2.31.0-SNAPSHOT-sources.jar> to org.apache.activemq.tests/performance-tests/2.31.0-SNAPSHOT/performance-tests-2.31.0-SNAPSHOT-sources.jar
[JENKINS] Archiving <https://ci-builds.apache.org/job/ActiveMQ/job/ActiveMQ-Artemis-JDK11/ws/artemis-features/pom.xml> to org.apache.activemq/artemis-features/2.31.0-SNAPSHOT/artemis-features-2.31.0-SNAPSHOT.pom
[JENKINS] Archiving <https://ci-builds.apache.org/job/ActiveMQ/job/ActiveMQ-Artemis-JDK11/ws/artemis-features/target/classes/features.xml> to org.apache.activemq/artemis-features/2.31.0-SNAPSHOT/artemis-features-2.31.0-SNAPSHOT-features.xml
[JENKINS] Archiving <https://ci-builds.apache.org/job/ActiveMQ/job/ActiveMQ-Artemis-JDK11/ws/artemis-features/target/classes/artemis.xml> to org.apache.activemq/artemis-features/2.31.0-SNAPSHOT/artemis-features-2.31.0-SNAPSHOT-artemis.xml
[JENKINS] Archiving <https://ci-builds.apache.org/job/ActiveMQ/job/ActiveMQ-Artemis-JDK11/ws/artemis-features/target/classes/org.apache.activemq.artemis.cfg> to org.apache.activemq/artemis-features/2.31.0-SNAPSHOT/artemis-features-2.31.0-SNAPSHOT.cfg
[JENKINS] Archiving <https://ci-builds.apache.org/job/ActiveMQ/job/ActiveMQ-Artemis-JDK11/ws/artemis-commons/dependency-reduced-pom.xml> to org.apache.activemq/artemis-commons/2.31.0-SNAPSHOT/artemis-commons-2.31.0-SNAPSHOT.pom
[JENKINS] Archiving <https://ci-builds.apache.org/job/ActiveMQ/job/ActiveMQ-Artemis-JDK11/ws/artemis-commons/target/artemis-commons-2.31.0-SNAPSHOT.jar> to org.apache.activemq/artemis-commons/2.31.0-SNAPSHOT/artemis-commons-2.31.0-SNAPSHOT.jar
[JENKINS] Archiving <https://ci-builds.apache.org/job/ActiveMQ/job/ActiveMQ-Artemis-JDK11/ws/artemis-commons/target/artemis-commons-2.31.0-SNAPSHOT-sources.jar> to org.apache.activemq/artemis-commons/2.31.0-SNAPSHOT/artemis-commons-2.31.0-SNAPSHOT-sources.jar
[JENKINS] Archiving <https://ci-builds.apache.org/job/ActiveMQ/job/ActiveMQ-Artemis-JDK11/ws/artemis-journal/pom.xml> to org.apache.activemq/artemis-journal/2.31.0-SNAPSHOT/artemis-journal-2.31.0-SNAPSHOT.pom
[JENKINS] Archiving <https://ci-builds.apache.org/job/ActiveMQ/job/ActiveMQ-Artemis-JDK11/ws/artemis-journal/target/artemis-journal-2.31.0-SNAPSHOT.jar> to org.apache.activemq/artemis-journal/2.31.0-SNAPSHOT/artemis-journal-2.31.0-SNAPSHOT.jar
[JENKINS] Archiving <https://ci-builds.apache.org/job/ActiveMQ/job/ActiveMQ-Artemis-JDK11/ws/artemis-journal/target/artemis-journal-2.31.0-SNAPSHOT-sources.jar> to org.apache.activemq/artemis-journal/2.31.0-SNAPSHOT/artemis-journal-2.31.0-SNAPSHOT-sources.jar
[JENKINS] Archiving <https://ci-builds.apache.org/job/ActiveMQ/job/ActiveMQ-Artemis-JDK11/ws/tests/soak-tests/pom.xml> to org.apache.activemq.tests/soak-tests/2.31.0-SNAPSHOT/soak-tests-2.31.0-SNAPSHOT.pom
[JENKINS] Archiving <https://ci-builds.apache.org/job/ActiveMQ/job/ActiveMQ-Artemis-JDK11/ws/tests/soak-tests/target/soak-tests-2.31.0-SNAPSHOT.jar> to org.apache.activemq.tests/soak-tests/2.31.0-SNAPSHOT/soak-tests-2.31.0-SNAPSHOT.jar
[JENKINS] Archiving <https://ci-builds.apache.org/job/ActiveMQ/job/ActiveMQ-Artemis-JDK11/ws/tests/soak-tests/target/soak-tests-2.31.0-SNAPSHOT-sources.jar> to org.apache.activemq.tests/soak-tests/2.31.0-SNAPSHOT/soak-tests-2.31.0-SNAPSHOT-sources.jar
[JENKINS] Archiving <https://ci-builds.apache.org/job/ActiveMQ/job/ActiveMQ-Artemis-JDK11/ws/artemis-core-client/pom.xml> to org.apache.activemq/artemis-core-client/2.31.0-SNAPSHOT/artemis-core-client-2.31.0-SNAPSHOT.pom
[JENKINS] Archiving <https://ci-builds.apache.org/job/ActiveMQ/job/ActiveMQ-Artemis-JDK11/ws/artemis-core-client/target/artemis-core-client-2.31.0-SNAPSHOT.jar> to org.apache.activemq/artemis-core-client/2.31.0-SNAPSHOT/artemis-core-client-2.31.0-SNAPSHOT.jar
[JENKINS] Archiving <https://ci-builds.apache.org/job/ActiveMQ/job/ActiveMQ-Artemis-JDK11/ws/artemis-core-client/target/artemis-core-client-2.31.0-SNAPSHOT-sources.jar> to org.apache.activemq/artemis-core-client/2.31.0-SNAPSHOT/artemis-core-client-2.31.0-SNAPSHOT-sources.jar
[JENKINS] Archiving <https://ci-builds.apache.org/job/ActiveMQ/job/ActiveMQ-Artemis-JDK11/ws/tests/integration-tests-isolated/pom.xml> to org.apache.activemq.tests/integration-tests-isolated/2.31.0-SNAPSHOT/integration-tests-isolated-2.31.0-SNAPSHOT.pom
[JENKINS] Archiving <https://ci-builds.apache.org/job/ActiveMQ/job/ActiveMQ-Artemis-JDK11/ws/tests/integration-tests-isolated/target/integration-tests-isolated-2.31.0-SNAPSHOT.jar> to org.apache.activemq.tests/integration-tests-isolated/2.31.0-SNAPSHOT/integration-tests-isolated-2.31.0-SNAPSHOT.jar
[JENKINS] Archiving <https://ci-builds.apache.org/job/ActiveMQ/job/ActiveMQ-Artemis-JDK11/ws/tests/integration-tests-isolated/target/integration-tests-isolated-2.31.0-SNAPSHOT-tests.jar> to org.apache.activemq.tests/integration-tests-isolated/2.31.0-SNAPSHOT/integration-tests-isolated-2.31.0-SNAPSHOT-tests.jar
[JENKINS] Archiving <https://ci-builds.apache.org/job/ActiveMQ/job/ActiveMQ-Artemis-JDK11/ws/tests/integration-tests-isolated/target/integration-tests-isolated-2.31.0-SNAPSHOT-sources.jar> to org.apache.activemq.tests/integration-tests-isolated/2.31.0-SNAPSHOT/integration-tests-isolated-2.31.0-SNAPSHOT-sources.jar
[JENKINS] Archiving <https://ci-builds.apache.org/job/ActiveMQ/job/ActiveMQ-Artemis-JDK11/ws/artemis-jakarta-ra/pom.xml> to org.apache.activemq/artemis-jakarta-ra/2.31.0-SNAPSHOT/artemis-jakarta-ra-2.31.0-SNAPSHOT.pom
[JENKINS] Archiving <https://ci-builds.apache.org/job/ActiveMQ/job/ActiveMQ-Artemis-JDK11/ws/artemis-jakarta-ra/target/artemis-jakarta-ra-2.31.0-SNAPSHOT.jar> to org.apache.activemq/artemis-jakarta-ra/2.31.0-SNAPSHOT/artemis-jakarta-ra-2.31.0-SNAPSHOT.jar
[JENKINS] Archiving <https://ci-builds.apache.org/job/ActiveMQ/job/ActiveMQ-Artemis-JDK11/ws/artemis-jakarta-ra/target/artemis-jakarta-ra-2.31.0-SNAPSHOT-sources.jar> to org.apache.activemq/artemis-jakarta-ra/2.31.0-SNAPSHOT/artemis-jakarta-ra-2.31.0-SNAPSHOT-sources.jar
[JENKINS] Archiving <https://ci-builds.apache.org/job/ActiveMQ/job/ActiveMQ-Artemis-JDK11/ws/tests/timing-tests/pom.xml> to org.apache.activemq.tests/timing-tests/2.31.0-SNAPSHOT/timing-tests-2.31.0-SNAPSHOT.pom
[JENKINS] Archiving <https://ci-builds.apache.org/job/ActiveMQ/job/ActiveMQ-Artemis-JDK11/ws/tests/timing-tests/target/timing-tests-2.31.0-SNAPSHOT.jar> to org.apache.activemq.tests/timing-tests/2.31.0-SNAPSHOT/timing-tests-2.31.0-SNAPSHOT.jar
[JENKINS] Archiving <https://ci-builds.apache.org/job/ActiveMQ/job/ActiveMQ-Artemis-JDK11/ws/tests/timing-tests/target/timing-tests-2.31.0-SNAPSHOT-sources.jar> to org.apache.activemq.tests/timing-tests/2.31.0-SNAPSHOT/timing-tests-2.31.0-SNAPSHOT-sources.jar
[JENKINS] Archiving <https://ci-builds.apache.org/job/ActiveMQ/job/ActiveMQ-Artemis-JDK11/ws/artemis-junit/artemis-junit-5/pom.xml> to org.apache.activemq/artemis-junit-5/2.31.0-SNAPSHOT/artemis-junit-5-2.31.0-SNAPSHOT.pom
[JENKINS] Archiving <https://ci-builds.apache.org/job/ActiveMQ/job/ActiveMQ-Artemis-JDK11/ws/artemis-junit/artemis-junit-5/target/artemis-junit-5-2.31.0-SNAPSHOT.jar> to org.apache.activemq/artemis-junit-5/2.31.0-SNAPSHOT/artemis-junit-5-2.31.0-SNAPSHOT.jar
[JENKINS] Archiving <https://ci-builds.apache.org/job/ActiveMQ/job/ActiveMQ-Artemis-JDK11/ws/artemis-junit/artemis-junit-5/target/artemis-junit-5-2.31.0-SNAPSHOT-sources.jar> to org.apache.activemq/artemis-junit-5/2.31.0-SNAPSHOT/artemis-junit-5-2.31.0-SNAPSHOT-sources.jar
[JENKINS] Archiving <https://ci-builds.apache.org/job/ActiveMQ/job/ActiveMQ-Artemis-JDK11/ws/artemis-jms-client-all/dependency-reduced-pom.xml> to org.apache.activemq/artemis-jms-client-all/2.31.0-SNAPSHOT/artemis-jms-client-all-2.31.0-SNAPSHOT.pom
[JENKINS] Archiving <https://ci-builds.apache.org/job/ActiveMQ/job/ActiveMQ-Artemis-JDK11/ws/artemis-jms-client-all/target/artemis-jms-client-all-2.31.0-SNAPSHOT.jar> to org.apache.activemq/artemis-jms-client-all/2.31.0-SNAPSHOT/artemis-jms-client-all-2.31.0-SNAPSHOT.jar
[JENKINS] Archiving <https://ci-builds.apache.org/job/ActiveMQ/job/ActiveMQ-Artemis-JDK11/ws/artemis-jms-client-all/target/artemis-jms-client-all-2.31.0-SNAPSHOT-sources.jar> to org.apache.activemq/artemis-jms-client-all/2.31.0-SNAPSHOT/artemis-jms-client-all-2.31.0-SNAPSHOT-sources.jar
[JENKINS] Archiving <https://ci-builds.apache.org/job/ActiveMQ/job/ActiveMQ-Artemis-JDK11/ws/artemis-protocols/pom.xml> to org.apache.activemq/artemis-protocols/2.31.0-SNAPSHOT/artemis-protocols-2.31.0-SNAPSHOT.pom
[JENKINS] Archiving <https://ci-builds.apache.org/job/ActiveMQ/job/ActiveMQ-Artemis-JDK11/ws/tests/karaf-server-integration-tests/pom.xml> to org.apache.activemq.tests/karaf-server-integration-tests/2.31.0-SNAPSHOT/karaf-server-integration-tests-2.31.0-SNAPSHOT.pom
[JENKINS] Archiving <https://ci-builds.apache.org/job/ActiveMQ/job/ActiveMQ-Artemis-JDK11/ws/tests/karaf-server-integration-tests/target/karaf-server-integration-tests-2.31.0-SNAPSHOT.jar> to org.apache.activemq.tests/karaf-server-integration-tests/2.31.0-SNAPSHOT/karaf-server-integration-tests-2.31.0-SNAPSHOT.jar
[JENKINS] Archiving <https://ci-builds.apache.org/job/ActiveMQ/job/ActiveMQ-Artemis-JDK11/ws/tests/karaf-server-integration-tests/target/karaf-server-integration-tests-2.31.0-SNAPSHOT-sources.jar> to org.apache.activemq.tests/karaf-server-integration-tests/2.31.0-SNAPSHOT/karaf-server-integration-tests-2.31.0-SNAPSHOT-sources.jar
[JENKINS] Archiving <https://ci-builds.apache.org/job/ActiveMQ/job/ActiveMQ-Artemis-JDK11/ws/artemis-hawtio/artemis-plugin/pom.xml> to org.apache.activemq/artemis-plugin/2.31.0-SNAPSHOT/artemis-plugin-2.31.0-SNAPSHOT.pom
[JENKINS] Archiving <https://ci-builds.apache.org/job/ActiveMQ/job/ActiveMQ-Artemis-JDK11/ws/artemis-hawtio/artemis-plugin/target/artemis-plugin-2.31.0-SNAPSHOT.war> to org.apache.activemq/artemis-plugin/2.31.0-SNAPSHOT/artemis-plugin-2.31.0-SNAPSHOT.war
[JENKINS] Archiving <https://ci-builds.apache.org/job/ActiveMQ/job/ActiveMQ-Artemis-JDK11/ws/artemis-hawtio/artemis-plugin/target/artemis-plugin-2.31.0-SNAPSHOT-sources.jar> to org.apache.activemq/artemis-plugin/2.31.0-SNAPSHOT/artemis-plugin-2.31.0-SNAPSHOT-sources.jar
[JENKINS] Archiving <https://ci-builds.apache.org/job/ActiveMQ/job/ActiveMQ-Artemis-JDK11/ws/artemis-quorum-api/pom.xml> to org.apache.activemq/artemis-quorum-api/2.31.0-SNAPSHOT/artemis-quorum-api-2.31.0-SNAPSHOT.pom
[JENKINS] Archiving <https://ci-builds.apache.org/job/ActiveMQ/job/ActiveMQ-Artemis-JDK11/ws/artemis-quorum-api/target/artemis-quorum-api-2.31.0-SNAPSHOT.jar> to org.apache.activemq/artemis-quorum-api/2.31.0-SNAPSHOT/artemis-quorum-api-2.31.0-SNAPSHOT.jar
[JENKINS] Archiving <https://ci-builds.apache.org/job/ActiveMQ/job/ActiveMQ-Artemis-JDK11/ws/artemis-quorum-api/target/artemis-quorum-api-2.31.0-SNAPSHOT-sources.jar> to org.apache.activemq/artemis-quorum-api/2.31.0-SNAPSHOT/artemis-quorum-api-2.31.0-SNAPSHOT-sources.jar
[JENKINS] Archiving <https://ci-builds.apache.org/job/ActiveMQ/job/ActiveMQ-Artemis-JDK11/ws/artemis-dto/pom.xml> to org.apache.activemq/artemis-dto/2.31.0-SNAPSHOT/artemis-dto-2.31.0-SNAPSHOT.pom
[JENKINS] Archiving <https://ci-builds.apache.org/job/ActiveMQ/job/ActiveMQ-Artemis-JDK11/ws/artemis-dto/target/artemis-dto-2.31.0-SNAPSHOT.jar> to org.apache.activemq/artemis-dto/2.31.0-SNAPSHOT/artemis-dto-2.31.0-SNAPSHOT.jar
[JENKINS] Archiving <https://ci-builds.apache.org/job/ActiveMQ/job/ActiveMQ-Artemis-JDK11/ws/artemis-dto/target/artemis-dto-2.31.0-SNAPSHOT-sources.jar> to org.apache.activemq/artemis-dto/2.31.0-SNAPSHOT/artemis-dto-2.31.0-SNAPSHOT-sources.jar
[JENKINS] Archiving <https://ci-builds.apache.org/job/ActiveMQ/job/ActiveMQ-Artemis-JDK11/ws/artemis-unit-test-support/pom.xml> to org.apache.activemq/artemis-unit-test-support/2.31.0-SNAPSHOT/artemis-unit-test-support-2.31.0-SNAPSHOT.pom
[JENKINS] Archiving <https://ci-builds.apache.org/job/ActiveMQ/job/ActiveMQ-Artemis-JDK11/ws/artemis-unit-test-support/target/artemis-unit-test-support-2.31.0-SNAPSHOT.jar> to org.apache.activemq/artemis-unit-test-support/2.31.0-SNAPSHOT/artemis-unit-test-support-2.31.0-SNAPSHOT.jar
[JENKINS] Archiving <https://ci-builds.apache.org/job/ActiveMQ/job/ActiveMQ-Artemis-JDK11/ws/artemis-unit-test-support/target/artemis-unit-test-support-2.31.0-SNAPSHOT-sources.jar> to org.apache.activemq/artemis-unit-test-support/2.31.0-SNAPSHOT/artemis-unit-test-support-2.31.0-SNAPSHOT-sources.jar
[JENKINS] Archiving <https://ci-builds.apache.org/job/ActiveMQ/job/ActiveMQ-Artemis-JDK11/ws/artemis-jakarta-service-extensions/pom.xml> to org.apache.activemq/artemis-jakarta-service-extensions/2.31.0-SNAPSHOT/artemis-jakarta-service-extensions-2.31.0-SNAPSHOT.pom
[JENKINS] Archiving <https://ci-builds.apache.org/job/ActiveMQ/job/ActiveMQ-Artemis-JDK11/ws/artemis-jakarta-service-extensions/target/artemis-jakarta-service-extensions-2.31.0-SNAPSHOT.jar> to org.apache.activemq/artemis-jakarta-service-extensions/2.31.0-SNAPSHOT/artemis-jakarta-service-extensions-2.31.0-SNAPSHOT.jar
[JENKINS] Archiving <https://ci-builds.apache.org/job/ActiveMQ/job/ActiveMQ-Artemis-JDK11/ws/artemis-jakarta-service-extensions/target/artemis-jakarta-service-extensions-2.31.0-SNAPSHOT-sources.jar> to org.apache.activemq/artemis-jakarta-service-extensions/2.31.0-SNAPSHOT/artemis-jakarta-service-extensions-2.31.0-SNAPSHOT-sources.jar
[JENKINS] Archiving <https://ci-builds.apache.org/job/ActiveMQ/job/ActiveMQ-Artemis-JDK11/ws/artemis-protocols/artemis-hqclient-protocol/pom.xml> to org.apache.activemq/artemis-hqclient-protocol/2.31.0-SNAPSHOT/artemis-hqclient-protocol-2.31.0-SNAPSHOT.pom
[JENKINS] Archiving <https://ci-builds.apache.org/job/ActiveMQ/job/ActiveMQ-Artemis-JDK11/ws/artemis-protocols/artemis-hqclient-protocol/target/artemis-hqclient-protocol-2.31.0-SNAPSHOT.jar> to org.apache.activemq/artemis-hqclient-protocol/2.31.0-SNAPSHOT/artemis-hqclient-protocol-2.31.0-SNAPSHOT.jar
[JENKINS] Archiving <https://ci-builds.apache.org/job/ActiveMQ/job/ActiveMQ-Artemis-JDK11/ws/artemis-protocols/artemis-hqclient-protocol/target/artemis-hqclient-protocol-2.31.0-SNAPSHOT-sources.jar> to org.apache.activemq/artemis-hqclient-protocol/2.31.0-SNAPSHOT/artemis-hqclient-protocol-2.31.0-SNAPSHOT-sources.jar
[JENKINS] Archiving <https://ci-builds.apache.org/job/ActiveMQ/job/ActiveMQ-Artemis-JDK11/ws/artemis-jms-client-osgi/pom.xml> to org.apache.activemq/artemis-jms-client-osgi/2.31.0-SNAPSHOT/artemis-jms-client-osgi-2.31.0-SNAPSHOT.pom
[JENKINS] Archiving <https://ci-builds.apache.org/job/ActiveMQ/job/ActiveMQ-Artemis-JDK11/ws/artemis-jms-client-osgi/target/artemis-jms-client-osgi-2.31.0-SNAPSHOT.jar> to org.apache.activemq/artemis-jms-client-osgi/2.31.0-SNAPSHOT/artemis-jms-client-osgi-2.31.0-SNAPSHOT.jar
[JENKINS] Archiving <https://ci-builds.apache.org/job/ActiveMQ/job/ActiveMQ-Artemis-JDK11/ws/artemis-jms-client-osgi/target/artemis-jms-client-osgi-2.31.0-SNAPSHOT-sources.jar> to org.apache.activemq/artemis-jms-client-osgi/2.31.0-SNAPSHOT/artemis-jms-client-osgi-2.31.0-SNAPSHOT-sources.jar
[JENKINS] Archiving <https://ci-builds.apache.org/job/ActiveMQ/job/ActiveMQ-Artemis-JDK11/ws/tests/integration-tests/pom.xml> to org.apache.activemq.tests/integration-tests/2.31.0-SNAPSHOT/integration-tests-2.31.0-SNAPSHOT.pom
[JENKINS] Archiving <https://ci-builds.apache.org/job/ActiveMQ/job/ActiveMQ-Artemis-JDK11/ws/tests/integration-tests/target/integration-tests-2.31.0-SNAPSHOT.jar> to org.apache.activemq.tests/integration-tests/2.31.0-SNAPSHOT/integration-tests-2.31.0-SNAPSHOT.jar
[JENKINS] Archiving <https://ci-builds.apache.org/job/ActiveMQ/job/ActiveMQ-Artemis-JDK11/ws/tests/integration-tests/target/integration-tests-2.31.0-SNAPSHOT-tests.jar> to org.apache.activemq.tests/integration-tests/2.31.0-SNAPSHOT/integration-tests-2.31.0-SNAPSHOT-tests.jar
[JENKINS] Archiving <https://ci-builds.apache.org/job/ActiveMQ/job/ActiveMQ-Artemis-JDK11/ws/tests/integration-tests/target/integration-tests-2.31.0-SNAPSHOT-sources.jar> to org.apache.activemq.tests/integration-tests/2.31.0-SNAPSHOT/integration-tests-2.31.0-SNAPSHOT-sources.jar
[JENKINS] Archiving <https://ci-builds.apache.org/job/ActiveMQ/job/ActiveMQ-Artemis-JDK11/ws/artemis-boot/pom.xml> to org.apache.activemq/artemis-boot/2.31.0-SNAPSHOT/artemis-boot-2.31.0-SNAPSHOT.pom
[JENKINS] Archiving <https://ci-builds.apache.org/job/ActiveMQ/job/ActiveMQ-Artemis-JDK11/ws/artemis-boot/target/artemis-boot-2.31.0-SNAPSHOT.jar> to org.apache.activemq/artemis-boot/2.31.0-SNAPSHOT/artemis-boot-2.31.0-SNAPSHOT.jar
[JENKINS] Archiving <https://ci-builds.apache.org/job/ActiveMQ/job/ActiveMQ-Artemis-JDK11/ws/artemis-boot/target/artemis-boot-2.31.0-SNAPSHOT-sources.jar> to org.apache.activemq/artemis-boot/2.31.0-SNAPSHOT/artemis-boot-2.31.0-SNAPSHOT-sources.jar
[JENKINS] Archiving <https://ci-builds.apache.org/job/ActiveMQ/job/ActiveMQ-Artemis-JDK11/ws/artemis-jakarta-client/pom.xml> to org.apache.activemq/artemis-jakarta-client/2.31.0-SNAPSHOT/artemis-jakarta-client-2.31.0-SNAPSHOT.pom
[JENKINS] Archiving <https://ci-builds.apache.org/job/ActiveMQ/job/ActiveMQ-Artemis-JDK11/ws/artemis-jakarta-client/target/artemis-jakarta-client-2.31.0-SNAPSHOT.jar> to org.apache.activemq/artemis-jakarta-client/2.31.0-SNAPSHOT/artemis-jakarta-client-2.31.0-SNAPSHOT.jar
[JENKINS] Archiving <https://ci-builds.apache.org/job/ActiveMQ/job/ActiveMQ-Artemis-JDK11/ws/artemis-jakarta-client/target/artemis-jakarta-client-2.31.0-SNAPSHOT-sources.jar> to org.apache.activemq/artemis-jakarta-client/2.31.0-SNAPSHOT/artemis-jakarta-client-2.31.0-SNAPSHOT-sources.jar
[JENKINS] Archiving <https://ci-builds.apache.org/job/ActiveMQ/job/ActiveMQ-Artemis-JDK11/ws/artemis-protocols/artemis-amqp-protocol/pom.xml> to org.apache.activemq/artemis-amqp-protocol/2.31.0-SNAPSHOT/artemis-amqp-protocol-2.31.0-SNAPSHOT.pom
[JENKINS] Archiving <https://ci-builds.apache.org/job/ActiveMQ/job/ActiveMQ-Artemis-JDK11/ws/artemis-protocols/artemis-amqp-protocol/target/artemis-amqp-protocol-2.31.0-SNAPSHOT.jar> to org.apache.activemq/artemis-amqp-protocol/2.31.0-SNAPSHOT/artemis-amqp-protocol-2.31.0-SNAPSHOT.jar
[JENKINS] Archiving <https://ci-builds.apache.org/job/ActiveMQ/job/ActiveMQ-Artemis-JDK11/ws/artemis-protocols/artemis-amqp-protocol/target/artemis-amqp-protocol-2.31.0-SNAPSHOT-sources.jar> to org.apache.activemq/artemis-amqp-protocol/2.31.0-SNAPSHOT/artemis-amqp-protocol-2.31.0-SNAPSHOT-sources.jar
[JENKINS] Archiving <https://ci-builds.apache.org/job/ActiveMQ/job/ActiveMQ-Artemis-JDK11/ws/artemis-jakarta-server/pom.xml> to org.apache.activemq/artemis-jakarta-server/2.31.0-SNAPSHOT/artemis-jakarta-server-2.31.0-SNAPSHOT.pom
[JENKINS] Archiving <https://ci-builds.apache.org/job/ActiveMQ/job/ActiveMQ-Artemis-JDK11/ws/artemis-jakarta-server/target/artemis-jakarta-server-2.31.0-SNAPSHOT.jar> to org.apache.activemq/artemis-jakarta-server/2.31.0-SNAPSHOT/artemis-jakarta-server-2.31.0-SNAPSHOT.jar
[JENKINS] Archiving <https://ci-builds.apache.org/job/ActiveMQ/job/ActiveMQ-Artemis-JDK11/ws/artemis-jakarta-server/target/artemis-jakarta-server-2.31.0-SNAPSHOT-sources.jar> to org.apache.activemq/artemis-jakarta-server/2.31.0-SNAPSHOT/artemis-jakarta-server-2.31.0-SNAPSHOT-sources.jar
[JENKINS] Archiving <https://ci-builds.apache.org/job/ActiveMQ/job/ActiveMQ-Artemis-JDK11/ws/artemis-protocols/artemis-mqtt-protocol/pom.xml> to org.apache.activemq/artemis-mqtt-protocol/2.31.0-SNAPSHOT/artemis-mqtt-protocol-2.31.0-SNAPSHOT.pom
[JENKINS] Archiving <https://ci-builds.apache.org/job/ActiveMQ/job/ActiveMQ-Artemis-JDK11/ws/artemis-protocols/artemis-mqtt-protocol/target/artemis-mqtt-protocol-2.31.0-SNAPSHOT.jar> to org.apache.activemq/artemis-mqtt-protocol/2.31.0-SNAPSHOT/artemis-mqtt-protocol-2.31.0-SNAPSHOT.jar
[JENKINS] Archiving <https://ci-builds.apache.org/job/ActiveMQ/job/ActiveMQ-Artemis-JDK11/ws/artemis-protocols/artemis-mqtt-protocol/target/artemis-mqtt-protocol-2.31.0-SNAPSHOT-sources.jar> to org.apache.activemq/artemis-mqtt-protocol/2.31.0-SNAPSHOT/artemis-mqtt-protocol-2.31.0-SNAPSHOT-sources.jar
[JENKINS] Archiving <https://ci-builds.apache.org/job/ActiveMQ/job/ActiveMQ-Artemis-JDK11/ws/tests/e2e-tests/pom.xml> to org.apache.activemq.tests/e2e-tests/2.31.0-SNAPSHOT/e2e-tests-2.31.0-SNAPSHOT.pom
[JENKINS] Archiving <https://ci-builds.apache.org/job/ActiveMQ/job/ActiveMQ-Artemis-JDK11/ws/artemis-hawtio/pom.xml> to org.apache.activemq/artemis-hawtio-pom/2.31.0-SNAPSHOT/artemis-hawtio-pom-2.31.0-SNAPSHOT.pom
[JENKINS] Archiving <https://ci-builds.apache.org/job/ActiveMQ/job/ActiveMQ-Artemis-JDK11/ws/tests/stress-tests/pom.xml> to org.apache.activemq.tests/stress-tests/2.31.0-SNAPSHOT/stress-tests-2.31.0-SNAPSHOT.pom
[JENKINS] Archiving <https://ci-builds.apache.org/job/ActiveMQ/job/ActiveMQ-Artemis-JDK11/ws/tests/stress-tests/target/stress-tests-2.31.0-SNAPSHOT.jar> to org.apache.activemq.tests/stress-tests/2.31.0-SNAPSHOT/stress-tests-2.31.0-SNAPSHOT.jar
[JENKINS] Archiving <https://ci-builds.apache.org/job/ActiveMQ/job/ActiveMQ-Artemis-JDK11/ws/tests/stress-tests/target/stress-tests-2.31.0-SNAPSHOT-sources.jar> to org.apache.activemq.tests/stress-tests/2.31.0-SNAPSHOT/stress-tests-2.31.0-SNAPSHOT-sources.jar
channel stopped

Jenkins build is back to normal : ActiveMQ » ActiveMQ-Artemis-JDK11 #1517

Posted by Apache Jenkins Server <je...@builds.apache.org>.
See <https://ci-builds.apache.org/job/ActiveMQ/job/ActiveMQ-Artemis-JDK11/1517/display/redirect?page=changes>


Build failed in Jenkins: ActiveMQ » ActiveMQ-Artemis-JDK11 #1516

Posted by Apache Jenkins Server <je...@builds.apache.org>.
See <https://ci-builds.apache.org/job/ActiveMQ/job/ActiveMQ-Artemis-JDK11/1516/display/redirect?page=changes>

Changes:

[Clebert Suconic] ARTEMIS-4372 small tweaks on Artemis CLI

[Clebert Suconic] ARTEMIS-4382 Long Time to process export / import


------------------------------------------
[...truncated 1.93 MB...]
[ERROR] org.apache.activemq.cli.test.MessageSerializerTest.testAnycastToMulticastTopic(org.apache.activemq.cli.test.MessageSerializerTest)
[ERROR]   Run 1: MessageSerializerTest.setup:70->CliTestBase.startServer:95 » CLI Error: There ...
[ERROR]   Run 2: MessageSerializerTest.tearDown:78->CliTestBase.closeConnection:135->CliTestBase.stopServer:107 » Configuration
[INFO] 
[ERROR] org.apache.activemq.cli.test.MessageSerializerTest.testLargeMessageExport(org.apache.activemq.cli.test.MessageSerializerTest)
[ERROR]   Run 1: MessageSerializerTest.setup:70->CliTestBase.startServer:95 » CLI Error: There ...
[ERROR]   Run 2: MessageSerializerTest.tearDown:78->CliTestBase.closeConnection:135->CliTestBase.stopServer:107 » Configuration
[INFO] 
[ERROR] org.apache.activemq.cli.test.MessageSerializerTest.testMapMessageImportExport(org.apache.activemq.cli.test.MessageSerializerTest)
[ERROR]   Run 1: MessageSerializerTest.setup:70->CliTestBase.startServer:95 » CLI Error: There ...
[ERROR]   Run 2: MessageSerializerTest.tearDown:78->CliTestBase.closeConnection:135->CliTestBase.stopServer:107 » Configuration
[INFO] 
[ERROR] org.apache.activemq.cli.test.MessageSerializerTest.testMulticastTopicToAnycastQueueBothAddress(org.apache.activemq.cli.test.MessageSerializerTest)
[ERROR]   Run 1: MessageSerializerTest.setup:70->CliTestBase.startServer:95 » CLI Error: There ...
[ERROR]   Run 2: MessageSerializerTest.tearDown:78->CliTestBase.closeConnection:135->CliTestBase.stopServer:107 » Configuration
[INFO] 
[ERROR] org.apache.activemq.cli.test.MessageSerializerTest.testObjectMessageImportExport(org.apache.activemq.cli.test.MessageSerializerTest)
[ERROR]   Run 1: MessageSerializerTest.setup:70->CliTestBase.startServer:95 » CLI Error: There ...
[ERROR]   Run 2: MessageSerializerTest.tearDown:78->CliTestBase.closeConnection:135->CliTestBase.stopServer:107 » Configuration
[INFO] 
[ERROR] org.apache.activemq.cli.test.MessageSerializerTest.testSendDirectToAnycastQueue(org.apache.activemq.cli.test.MessageSerializerTest)
[ERROR]   Run 1: MessageSerializerTest.setup:70->CliTestBase.startServer:95 » CLI Error: There ...
[ERROR]   Run 2: MessageSerializerTest.tearDown:78->CliTestBase.closeConnection:135->CliTestBase.stopServer:107 » Configuration
[INFO] 
[ERROR] org.apache.activemq.cli.test.MessageSerializerTest.testSendDirectToMulticastQueue(org.apache.activemq.cli.test.MessageSerializerTest)
[ERROR]   Run 1: MessageSerializerTest.setup:70->CliTestBase.startServer:95 » CLI Error: There ...
[ERROR]   Run 2: MessageSerializerTest.tearDown:78->CliTestBase.closeConnection:135->CliTestBase.stopServer:107 » Configuration
[INFO] 
[ERROR] org.apache.activemq.cli.test.MessageSerializerTest.testTextMessageImportExport(org.apache.activemq.cli.test.MessageSerializerTest)
[ERROR]   Run 1: MessageSerializerTest.setup:70->CliTestBase.startServer:95 » CLI Error: There ...
[ERROR]   Run 2: MessageSerializerTest.tearDown:78->CliTestBase.closeConnection:135->CliTestBase.stopServer:107 » Configuration
[INFO] 
[ERROR]   RetryCLIClientIDTest.testWrongUserAndPass:54->CliTestBase.stopServer:107 » Configuration
[ERROR] org.apache.activemq.cli.test.TransferTest.testTransferMessagesWithMessageCount(org.apache.activemq.cli.test.TransferTest)
[ERROR]   Run 1: TransferTest.setup:47->CliTestBase.startServer:95 » CLI Error: There is anothe...
[ERROR]   Run 2: TransferTest.tearDown:55->CliTestBase.closeConnection:135->CliTestBase.stopServer:107 » Configuration
[INFO] 
[INFO] 
[ERROR] Tests run: 108, Failures: 11, Errors: 20, Skipped: 0
[INFO] 
[JENKINS] Recording test results
[INFO] ------------------------------------------------------------------------
[INFO] Reactor Summary for ActiveMQ Artemis Parent 2.31.0-SNAPSHOT:
[INFO] 
[INFO] ActiveMQ Artemis Parent ............................ SUCCESS [ 10.860 s]
[INFO] ActiveMQ Artemis Unit Test Support ................. SUCCESS [ 10.488 s]
[INFO] ActiveMQ Log Annotation Processor .................. SUCCESS [ 24.629 s]
[INFO] ActiveMQ Artemis Commons ........................... SUCCESS [ 28.929 s]
[INFO] ActiveMQ Artemis Selector Implementation ........... SUCCESS [  8.721 s]
[INFO] ActiveMQ Artemis Core Client ....................... SUCCESS [ 26.539 s]
[INFO] ActiveMQ Artemis Journal ........................... SUCCESS [ 10.031 s]
[INFO] ActiveMQ Artemis JDBC Store ........................ SUCCESS [ 17.784 s]
[INFO] ActiveMQ Artemis Quorum API ........................ SUCCESS [  5.932 s]
[INFO] ActiveMQ Artemis Server ............................ SUCCESS [02:06 min]
[INFO] ActiveMQ Artemis Protocols ......................... SUCCESS [  3.103 s]
[INFO] ActiveMQ Artemis AMQP Protocol ..................... SUCCESS [ 16.391 s]
[INFO] ActiveMQ Artemis STOMP Protocol .................... SUCCESS [  6.576 s]
[INFO] ActiveMQ Artemis JMS Client ........................ SUCCESS [  8.472 s]
[INFO] ActiveMQ Artemis OpenWire Protocol ................. SUCCESS [ 14.832 s]
[INFO] ActiveMQ Artemis HQClient Protocol ................. SUCCESS [  6.511 s]
[INFO] ActiveMQ Artemis HornetQ Protocol .................. SUCCESS [  8.253 s]
[INFO] ActiveMQ Artemis MQTT Protocol ..................... SUCCESS [  6.237 s]
[INFO] ActiveMQ Artemis DTO ............................... SUCCESS [  7.571 s]
[INFO] ActiveMQ Artemis CDI Integration ................... SUCCESS [  9.273 s]
[INFO] ActiveMQ Artemis Boot .............................. SUCCESS [  5.675 s]
[INFO] ActiveMQ Artemis Service Extensions ................ SUCCESS [  6.836 s]
[INFO] ActiveMQ Artemis JMS Server ........................ SUCCESS [  5.352 s]
[INFO] ActiveMQ Artemis JUnit ............................. SUCCESS [  3.080 s]
[INFO] ActiveMQ Artemis JUnit Commons ..................... SUCCESS [  5.578 s]
[INFO] ActiveMQ Artemis JUnit 4 Rules ..................... SUCCESS [ 10.942 s]
[INFO] ActiveMQ Artemis CLI ............................... FAILURE [01:30 min]
[INFO] ActiveMQ Artemis Web ............................... SKIPPED
[INFO] ActiveMQ Artemis Core Client All ................... SKIPPED
[INFO] ActiveMQ Artemis Client OSGi ....................... SKIPPED
[INFO] ActiveMQ Artemis JUnit 5 Extensions ................ SKIPPED
[INFO] ActiveMQ Artemis JMS Client All .................... SKIPPED
[INFO] ActiveMQ Artemis JMS Client OSGi ................... SKIPPED
[INFO] ActiveMQ Artemis Jakarta Messaging Client .......... SKIPPED
[INFO] ActiveMQ Artemis Jakarta Messaging Client All ...... SKIPPED
[INFO] ActiveMQ Artemis Jakarta Service Extensions ........ SKIPPED
[INFO] ActiveMQ Artemis Jakarta Messaging Server .......... SKIPPED
[INFO] ActiveMQ Artemis RAR POM ........................... SKIPPED
[INFO] ActiveMQ Artemis Jakarta RAR ....................... SKIPPED
[INFO] ActiveMQ Artemis Maven Plugin ...................... SKIPPED
[INFO] ActiveMQ Artemis Server OSGi ....................... SKIPPED
[INFO] ActiveMQ Artemis Cons .............................. SKIPPED
[INFO] ActiveMQ Artemis HawtIO Branding ................... SKIPPED
[INFO] ActiveMQ Artemis HawtIO Plugin ..................... SKIPPED
[INFO] ActiveMQ Artemis Console ........................... SKIPPED
[INFO] ActiveMQ Artemis Spring Integration ................ SKIPPED
[INFO] ActiveMQ Artemis Quorum RI ......................... SKIPPED
[INFO] Apache ActiveMQ Artemis Distribution ............... SKIPPED
[INFO] ActiveMQ Artemis Tests POM ......................... SKIPPED
[INFO] ActiveMQ Artemis Test Support ...................... SKIPPED
[INFO] ActiveMQ Artemis Unit Tests ........................ SKIPPED
[INFO] ActiveMQ Artemis Joram Tests ....................... SKIPPED
[INFO] ActiveMQ Artemis timing Tests ...................... SKIPPED
[INFO] ActiveMQ Artemis JMS Tests ......................... SKIPPED
[INFO] ActiveMQ Artemis Integration Tests ................. SKIPPED
[INFO] ActiveMQ Artemis Isolated Integration Tests ........ SKIPPED
[INFO] ActiveMQ Artemis Features .......................... SKIPPED
[INFO] ActiveMQ Artemis Karaf Client Integration Tests .... SKIPPED
[INFO] ActiveMQ Artemis Karaf Server Integration Tests .... SKIPPED
[INFO] ActiveMQ Artemis Compatibility Tests ............... SKIPPED
[INFO] ActiveMQ Artemis soak Tests ........................ SKIPPED
[INFO] ActiveMQ Artemis stress Tests ...................... SKIPPED
[INFO] ActiveMQ Artemis performance Tests ................. SKIPPED
[INFO] Smoke Tests ........................................ SKIPPED
[INFO] End-to-End Tests ................................... SKIPPED
[INFO] ActiveMQ Artemis Leak Tests ........................ SKIPPED
[INFO] Apache ActiveMQ Artemis Image ...................... SKIPPED
[INFO] Apache ActiveMQ Artemis Image Examples ............. SKIPPED
[INFO] ------------------------------------------------------------------------
[INFO] BUILD FAILURE
[INFO] ------------------------------------------------------------------------
[INFO] Total time:  10:42 min
[INFO] Finished at: 2023-08-01T17:24:28Z
[INFO] ------------------------------------------------------------------------
Waiting for Jenkins to finish collecting data
[ERROR] Failed to execute goal org.apache.maven.plugins:maven-surefire-plugin:2.22.2:test (default-test) on project artemis-cli: There are test failures.
[ERROR] 
[ERROR] Please refer to <https://ci-builds.apache.org/job/ActiveMQ/job/ActiveMQ-Artemis-JDK11/ws/artemis-cli/target/surefire-reports> for the individual test results.
[ERROR] Please refer to dump files (if any exist) [date].dump, [date]-jvmRun[N].dump and [date].dumpstream.
[ERROR] -> [Help 1]
[ERROR] 
[ERROR] To see the full stack trace of the errors, re-run Maven with the -e switch.
[ERROR] Re-run Maven using the -X switch to enable full debug logging.
[ERROR] 
[ERROR] For more information about the errors and possible solutions, please read the following articles:
[ERROR] [Help 1] http://cwiki.apache.org/confluence/display/MAVEN/MojoFailureException
[ERROR] 
[ERROR] After correcting the problems, you can resume the build with the command
[ERROR]   mvn <goals> -rf :artemis-cli
[JENKINS] Archiving <https://ci-builds.apache.org/job/ActiveMQ/job/ActiveMQ-Artemis-JDK11/ws/artemis-server/pom.xml> to org.apache.activemq/artemis-server/2.31.0-SNAPSHOT/artemis-server-2.31.0-SNAPSHOT.pom
[JENKINS] Archiving <https://ci-builds.apache.org/job/ActiveMQ/job/ActiveMQ-Artemis-JDK11/ws/artemis-server/target/artemis-server-2.31.0-SNAPSHOT.jar> to org.apache.activemq/artemis-server/2.31.0-SNAPSHOT/artemis-server-2.31.0-SNAPSHOT.jar
[JENKINS] Archiving <https://ci-builds.apache.org/job/ActiveMQ/job/ActiveMQ-Artemis-JDK11/ws/artemis-server/target/artemis-server-2.31.0-SNAPSHOT-tests.jar> to org.apache.activemq/artemis-server/2.31.0-SNAPSHOT/artemis-server-2.31.0-SNAPSHOT-tests.jar
[JENKINS] Archiving <https://ci-builds.apache.org/job/ActiveMQ/job/ActiveMQ-Artemis-JDK11/ws/artemis-server/target/artemis-server-2.31.0-SNAPSHOT-sources.jar> to org.apache.activemq/artemis-server/2.31.0-SNAPSHOT/artemis-server-2.31.0-SNAPSHOT-sources.jar
[JENKINS] Archiving <https://ci-builds.apache.org/job/ActiveMQ/job/ActiveMQ-Artemis-JDK11/ws/artemis-image/examples/pom.xml> to org.apache.activemq/artemis-image-examples/2.31.0-SNAPSHOT/artemis-image-examples-2.31.0-SNAPSHOT.pom
[JENKINS] Archiving <https://ci-builds.apache.org/job/ActiveMQ/job/ActiveMQ-Artemis-JDK11/ws/tests/compatibility-tests/pom.xml> to org.apache.activemq.tests/compatibility-tests/2.31.0-SNAPSHOT/compatibility-tests-2.31.0-SNAPSHOT.pom
[JENKINS] Archiving <https://ci-builds.apache.org/job/ActiveMQ/job/ActiveMQ-Artemis-JDK11/ws/artemis-jms-client/pom.xml> to org.apache.activemq/artemis-jms-client/2.31.0-SNAPSHOT/artemis-jms-client-2.31.0-SNAPSHOT.pom
[JENKINS] Archiving <https://ci-builds.apache.org/job/ActiveMQ/job/ActiveMQ-Artemis-JDK11/ws/artemis-jms-client/target/artemis-jms-client-2.31.0-SNAPSHOT.jar> to org.apache.activemq/artemis-jms-client/2.31.0-SNAPSHOT/artemis-jms-client-2.31.0-SNAPSHOT.jar
[JENKINS] Archiving <https://ci-builds.apache.org/job/ActiveMQ/job/ActiveMQ-Artemis-JDK11/ws/artemis-jms-client/target/artemis-jms-client-2.31.0-SNAPSHOT-sources.jar> to org.apache.activemq/artemis-jms-client/2.31.0-SNAPSHOT/artemis-jms-client-2.31.0-SNAPSHOT-sources.jar
[JENKINS] Archiving <https://ci-builds.apache.org/job/ActiveMQ/job/ActiveMQ-Artemis-JDK11/ws/artemis-hawtio/activemq-branding/pom.xml> to org.apache.activemq/activemq-branding/2.31.0-SNAPSHOT/activemq-branding-2.31.0-SNAPSHOT.pom
[JENKINS] Archiving <https://ci-builds.apache.org/job/ActiveMQ/job/ActiveMQ-Artemis-JDK11/ws/tests/smoke-tests/pom.xml> to org.apache.activemq.tests/smoke-tests/2.31.0-SNAPSHOT/smoke-tests-2.31.0-SNAPSHOT.pom
[JENKINS] Archiving <https://ci-builds.apache.org/job/ActiveMQ/job/ActiveMQ-Artemis-JDK11/ws/tests/joram-tests/pom.xml> to org.apache.activemq.tests/joram-tests/2.31.0-SNAPSHOT/joram-tests-2.31.0-SNAPSHOT.pom
[JENKINS] Archiving <https://ci-builds.apache.org/job/ActiveMQ/job/ActiveMQ-Artemis-JDK11/ws/artemis-log-annotation-processor/pom.xml> to org.apache.activemq/artemis-log-annotation-processor/2.31.0-SNAPSHOT/artemis-log-annotation-processor-2.31.0-SNAPSHOT.pom
[JENKINS] Archiving <https://ci-builds.apache.org/job/ActiveMQ/job/ActiveMQ-Artemis-JDK11/ws/artemis-log-annotation-processor/target/artemis-log-annotation-processor-2.31.0-SNAPSHOT.jar> to org.apache.activemq/artemis-log-annotation-processor/2.31.0-SNAPSHOT/artemis-log-annotation-processor-2.31.0-SNAPSHOT.jar
[JENKINS] Archiving <https://ci-builds.apache.org/job/ActiveMQ/job/ActiveMQ-Artemis-JDK11/ws/artemis-log-annotation-processor/target/artemis-log-annotation-processor-2.31.0-SNAPSHOT-sources.jar> to org.apache.activemq/artemis-log-annotation-processor/2.31.0-SNAPSHOT/artemis-log-annotation-processor-2.31.0-SNAPSHOT-sources.jar
[JENKINS] Archiving <https://ci-builds.apache.org/job/ActiveMQ/job/ActiveMQ-Artemis-JDK11/ws/artemis-jms-server/pom.xml> to org.apache.activemq/artemis-jms-server/2.31.0-SNAPSHOT/artemis-jms-server-2.31.0-SNAPSHOT.pom
[JENKINS] Archiving <https://ci-builds.apache.org/job/ActiveMQ/job/ActiveMQ-Artemis-JDK11/ws/artemis-jms-server/target/artemis-jms-server-2.31.0-SNAPSHOT.jar> to org.apache.activemq/artemis-jms-server/2.31.0-SNAPSHOT/artemis-jms-server-2.31.0-SNAPSHOT.jar
[JENKINS] Archiving <https://ci-builds.apache.org/job/ActiveMQ/job/ActiveMQ-Artemis-JDK11/ws/artemis-jms-server/target/artemis-jms-server-2.31.0-SNAPSHOT-sources.jar> to org.apache.activemq/artemis-jms-server/2.31.0-SNAPSHOT/artemis-jms-server-2.31.0-SNAPSHOT-sources.jar
[JENKINS] Archiving <https://ci-builds.apache.org/job/ActiveMQ/job/ActiveMQ-Artemis-JDK11/ws/artemis-cli/pom.xml> to org.apache.activemq/artemis-cli/2.31.0-SNAPSHOT/artemis-cli-2.31.0-SNAPSHOT.pom
[JENKINS] Archiving <https://ci-builds.apache.org/job/ActiveMQ/job/ActiveMQ-Artemis-JDK11/ws/artemis-jakarta-client-all/pom.xml> to org.apache.activemq/artemis-jakarta-client-all/2.31.0-SNAPSHOT/artemis-jakarta-client-all-2.31.0-SNAPSHOT.pom
[JENKINS] Archiving <https://ci-builds.apache.org/job/ActiveMQ/job/ActiveMQ-Artemis-JDK11/ws/artemis-core-client-all/pom.xml> to org.apache.activemq/artemis-core-client-all/2.31.0-SNAPSHOT/artemis-core-client-all-2.31.0-SNAPSHOT.pom
[JENKINS] Archiving <https://ci-builds.apache.org/job/ActiveMQ/job/ActiveMQ-Artemis-JDK11/ws/tests/pom.xml> to org.apache.activemq.tests/artemis-tests-pom/2.31.0-SNAPSHOT/artemis-tests-pom-2.31.0-SNAPSHOT.pom
[JENKINS] Archiving <https://ci-builds.apache.org/job/ActiveMQ/job/ActiveMQ-Artemis-JDK11/ws/artemis-protocols/artemis-openwire-protocol/pom.xml> to org.apache.activemq/artemis-openwire-protocol/2.31.0-SNAPSHOT/artemis-openwire-protocol-2.31.0-SNAPSHOT.pom
[JENKINS] Archiving <https://ci-builds.apache.org/job/ActiveMQ/job/ActiveMQ-Artemis-JDK11/ws/artemis-protocols/artemis-openwire-protocol/target/artemis-openwire-protocol-2.31.0-SNAPSHOT.jar> to org.apache.activemq/artemis-openwire-protocol/2.31.0-SNAPSHOT/artemis-openwire-protocol-2.31.0-SNAPSHOT.jar
[JENKINS] Archiving <https://ci-builds.apache.org/job/ActiveMQ/job/ActiveMQ-Artemis-JDK11/ws/artemis-protocols/artemis-openwire-protocol/target/artemis-openwire-protocol-2.31.0-SNAPSHOT-sources.jar> to org.apache.activemq/artemis-openwire-protocol/2.31.0-SNAPSHOT/artemis-openwire-protocol-2.31.0-SNAPSHOT-sources.jar
[JENKINS] Archiving <https://ci-builds.apache.org/job/ActiveMQ/job/ActiveMQ-Artemis-JDK11/ws/artemis-image/pom.xml> to org.apache.activemq/artemis-image/2.31.0-SNAPSHOT/artemis-image-2.31.0-SNAPSHOT.pom
[JENKINS] Archiving <https://ci-builds.apache.org/job/ActiveMQ/job/ActiveMQ-Artemis-JDK11/ws/artemis-distribution/pom.xml> to org.apache.activemq/apache-artemis/2.31.0-SNAPSHOT/apache-artemis-2.31.0-SNAPSHOT.pom
[JENKINS] Archiving <https://ci-builds.apache.org/job/ActiveMQ/job/ActiveMQ-Artemis-JDK11/ws/artemis-hawtio/artemis-console/pom.xml> to org.apache.activemq/artemis-console/2.31.0-SNAPSHOT/artemis-console-2.31.0-SNAPSHOT.pom
[JENKINS] Archiving <https://ci-builds.apache.org/job/ActiveMQ/job/ActiveMQ-Artemis-JDK11/ws/tests/artemis-test-support/pom.xml> to org.apache.activemq.tests/artemis-test-support/2.31.0-SNAPSHOT/artemis-test-support-2.31.0-SNAPSHOT.pom
[JENKINS] Archiving <https://ci-builds.apache.org/job/ActiveMQ/job/ActiveMQ-Artemis-JDK11/ws/artemis-selector/pom.xml> to org.apache.activemq/artemis-selector/2.31.0-SNAPSHOT/artemis-selector-2.31.0-SNAPSHOT.pom
[JENKINS] Archiving <https://ci-builds.apache.org/job/ActiveMQ/job/ActiveMQ-Artemis-JDK11/ws/artemis-selector/target/artemis-selector-2.31.0-SNAPSHOT.jar> to org.apache.activemq/artemis-selector/2.31.0-SNAPSHOT/artemis-selector-2.31.0-SNAPSHOT.jar
[JENKINS] Archiving <https://ci-builds.apache.org/job/ActiveMQ/job/ActiveMQ-Artemis-JDK11/ws/artemis-selector/target/artemis-selector-2.31.0-SNAPSHOT-sources.jar> to org.apache.activemq/artemis-selector/2.31.0-SNAPSHOT/artemis-selector-2.31.0-SNAPSHOT-sources.jar
[JENKINS] Archiving <https://ci-builds.apache.org/job/ActiveMQ/job/ActiveMQ-Artemis-JDK11/ws/artemis-jdbc-store/pom.xml> to org.apache.activemq/artemis-jdbc-store/2.31.0-SNAPSHOT/artemis-jdbc-store-2.31.0-SNAPSHOT.pom
[JENKINS] Archiving <https://ci-builds.apache.org/job/ActiveMQ/job/ActiveMQ-Artemis-JDK11/ws/artemis-jdbc-store/target/artemis-jdbc-store-2.31.0-SNAPSHOT.jar> to org.apache.activemq/artemis-jdbc-store/2.31.0-SNAPSHOT/artemis-jdbc-store-2.31.0-SNAPSHOT.jar
[JENKINS] Archiving <https://ci-builds.apache.org/job/ActiveMQ/job/ActiveMQ-Artemis-JDK11/ws/artemis-jdbc-store/target/artemis-jdbc-store-2.31.0-SNAPSHOT-sources.jar> to org.apache.activemq/artemis-jdbc-store/2.31.0-SNAPSHOT/artemis-jdbc-store-2.31.0-SNAPSHOT-sources.jar
[JENKINS] Archiving <https://ci-builds.apache.org/job/ActiveMQ/job/ActiveMQ-Artemis-JDK11/ws/integration/activemq-spring-integration/pom.xml> to org.apache.activemq/artemis-spring-integration/2.31.0-SNAPSHOT/artemis-spring-integration-2.31.0-SNAPSHOT.pom
[JENKINS] Archiving <https://ci-builds.apache.org/job/ActiveMQ/job/ActiveMQ-Artemis-JDK11/ws/artemis-quorum-ri/pom.xml> to org.apache.activemq/artemis-quorum-ri/2.31.0-SNAPSHOT/artemis-quorum-ri-2.31.0-SNAPSHOT.pom
[JENKINS] Archiving <https://ci-builds.apache.org/job/ActiveMQ/job/ActiveMQ-Artemis-JDK11/ws/artemis-web/pom.xml> to org.apache.activemq/artemis-web/2.31.0-SNAPSHOT/artemis-web-2.31.0-SNAPSHOT.pom
[JENKINS] Archiving <https://ci-builds.apache.org/job/ActiveMQ/job/ActiveMQ-Artemis-JDK11/ws/artemis-junit/artemis-junit-commons/pom.xml> to org.apache.activemq/artemis-junit-commons/2.31.0-SNAPSHOT/artemis-junit-commons-2.31.0-SNAPSHOT.pom
[JENKINS] Archiving <https://ci-builds.apache.org/job/ActiveMQ/job/ActiveMQ-Artemis-JDK11/ws/artemis-junit/artemis-junit-commons/target/artemis-junit-commons-2.31.0-SNAPSHOT.jar> to org.apache.activemq/artemis-junit-commons/2.31.0-SNAPSHOT/artemis-junit-commons-2.31.0-SNAPSHOT.jar
[JENKINS] Archiving <https://ci-builds.apache.org/job/ActiveMQ/job/ActiveMQ-Artemis-JDK11/ws/artemis-junit/artemis-junit-commons/target/artemis-junit-commons-2.31.0-SNAPSHOT-sources.jar> to org.apache.activemq/artemis-junit-commons/2.31.0-SNAPSHOT/artemis-junit-commons-2.31.0-SNAPSHOT-sources.jar
[JENKINS] Archiving <https://ci-builds.apache.org/job/ActiveMQ/job/ActiveMQ-Artemis-JDK11/ws/artemis-cdi-client/pom.xml> to org.apache.activemq/artemis-cdi-client/2.31.0-SNAPSHOT/artemis-cdi-client-2.31.0-SNAPSHOT.pom
[JENKINS] Archiving <https://ci-builds.apache.org/job/ActiveMQ/job/ActiveMQ-Artemis-JDK11/ws/artemis-cdi-client/target/artemis-cdi-client-2.31.0-SNAPSHOT.jar> to org.apache.activemq/artemis-cdi-client/2.31.0-SNAPSHOT/artemis-cdi-client-2.31.0-SNAPSHOT.jar
[JENKINS] Archiving <https://ci-builds.apache.org/job/ActiveMQ/job/ActiveMQ-Artemis-JDK11/ws/artemis-cdi-client/target/artemis-cdi-client-2.31.0-SNAPSHOT-sources.jar> to org.apache.activemq/artemis-cdi-client/2.31.0-SNAPSHOT/artemis-cdi-client-2.31.0-SNAPSHOT-sources.jar
[JENKINS] Archiving <https://ci-builds.apache.org/job/ActiveMQ/job/ActiveMQ-Artemis-JDK11/ws/tests/jms-tests/pom.xml> to org.apache.activemq.tests/jms-tests/2.31.0-SNAPSHOT/jms-tests-2.31.0-SNAPSHOT.pom
[JENKINS] Archiving <https://ci-builds.apache.org/job/ActiveMQ/job/ActiveMQ-Artemis-JDK11/ws/artemis-ra/pom.xml> to org.apache.activemq/artemis-ra/2.31.0-SNAPSHOT/artemis-ra-2.31.0-SNAPSHOT.pom
[JENKINS] Archiving <https://ci-builds.apache.org/job/ActiveMQ/job/ActiveMQ-Artemis-JDK11/ws/pom.xml> to org.apache.activemq/artemis-pom/2.31.0-SNAPSHOT/artemis-pom-2.31.0-SNAPSHOT.pom
[JENKINS] Archiving <https://ci-builds.apache.org/job/ActiveMQ/job/ActiveMQ-Artemis-JDK11/ws/tests/karaf-client-integration-tests/pom.xml> to org.apache.activemq.tests/karaf-client-integration-tests/2.31.0-SNAPSHOT/karaf-client-integration-tests-2.31.0-SNAPSHOT.pom
[JENKINS] Archiving <https://ci-builds.apache.org/job/ActiveMQ/job/ActiveMQ-Artemis-JDK11/ws/artemis-maven-plugin/pom.xml> to org.apache.activemq/artemis-maven-plugin/2.31.0-SNAPSHOT/artemis-maven-plugin-2.31.0-SNAPSHOT.pom
[JENKINS] Archiving <https://ci-builds.apache.org/job/ActiveMQ/job/ActiveMQ-Artemis-JDK11/ws/artemis-junit/artemis-junit-4/pom.xml> to org.apache.activemq/artemis-junit/2.31.0-SNAPSHOT/artemis-junit-2.31.0-SNAPSHOT.pom
[JENKINS] Archiving <https://ci-builds.apache.org/job/ActiveMQ/job/ActiveMQ-Artemis-JDK11/ws/artemis-junit/artemis-junit-4/target/artemis-junit-2.31.0-SNAPSHOT.jar> to org.apache.activemq/artemis-junit/2.31.0-SNAPSHOT/artemis-junit-2.31.0-SNAPSHOT.jar
[JENKINS] Archiving <https://ci-builds.apache.org/job/ActiveMQ/job/ActiveMQ-Artemis-JDK11/ws/artemis-junit/artemis-junit-4/target/artemis-junit-2.31.0-SNAPSHOT-sources.jar> to org.apache.activemq/artemis-junit/2.31.0-SNAPSHOT/artemis-junit-2.31.0-SNAPSHOT-sources.jar
[JENKINS] Archiving <https://ci-builds.apache.org/job/ActiveMQ/job/ActiveMQ-Artemis-JDK11/ws/artemis-service-extensions/pom.xml> to org.apache.activemq/artemis-service-extensions/2.31.0-SNAPSHOT/artemis-service-extensions-2.31.0-SNAPSHOT.pom
[JENKINS] Archiving <https://ci-builds.apache.org/job/ActiveMQ/job/ActiveMQ-Artemis-JDK11/ws/artemis-service-extensions/target/artemis-service-extensions-2.31.0-SNAPSHOT.jar> to org.apache.activemq/artemis-service-extensions/2.31.0-SNAPSHOT/artemis-service-extensions-2.31.0-SNAPSHOT.jar
[JENKINS] Archiving <https://ci-builds.apache.org/job/ActiveMQ/job/ActiveMQ-Artemis-JDK11/ws/artemis-service-extensions/target/artemis-service-extensions-2.31.0-SNAPSHOT-sources.jar> to org.apache.activemq/artemis-service-extensions/2.31.0-SNAPSHOT/artemis-service-extensions-2.31.0-SNAPSHOT-sources.jar
[JENKINS] Archiving <https://ci-builds.apache.org/job/ActiveMQ/job/ActiveMQ-Artemis-JDK11/ws/artemis-server-osgi/pom.xml> to org.apache.activemq/artemis-server-osgi/2.31.0-SNAPSHOT/artemis-server-osgi-2.31.0-SNAPSHOT.pom
[JENKINS] Archiving <https://ci-builds.apache.org/job/ActiveMQ/job/ActiveMQ-Artemis-JDK11/ws/artemis-junit/pom.xml> to org.apache.activemq/artemis-junit-parent/2.31.0-SNAPSHOT/artemis-junit-parent-2.31.0-SNAPSHOT.pom
[JENKINS] Archiving <https://ci-builds.apache.org/job/ActiveMQ/job/ActiveMQ-Artemis-JDK11/ws/tests/unit-tests/pom.xml> to org.apache.activemq.tests/unit-tests/2.31.0-SNAPSHOT/unit-tests-2.31.0-SNAPSHOT.pom
[JENKINS] Archiving <https://ci-builds.apache.org/job/ActiveMQ/job/ActiveMQ-Artemis-JDK11/ws/tests/leak-tests/pom.xml> to org.apache.activemq.tests/leak-tests/2.31.0-SNAPSHOT/leak-tests-2.31.0-SNAPSHOT.pom
[JENKINS] Archiving <https://ci-builds.apache.org/job/ActiveMQ/job/ActiveMQ-Artemis-JDK11/ws/artemis-protocols/artemis-stomp-protocol/pom.xml> to org.apache.activemq/artemis-stomp-protocol/2.31.0-SNAPSHOT/artemis-stomp-protocol-2.31.0-SNAPSHOT.pom
[JENKINS] Archiving <https://ci-builds.apache.org/job/ActiveMQ/job/ActiveMQ-Artemis-JDK11/ws/artemis-protocols/artemis-stomp-protocol/target/artemis-stomp-protocol-2.31.0-SNAPSHOT.jar> to org.apache.activemq/artemis-stomp-protocol/2.31.0-SNAPSHOT/artemis-stomp-protocol-2.31.0-SNAPSHOT.jar
[JENKINS] Archiving <https://ci-builds.apache.org/job/ActiveMQ/job/ActiveMQ-Artemis-JDK11/ws/artemis-protocols/artemis-stomp-protocol/target/artemis-stomp-protocol-2.31.0-SNAPSHOT-sources.jar> to org.apache.activemq/artemis-stomp-protocol/2.31.0-SNAPSHOT/artemis-stomp-protocol-2.31.0-SNAPSHOT-sources.jar
[JENKINS] Archiving <https://ci-builds.apache.org/job/ActiveMQ/job/ActiveMQ-Artemis-JDK11/ws/artemis-protocols/artemis-hornetq-protocol/pom.xml> to org.apache.activemq/artemis-hornetq-protocol/2.31.0-SNAPSHOT/artemis-hornetq-protocol-2.31.0-SNAPSHOT.pom
[JENKINS] Archiving <https://ci-builds.apache.org/job/ActiveMQ/job/ActiveMQ-Artemis-JDK11/ws/artemis-protocols/artemis-hornetq-protocol/target/artemis-hornetq-protocol-2.31.0-SNAPSHOT.jar> to org.apache.activemq/artemis-hornetq-protocol/2.31.0-SNAPSHOT/artemis-hornetq-protocol-2.31.0-SNAPSHOT.jar
[JENKINS] Archiving <https://ci-builds.apache.org/job/ActiveMQ/job/ActiveMQ-Artemis-JDK11/ws/artemis-protocols/artemis-hornetq-protocol/target/artemis-hornetq-protocol-2.31.0-SNAPSHOT-sources.jar> to org.apache.activemq/artemis-hornetq-protocol/2.31.0-SNAPSHOT/artemis-hornetq-protocol-2.31.0-SNAPSHOT-sources.jar
[JENKINS] Archiving <https://ci-builds.apache.org/job/ActiveMQ/job/ActiveMQ-Artemis-JDK11/ws/artemis-core-client-osgi/pom.xml> to org.apache.activemq/artemis-core-client-osgi/2.31.0-SNAPSHOT/artemis-core-client-osgi-2.31.0-SNAPSHOT.pom
[JENKINS] Archiving <https://ci-builds.apache.org/job/ActiveMQ/job/ActiveMQ-Artemis-JDK11/ws/tests/performance-tests/pom.xml> to org.apache.activemq.tests/performance-tests/2.31.0-SNAPSHOT/performance-tests-2.31.0-SNAPSHOT.pom
[JENKINS] Archiving <https://ci-builds.apache.org/job/ActiveMQ/job/ActiveMQ-Artemis-JDK11/ws/artemis-features/pom.xml> to org.apache.activemq/artemis-features/2.31.0-SNAPSHOT/artemis-features-2.31.0-SNAPSHOT.pom
[JENKINS] Archiving <https://ci-builds.apache.org/job/ActiveMQ/job/ActiveMQ-Artemis-JDK11/ws/artemis-commons/dependency-reduced-pom.xml> to org.apache.activemq/artemis-commons/2.31.0-SNAPSHOT/artemis-commons-2.31.0-SNAPSHOT.pom
[JENKINS] Archiving <https://ci-builds.apache.org/job/ActiveMQ/job/ActiveMQ-Artemis-JDK11/ws/artemis-commons/target/artemis-commons-2.31.0-SNAPSHOT.jar> to org.apache.activemq/artemis-commons/2.31.0-SNAPSHOT/artemis-commons-2.31.0-SNAPSHOT.jar
[JENKINS] Archiving <https://ci-builds.apache.org/job/ActiveMQ/job/ActiveMQ-Artemis-JDK11/ws/artemis-commons/target/artemis-commons-2.31.0-SNAPSHOT-sources.jar> to org.apache.activemq/artemis-commons/2.31.0-SNAPSHOT/artemis-commons-2.31.0-SNAPSHOT-sources.jar
[JENKINS] Archiving <https://ci-builds.apache.org/job/ActiveMQ/job/ActiveMQ-Artemis-JDK11/ws/artemis-journal/pom.xml> to org.apache.activemq/artemis-journal/2.31.0-SNAPSHOT/artemis-journal-2.31.0-SNAPSHOT.pom
[JENKINS] Archiving <https://ci-builds.apache.org/job/ActiveMQ/job/ActiveMQ-Artemis-JDK11/ws/artemis-journal/target/artemis-journal-2.31.0-SNAPSHOT.jar> to org.apache.activemq/artemis-journal/2.31.0-SNAPSHOT/artemis-journal-2.31.0-SNAPSHOT.jar
[JENKINS] Archiving <https://ci-builds.apache.org/job/ActiveMQ/job/ActiveMQ-Artemis-JDK11/ws/artemis-journal/target/artemis-journal-2.31.0-SNAPSHOT-sources.jar> to org.apache.activemq/artemis-journal/2.31.0-SNAPSHOT/artemis-journal-2.31.0-SNAPSHOT-sources.jar
[JENKINS] Archiving <https://ci-builds.apache.org/job/ActiveMQ/job/ActiveMQ-Artemis-JDK11/ws/tests/soak-tests/pom.xml> to org.apache.activemq.tests/soak-tests/2.31.0-SNAPSHOT/soak-tests-2.31.0-SNAPSHOT.pom
[JENKINS] Archiving <https://ci-builds.apache.org/job/ActiveMQ/job/ActiveMQ-Artemis-JDK11/ws/artemis-core-client/pom.xml> to org.apache.activemq/artemis-core-client/2.31.0-SNAPSHOT/artemis-core-client-2.31.0-SNAPSHOT.pom
[JENKINS] Archiving <https://ci-builds.apache.org/job/ActiveMQ/job/ActiveMQ-Artemis-JDK11/ws/artemis-core-client/target/artemis-core-client-2.31.0-SNAPSHOT.jar> to org.apache.activemq/artemis-core-client/2.31.0-SNAPSHOT/artemis-core-client-2.31.0-SNAPSHOT.jar
[JENKINS] Archiving <https://ci-builds.apache.org/job/ActiveMQ/job/ActiveMQ-Artemis-JDK11/ws/artemis-core-client/target/artemis-core-client-2.31.0-SNAPSHOT-sources.jar> to org.apache.activemq/artemis-core-client/2.31.0-SNAPSHOT/artemis-core-client-2.31.0-SNAPSHOT-sources.jar
[JENKINS] Archiving <https://ci-builds.apache.org/job/ActiveMQ/job/ActiveMQ-Artemis-JDK11/ws/tests/integration-tests-isolated/pom.xml> to org.apache.activemq.tests/integration-tests-isolated/2.31.0-SNAPSHOT/integration-tests-isolated-2.31.0-SNAPSHOT.pom
[JENKINS] Archiving <https://ci-builds.apache.org/job/ActiveMQ/job/ActiveMQ-Artemis-JDK11/ws/artemis-jakarta-ra/pom.xml> to org.apache.activemq/artemis-jakarta-ra/2.31.0-SNAPSHOT/artemis-jakarta-ra-2.31.0-SNAPSHOT.pom
[JENKINS] Archiving <https://ci-builds.apache.org/job/ActiveMQ/job/ActiveMQ-Artemis-JDK11/ws/tests/timing-tests/pom.xml> to org.apache.activemq.tests/timing-tests/2.31.0-SNAPSHOT/timing-tests-2.31.0-SNAPSHOT.pom
[JENKINS] Archiving <https://ci-builds.apache.org/job/ActiveMQ/job/ActiveMQ-Artemis-JDK11/ws/artemis-junit/artemis-junit-5/pom.xml> to org.apache.activemq/artemis-junit-5/2.31.0-SNAPSHOT/artemis-junit-5-2.31.0-SNAPSHOT.pom
[JENKINS] Archiving <https://ci-builds.apache.org/job/ActiveMQ/job/ActiveMQ-Artemis-JDK11/ws/artemis-jms-client-all/pom.xml> to org.apache.activemq/artemis-jms-client-all/2.31.0-SNAPSHOT/artemis-jms-client-all-2.31.0-SNAPSHOT.pom
[JENKINS] Archiving <https://ci-builds.apache.org/job/ActiveMQ/job/ActiveMQ-Artemis-JDK11/ws/artemis-protocols/pom.xml> to org.apache.activemq/artemis-protocols/2.31.0-SNAPSHOT/artemis-protocols-2.31.0-SNAPSHOT.pom
[JENKINS] Archiving <https://ci-builds.apache.org/job/ActiveMQ/job/ActiveMQ-Artemis-JDK11/ws/tests/karaf-server-integration-tests/pom.xml> to org.apache.activemq.tests/karaf-server-integration-tests/2.31.0-SNAPSHOT/karaf-server-integration-tests-2.31.0-SNAPSHOT.pom
[JENKINS] Archiving <https://ci-builds.apache.org/job/ActiveMQ/job/ActiveMQ-Artemis-JDK11/ws/artemis-hawtio/artemis-plugin/pom.xml> to org.apache.activemq/artemis-plugin/2.31.0-SNAPSHOT/artemis-plugin-2.31.0-SNAPSHOT.pom
[JENKINS] Archiving <https://ci-builds.apache.org/job/ActiveMQ/job/ActiveMQ-Artemis-JDK11/ws/artemis-quorum-api/pom.xml> to org.apache.activemq/artemis-quorum-api/2.31.0-SNAPSHOT/artemis-quorum-api-2.31.0-SNAPSHOT.pom
[JENKINS] Archiving <https://ci-builds.apache.org/job/ActiveMQ/job/ActiveMQ-Artemis-JDK11/ws/artemis-quorum-api/target/artemis-quorum-api-2.31.0-SNAPSHOT.jar> to org.apache.activemq/artemis-quorum-api/2.31.0-SNAPSHOT/artemis-quorum-api-2.31.0-SNAPSHOT.jar
[JENKINS] Archiving <https://ci-builds.apache.org/job/ActiveMQ/job/ActiveMQ-Artemis-JDK11/ws/artemis-quorum-api/target/artemis-quorum-api-2.31.0-SNAPSHOT-sources.jar> to org.apache.activemq/artemis-quorum-api/2.31.0-SNAPSHOT/artemis-quorum-api-2.31.0-SNAPSHOT-sources.jar
[JENKINS] Archiving <https://ci-builds.apache.org/job/ActiveMQ/job/ActiveMQ-Artemis-JDK11/ws/artemis-dto/pom.xml> to org.apache.activemq/artemis-dto/2.31.0-SNAPSHOT/artemis-dto-2.31.0-SNAPSHOT.pom
[JENKINS] Archiving <https://ci-builds.apache.org/job/ActiveMQ/job/ActiveMQ-Artemis-JDK11/ws/artemis-dto/target/artemis-dto-2.31.0-SNAPSHOT.jar> to org.apache.activemq/artemis-dto/2.31.0-SNAPSHOT/artemis-dto-2.31.0-SNAPSHOT.jar
[JENKINS] Archiving <https://ci-builds.apache.org/job/ActiveMQ/job/ActiveMQ-Artemis-JDK11/ws/artemis-dto/target/artemis-dto-2.31.0-SNAPSHOT-sources.jar> to org.apache.activemq/artemis-dto/2.31.0-SNAPSHOT/artemis-dto-2.31.0-SNAPSHOT-sources.jar
[JENKINS] Archiving <https://ci-builds.apache.org/job/ActiveMQ/job/ActiveMQ-Artemis-JDK11/ws/artemis-unit-test-support/pom.xml> to org.apache.activemq/artemis-unit-test-support/2.31.0-SNAPSHOT/artemis-unit-test-support-2.31.0-SNAPSHOT.pom
[JENKINS] Archiving <https://ci-builds.apache.org/job/ActiveMQ/job/ActiveMQ-Artemis-JDK11/ws/artemis-unit-test-support/target/artemis-unit-test-support-2.31.0-SNAPSHOT.jar> to org.apache.activemq/artemis-unit-test-support/2.31.0-SNAPSHOT/artemis-unit-test-support-2.31.0-SNAPSHOT.jar
[JENKINS] Archiving <https://ci-builds.apache.org/job/ActiveMQ/job/ActiveMQ-Artemis-JDK11/ws/artemis-unit-test-support/target/artemis-unit-test-support-2.31.0-SNAPSHOT-sources.jar> to org.apache.activemq/artemis-unit-test-support/2.31.0-SNAPSHOT/artemis-unit-test-support-2.31.0-SNAPSHOT-sources.jar
[JENKINS] Archiving <https://ci-builds.apache.org/job/ActiveMQ/job/ActiveMQ-Artemis-JDK11/ws/artemis-jakarta-service-extensions/pom.xml> to org.apache.activemq/artemis-jakarta-service-extensions/2.31.0-SNAPSHOT/artemis-jakarta-service-extensions-2.31.0-SNAPSHOT.pom
[JENKINS] Archiving <https://ci-builds.apache.org/job/ActiveMQ/job/ActiveMQ-Artemis-JDK11/ws/artemis-protocols/artemis-hqclient-protocol/pom.xml> to org.apache.activemq/artemis-hqclient-protocol/2.31.0-SNAPSHOT/artemis-hqclient-protocol-2.31.0-SNAPSHOT.pom
[JENKINS] Archiving <https://ci-builds.apache.org/job/ActiveMQ/job/ActiveMQ-Artemis-JDK11/ws/artemis-protocols/artemis-hqclient-protocol/target/artemis-hqclient-protocol-2.31.0-SNAPSHOT.jar> to org.apache.activemq/artemis-hqclient-protocol/2.31.0-SNAPSHOT/artemis-hqclient-protocol-2.31.0-SNAPSHOT.jar
[JENKINS] Archiving <https://ci-builds.apache.org/job/ActiveMQ/job/ActiveMQ-Artemis-JDK11/ws/artemis-protocols/artemis-hqclient-protocol/target/artemis-hqclient-protocol-2.31.0-SNAPSHOT-sources.jar> to org.apache.activemq/artemis-hqclient-protocol/2.31.0-SNAPSHOT/artemis-hqclient-protocol-2.31.0-SNAPSHOT-sources.jar
[JENKINS] Archiving <https://ci-builds.apache.org/job/ActiveMQ/job/ActiveMQ-Artemis-JDK11/ws/artemis-jms-client-osgi/pom.xml> to org.apache.activemq/artemis-jms-client-osgi/2.31.0-SNAPSHOT/artemis-jms-client-osgi-2.31.0-SNAPSHOT.pom
[JENKINS] Archiving <https://ci-builds.apache.org/job/ActiveMQ/job/ActiveMQ-Artemis-JDK11/ws/tests/integration-tests/pom.xml> to org.apache.activemq.tests/integration-tests/2.31.0-SNAPSHOT/integration-tests-2.31.0-SNAPSHOT.pom
[JENKINS] Archiving <https://ci-builds.apache.org/job/ActiveMQ/job/ActiveMQ-Artemis-JDK11/ws/artemis-boot/pom.xml> to org.apache.activemq/artemis-boot/2.31.0-SNAPSHOT/artemis-boot-2.31.0-SNAPSHOT.pom
[JENKINS] Archiving <https://ci-builds.apache.org/job/ActiveMQ/job/ActiveMQ-Artemis-JDK11/ws/artemis-boot/target/artemis-boot-2.31.0-SNAPSHOT.jar> to org.apache.activemq/artemis-boot/2.31.0-SNAPSHOT/artemis-boot-2.31.0-SNAPSHOT.jar
[JENKINS] Archiving <https://ci-builds.apache.org/job/ActiveMQ/job/ActiveMQ-Artemis-JDK11/ws/artemis-boot/target/artemis-boot-2.31.0-SNAPSHOT-sources.jar> to org.apache.activemq/artemis-boot/2.31.0-SNAPSHOT/artemis-boot-2.31.0-SNAPSHOT-sources.jar
[JENKINS] Archiving <https://ci-builds.apache.org/job/ActiveMQ/job/ActiveMQ-Artemis-JDK11/ws/artemis-jakarta-client/pom.xml> to org.apache.activemq/artemis-jakarta-client/2.31.0-SNAPSHOT/artemis-jakarta-client-2.31.0-SNAPSHOT.pom
[JENKINS] Archiving <https://ci-builds.apache.org/job/ActiveMQ/job/ActiveMQ-Artemis-JDK11/ws/artemis-protocols/artemis-amqp-protocol/pom.xml> to org.apache.activemq/artemis-amqp-protocol/2.31.0-SNAPSHOT/artemis-amqp-protocol-2.31.0-SNAPSHOT.pom
[JENKINS] Archiving <https://ci-builds.apache.org/job/ActiveMQ/job/ActiveMQ-Artemis-JDK11/ws/artemis-protocols/artemis-amqp-protocol/target/artemis-amqp-protocol-2.31.0-SNAPSHOT.jar> to org.apache.activemq/artemis-amqp-protocol/2.31.0-SNAPSHOT/artemis-amqp-protocol-2.31.0-SNAPSHOT.jar
[JENKINS] Archiving <https://ci-builds.apache.org/job/ActiveMQ/job/ActiveMQ-Artemis-JDK11/ws/artemis-protocols/artemis-amqp-protocol/target/artemis-amqp-protocol-2.31.0-SNAPSHOT-sources.jar> to org.apache.activemq/artemis-amqp-protocol/2.31.0-SNAPSHOT/artemis-amqp-protocol-2.31.0-SNAPSHOT-sources.jar
[JENKINS] Archiving <https://ci-builds.apache.org/job/ActiveMQ/job/ActiveMQ-Artemis-JDK11/ws/artemis-jakarta-server/pom.xml> to org.apache.activemq/artemis-jakarta-server/2.31.0-SNAPSHOT/artemis-jakarta-server-2.31.0-SNAPSHOT.pom
[JENKINS] Archiving <https://ci-builds.apache.org/job/ActiveMQ/job/ActiveMQ-Artemis-JDK11/ws/artemis-protocols/artemis-mqtt-protocol/pom.xml> to org.apache.activemq/artemis-mqtt-protocol/2.31.0-SNAPSHOT/artemis-mqtt-protocol-2.31.0-SNAPSHOT.pom
[JENKINS] Archiving <https://ci-builds.apache.org/job/ActiveMQ/job/ActiveMQ-Artemis-JDK11/ws/artemis-protocols/artemis-mqtt-protocol/target/artemis-mqtt-protocol-2.31.0-SNAPSHOT.jar> to org.apache.activemq/artemis-mqtt-protocol/2.31.0-SNAPSHOT/artemis-mqtt-protocol-2.31.0-SNAPSHOT.jar
[JENKINS] Archiving <https://ci-builds.apache.org/job/ActiveMQ/job/ActiveMQ-Artemis-JDK11/ws/artemis-protocols/artemis-mqtt-protocol/target/artemis-mqtt-protocol-2.31.0-SNAPSHOT-sources.jar> to org.apache.activemq/artemis-mqtt-protocol/2.31.0-SNAPSHOT/artemis-mqtt-protocol-2.31.0-SNAPSHOT-sources.jar
[JENKINS] Archiving <https://ci-builds.apache.org/job/ActiveMQ/job/ActiveMQ-Artemis-JDK11/ws/tests/e2e-tests/pom.xml> to org.apache.activemq.tests/e2e-tests/2.31.0-SNAPSHOT/e2e-tests-2.31.0-SNAPSHOT.pom
[JENKINS] Archiving <https://ci-builds.apache.org/job/ActiveMQ/job/ActiveMQ-Artemis-JDK11/ws/artemis-hawtio/pom.xml> to org.apache.activemq/artemis-hawtio-pom/2.31.0-SNAPSHOT/artemis-hawtio-pom-2.31.0-SNAPSHOT.pom
[JENKINS] Archiving <https://ci-builds.apache.org/job/ActiveMQ/job/ActiveMQ-Artemis-JDK11/ws/tests/stress-tests/pom.xml> to org.apache.activemq.tests/stress-tests/2.31.0-SNAPSHOT/stress-tests-2.31.0-SNAPSHOT.pom
channel stopped

Build failed in Jenkins: ActiveMQ » ActiveMQ-Artemis-JDK11 #1515

Posted by Apache Jenkins Server <je...@builds.apache.org>.
See <https://ci-builds.apache.org/job/ActiveMQ/job/ActiveMQ-Artemis-JDK11/1515/display/redirect?page=changes>

Changes:

[Clebert Suconic] ARTEMIS-4372 small fixes on CLI


------------------------------------------
[...truncated 1.92 MB...]
[ERROR] org.apache.activemq.cli.test.MessageSerializerTest.testAnycastToMulticastTopic(org.apache.activemq.cli.test.MessageSerializerTest)
[ERROR]   Run 1: MessageSerializerTest.setup:70->CliTestBase.startServer:95 » CLI Error: There ...
[ERROR]   Run 2: MessageSerializerTest.tearDown:78->CliTestBase.closeConnection:135->CliTestBase.stopServer:107 » Configuration
[INFO] 
[ERROR] org.apache.activemq.cli.test.MessageSerializerTest.testLargeMessageExport(org.apache.activemq.cli.test.MessageSerializerTest)
[ERROR]   Run 1: MessageSerializerTest.setup:70->CliTestBase.startServer:95 » CLI Error: There ...
[ERROR]   Run 2: MessageSerializerTest.tearDown:78->CliTestBase.closeConnection:135->CliTestBase.stopServer:107 » Configuration
[INFO] 
[ERROR] org.apache.activemq.cli.test.MessageSerializerTest.testMapMessageImportExport(org.apache.activemq.cli.test.MessageSerializerTest)
[ERROR]   Run 1: MessageSerializerTest.setup:70->CliTestBase.startServer:95 » CLI Error: There ...
[ERROR]   Run 2: MessageSerializerTest.tearDown:78->CliTestBase.closeConnection:135->CliTestBase.stopServer:107 » Configuration
[INFO] 
[ERROR] org.apache.activemq.cli.test.MessageSerializerTest.testMulticastTopicToAnycastQueueBothAddress(org.apache.activemq.cli.test.MessageSerializerTest)
[ERROR]   Run 1: MessageSerializerTest.setup:70->CliTestBase.startServer:95 » CLI Error: There ...
[ERROR]   Run 2: MessageSerializerTest.tearDown:78->CliTestBase.closeConnection:135->CliTestBase.stopServer:107 » Configuration
[INFO] 
[ERROR] org.apache.activemq.cli.test.MessageSerializerTest.testObjectMessageImportExport(org.apache.activemq.cli.test.MessageSerializerTest)
[ERROR]   Run 1: MessageSerializerTest.setup:70->CliTestBase.startServer:95 » CLI Error: There ...
[ERROR]   Run 2: MessageSerializerTest.tearDown:78->CliTestBase.closeConnection:135->CliTestBase.stopServer:107 » Configuration
[INFO] 
[ERROR] org.apache.activemq.cli.test.MessageSerializerTest.testSendDirectToAnycastQueue(org.apache.activemq.cli.test.MessageSerializerTest)
[ERROR]   Run 1: MessageSerializerTest.setup:70->CliTestBase.startServer:95 » CLI Error: There ...
[ERROR]   Run 2: MessageSerializerTest.tearDown:78->CliTestBase.closeConnection:135->CliTestBase.stopServer:107 » Configuration
[INFO] 
[ERROR] org.apache.activemq.cli.test.MessageSerializerTest.testSendDirectToMulticastQueue(org.apache.activemq.cli.test.MessageSerializerTest)
[ERROR]   Run 1: MessageSerializerTest.setup:70->CliTestBase.startServer:95 » CLI Error: There ...
[ERROR]   Run 2: MessageSerializerTest.tearDown:78->CliTestBase.closeConnection:135->CliTestBase.stopServer:107 » Configuration
[INFO] 
[ERROR] org.apache.activemq.cli.test.MessageSerializerTest.testTextMessageImportExport(org.apache.activemq.cli.test.MessageSerializerTest)
[ERROR]   Run 1: MessageSerializerTest.setup:70->CliTestBase.startServer:95 » CLI Error: There ...
[ERROR]   Run 2: MessageSerializerTest.tearDown:78->CliTestBase.closeConnection:135->CliTestBase.stopServer:107 » Configuration
[INFO] 
[ERROR]   RetryCLIClientIDTest.testWrongUserAndPass:54->CliTestBase.stopServer:107 » Configuration
[ERROR] org.apache.activemq.cli.test.TransferTest.testTransferMessagesWithMessageCount(org.apache.activemq.cli.test.TransferTest)
[ERROR]   Run 1: TransferTest.setup:47->CliTestBase.startServer:95 » CLI Error: There is anothe...
[ERROR]   Run 2: TransferTest.tearDown:55->CliTestBase.closeConnection:135->CliTestBase.stopServer:107 » Configuration
[INFO] 
[INFO] 
[ERROR] Tests run: 108, Failures: 11, Errors: 20, Skipped: 0
[INFO] 
[JENKINS] Recording test results
[INFO] ------------------------------------------------------------------------
[INFO] Reactor Summary for ActiveMQ Artemis Parent 2.31.0-SNAPSHOT:
[INFO] 
[INFO] ActiveMQ Artemis Parent ............................ SUCCESS [ 14.210 s]
[INFO] ActiveMQ Artemis Unit Test Support ................. SUCCESS [ 12.989 s]
[INFO] ActiveMQ Log Annotation Processor .................. SUCCESS [ 29.855 s]
[INFO] ActiveMQ Artemis Commons ........................... SUCCESS [ 32.288 s]
[INFO] ActiveMQ Artemis Selector Implementation ........... SUCCESS [ 16.345 s]
[INFO] ActiveMQ Artemis Core Client ....................... SUCCESS [ 29.240 s]
[INFO] ActiveMQ Artemis Journal ........................... SUCCESS [ 12.942 s]
[INFO] ActiveMQ Artemis JDBC Store ........................ SUCCESS [01:00 min]
[INFO] ActiveMQ Artemis Quorum API ........................ SUCCESS [  9.107 s]
[INFO] ActiveMQ Artemis Server ............................ SUCCESS [02:59 min]
[INFO] ActiveMQ Artemis Protocols ......................... SUCCESS [  3.053 s]
[INFO] ActiveMQ Artemis AMQP Protocol ..................... SUCCESS [ 21.595 s]
[INFO] ActiveMQ Artemis STOMP Protocol .................... SUCCESS [  6.654 s]
[INFO] ActiveMQ Artemis JMS Client ........................ SUCCESS [  9.780 s]
[INFO] ActiveMQ Artemis OpenWire Protocol ................. SUCCESS [ 21.909 s]
[INFO] ActiveMQ Artemis HQClient Protocol ................. SUCCESS [  9.330 s]
[INFO] ActiveMQ Artemis HornetQ Protocol .................. SUCCESS [ 10.902 s]
[INFO] ActiveMQ Artemis MQTT Protocol ..................... SUCCESS [  6.599 s]
[INFO] ActiveMQ Artemis DTO ............................... SUCCESS [  8.517 s]
[INFO] ActiveMQ Artemis CDI Integration ................... SUCCESS [ 11.292 s]
[INFO] ActiveMQ Artemis Boot .............................. SUCCESS [  5.732 s]
[INFO] ActiveMQ Artemis Service Extensions ................ SUCCESS [  7.903 s]
[INFO] ActiveMQ Artemis JMS Server ........................ SUCCESS [  6.412 s]
[INFO] ActiveMQ Artemis JUnit ............................. SUCCESS [  2.915 s]
[INFO] ActiveMQ Artemis JUnit Commons ..................... SUCCESS [  5.771 s]
[INFO] ActiveMQ Artemis JUnit 4 Rules ..................... SUCCESS [ 12.371 s]
[INFO] ActiveMQ Artemis CLI ............................... FAILURE [02:28 min]
[INFO] ActiveMQ Artemis Web ............................... SKIPPED
[INFO] ActiveMQ Artemis Core Client All ................... SKIPPED
[INFO] ActiveMQ Artemis Client OSGi ....................... SKIPPED
[INFO] ActiveMQ Artemis JUnit 5 Extensions ................ SKIPPED
[INFO] ActiveMQ Artemis JMS Client All .................... SKIPPED
[INFO] ActiveMQ Artemis JMS Client OSGi ................... SKIPPED
[INFO] ActiveMQ Artemis Jakarta Messaging Client .......... SKIPPED
[INFO] ActiveMQ Artemis Jakarta Messaging Client All ...... SKIPPED
[INFO] ActiveMQ Artemis Jakarta Service Extensions ........ SKIPPED
[INFO] ActiveMQ Artemis Jakarta Messaging Server .......... SKIPPED
[INFO] ActiveMQ Artemis RAR POM ........................... SKIPPED
[INFO] ActiveMQ Artemis Jakarta RAR ....................... SKIPPED
[INFO] ActiveMQ Artemis Maven Plugin ...................... SKIPPED
[INFO] ActiveMQ Artemis Server OSGi ....................... SKIPPED
[INFO] ActiveMQ Artemis Cons .............................. SKIPPED
[INFO] ActiveMQ Artemis HawtIO Branding ................... SKIPPED
[INFO] ActiveMQ Artemis HawtIO Plugin ..................... SKIPPED
[INFO] ActiveMQ Artemis Console ........................... SKIPPED
[INFO] ActiveMQ Artemis Spring Integration ................ SKIPPED
[INFO] ActiveMQ Artemis Quorum RI ......................... SKIPPED
[INFO] Apache ActiveMQ Artemis Distribution ............... SKIPPED
[INFO] ActiveMQ Artemis Tests POM ......................... SKIPPED
[INFO] ActiveMQ Artemis Test Support ...................... SKIPPED
[INFO] ActiveMQ Artemis Unit Tests ........................ SKIPPED
[INFO] ActiveMQ Artemis Joram Tests ....................... SKIPPED
[INFO] ActiveMQ Artemis timing Tests ...................... SKIPPED
[INFO] ActiveMQ Artemis JMS Tests ......................... SKIPPED
[INFO] ActiveMQ Artemis Integration Tests ................. SKIPPED
[INFO] ActiveMQ Artemis Isolated Integration Tests ........ SKIPPED
[INFO] ActiveMQ Artemis Features .......................... SKIPPED
[INFO] ActiveMQ Artemis Karaf Client Integration Tests .... SKIPPED
[INFO] ActiveMQ Artemis Karaf Server Integration Tests .... SKIPPED
[INFO] ActiveMQ Artemis Compatibility Tests ............... SKIPPED
[INFO] ActiveMQ Artemis soak Tests ........................ SKIPPED
[INFO] ActiveMQ Artemis stress Tests ...................... SKIPPED
[INFO] ActiveMQ Artemis performance Tests ................. SKIPPED
[INFO] Smoke Tests ........................................ SKIPPED
[INFO] End-to-End Tests ................................... SKIPPED
[INFO] ActiveMQ Artemis Leak Tests ........................ SKIPPED
[INFO] Apache ActiveMQ Artemis Image ...................... SKIPPED
[INFO] Apache ActiveMQ Artemis Image Examples ............. SKIPPED
[INFO] ------------------------------------------------------------------------
[INFO] BUILD FAILURE
[INFO] ------------------------------------------------------------------------
[INFO] Total time:  14:31 min
[INFO] Finished at: 2023-08-01T03:08:22Z
[INFO] ------------------------------------------------------------------------
Waiting for Jenkins to finish collecting data
[ERROR] Failed to execute goal org.apache.maven.plugins:maven-surefire-plugin:2.22.2:test (default-test) on project artemis-cli: There are test failures.
[ERROR] 
[ERROR] Please refer to <https://ci-builds.apache.org/job/ActiveMQ/job/ActiveMQ-Artemis-JDK11/ws/artemis-cli/target/surefire-reports> for the individual test results.
[ERROR] Please refer to dump files (if any exist) [date].dump, [date]-jvmRun[N].dump and [date].dumpstream.
[ERROR] -> [Help 1]
[ERROR] 
[ERROR] To see the full stack trace of the errors, re-run Maven with the -e switch.
[ERROR] Re-run Maven using the -X switch to enable full debug logging.
[ERROR] 
[ERROR] For more information about the errors and possible solutions, please read the following articles:
[ERROR] [Help 1] http://cwiki.apache.org/confluence/display/MAVEN/MojoFailureException
[ERROR] 
[ERROR] After correcting the problems, you can resume the build with the command
[ERROR]   mvn <goals> -rf :artemis-cli
[JENKINS] Archiving <https://ci-builds.apache.org/job/ActiveMQ/job/ActiveMQ-Artemis-JDK11/ws/artemis-server/pom.xml> to org.apache.activemq/artemis-server/2.31.0-SNAPSHOT/artemis-server-2.31.0-SNAPSHOT.pom
[JENKINS] Archiving <https://ci-builds.apache.org/job/ActiveMQ/job/ActiveMQ-Artemis-JDK11/ws/artemis-server/target/artemis-server-2.31.0-SNAPSHOT.jar> to org.apache.activemq/artemis-server/2.31.0-SNAPSHOT/artemis-server-2.31.0-SNAPSHOT.jar
[JENKINS] Archiving <https://ci-builds.apache.org/job/ActiveMQ/job/ActiveMQ-Artemis-JDK11/ws/artemis-server/target/artemis-server-2.31.0-SNAPSHOT-tests.jar> to org.apache.activemq/artemis-server/2.31.0-SNAPSHOT/artemis-server-2.31.0-SNAPSHOT-tests.jar
[JENKINS] Archiving <https://ci-builds.apache.org/job/ActiveMQ/job/ActiveMQ-Artemis-JDK11/ws/artemis-server/target/artemis-server-2.31.0-SNAPSHOT-sources.jar> to org.apache.activemq/artemis-server/2.31.0-SNAPSHOT/artemis-server-2.31.0-SNAPSHOT-sources.jar
[JENKINS] Archiving <https://ci-builds.apache.org/job/ActiveMQ/job/ActiveMQ-Artemis-JDK11/ws/artemis-image/examples/pom.xml> to org.apache.activemq/artemis-image-examples/2.31.0-SNAPSHOT/artemis-image-examples-2.31.0-SNAPSHOT.pom
[JENKINS] Archiving <https://ci-builds.apache.org/job/ActiveMQ/job/ActiveMQ-Artemis-JDK11/ws/tests/compatibility-tests/pom.xml> to org.apache.activemq.tests/compatibility-tests/2.31.0-SNAPSHOT/compatibility-tests-2.31.0-SNAPSHOT.pom
[JENKINS] Archiving <https://ci-builds.apache.org/job/ActiveMQ/job/ActiveMQ-Artemis-JDK11/ws/artemis-jms-client/pom.xml> to org.apache.activemq/artemis-jms-client/2.31.0-SNAPSHOT/artemis-jms-client-2.31.0-SNAPSHOT.pom
[JENKINS] Archiving <https://ci-builds.apache.org/job/ActiveMQ/job/ActiveMQ-Artemis-JDK11/ws/artemis-jms-client/target/artemis-jms-client-2.31.0-SNAPSHOT.jar> to org.apache.activemq/artemis-jms-client/2.31.0-SNAPSHOT/artemis-jms-client-2.31.0-SNAPSHOT.jar
[JENKINS] Archiving <https://ci-builds.apache.org/job/ActiveMQ/job/ActiveMQ-Artemis-JDK11/ws/artemis-jms-client/target/artemis-jms-client-2.31.0-SNAPSHOT-sources.jar> to org.apache.activemq/artemis-jms-client/2.31.0-SNAPSHOT/artemis-jms-client-2.31.0-SNAPSHOT-sources.jar
[JENKINS] Archiving <https://ci-builds.apache.org/job/ActiveMQ/job/ActiveMQ-Artemis-JDK11/ws/artemis-hawtio/activemq-branding/pom.xml> to org.apache.activemq/activemq-branding/2.31.0-SNAPSHOT/activemq-branding-2.31.0-SNAPSHOT.pom
[JENKINS] Archiving <https://ci-builds.apache.org/job/ActiveMQ/job/ActiveMQ-Artemis-JDK11/ws/tests/smoke-tests/pom.xml> to org.apache.activemq.tests/smoke-tests/2.31.0-SNAPSHOT/smoke-tests-2.31.0-SNAPSHOT.pom
[JENKINS] Archiving <https://ci-builds.apache.org/job/ActiveMQ/job/ActiveMQ-Artemis-JDK11/ws/tests/joram-tests/pom.xml> to org.apache.activemq.tests/joram-tests/2.31.0-SNAPSHOT/joram-tests-2.31.0-SNAPSHOT.pom
[JENKINS] Archiving <https://ci-builds.apache.org/job/ActiveMQ/job/ActiveMQ-Artemis-JDK11/ws/artemis-log-annotation-processor/pom.xml> to org.apache.activemq/artemis-log-annotation-processor/2.31.0-SNAPSHOT/artemis-log-annotation-processor-2.31.0-SNAPSHOT.pom
[JENKINS] Archiving <https://ci-builds.apache.org/job/ActiveMQ/job/ActiveMQ-Artemis-JDK11/ws/artemis-log-annotation-processor/target/artemis-log-annotation-processor-2.31.0-SNAPSHOT.jar> to org.apache.activemq/artemis-log-annotation-processor/2.31.0-SNAPSHOT/artemis-log-annotation-processor-2.31.0-SNAPSHOT.jar
[JENKINS] Archiving <https://ci-builds.apache.org/job/ActiveMQ/job/ActiveMQ-Artemis-JDK11/ws/artemis-log-annotation-processor/target/artemis-log-annotation-processor-2.31.0-SNAPSHOT-sources.jar> to org.apache.activemq/artemis-log-annotation-processor/2.31.0-SNAPSHOT/artemis-log-annotation-processor-2.31.0-SNAPSHOT-sources.jar
[JENKINS] Archiving <https://ci-builds.apache.org/job/ActiveMQ/job/ActiveMQ-Artemis-JDK11/ws/artemis-jms-server/pom.xml> to org.apache.activemq/artemis-jms-server/2.31.0-SNAPSHOT/artemis-jms-server-2.31.0-SNAPSHOT.pom
[JENKINS] Archiving <https://ci-builds.apache.org/job/ActiveMQ/job/ActiveMQ-Artemis-JDK11/ws/artemis-jms-server/target/artemis-jms-server-2.31.0-SNAPSHOT.jar> to org.apache.activemq/artemis-jms-server/2.31.0-SNAPSHOT/artemis-jms-server-2.31.0-SNAPSHOT.jar
[JENKINS] Archiving <https://ci-builds.apache.org/job/ActiveMQ/job/ActiveMQ-Artemis-JDK11/ws/artemis-jms-server/target/artemis-jms-server-2.31.0-SNAPSHOT-sources.jar> to org.apache.activemq/artemis-jms-server/2.31.0-SNAPSHOT/artemis-jms-server-2.31.0-SNAPSHOT-sources.jar
[JENKINS] Archiving <https://ci-builds.apache.org/job/ActiveMQ/job/ActiveMQ-Artemis-JDK11/ws/artemis-cli/pom.xml> to org.apache.activemq/artemis-cli/2.31.0-SNAPSHOT/artemis-cli-2.31.0-SNAPSHOT.pom
[JENKINS] Archiving <https://ci-builds.apache.org/job/ActiveMQ/job/ActiveMQ-Artemis-JDK11/ws/artemis-jakarta-client-all/pom.xml> to org.apache.activemq/artemis-jakarta-client-all/2.31.0-SNAPSHOT/artemis-jakarta-client-all-2.31.0-SNAPSHOT.pom
[JENKINS] Archiving <https://ci-builds.apache.org/job/ActiveMQ/job/ActiveMQ-Artemis-JDK11/ws/artemis-core-client-all/pom.xml> to org.apache.activemq/artemis-core-client-all/2.31.0-SNAPSHOT/artemis-core-client-all-2.31.0-SNAPSHOT.pom
[JENKINS] Archiving <https://ci-builds.apache.org/job/ActiveMQ/job/ActiveMQ-Artemis-JDK11/ws/tests/pom.xml> to org.apache.activemq.tests/artemis-tests-pom/2.31.0-SNAPSHOT/artemis-tests-pom-2.31.0-SNAPSHOT.pom
[JENKINS] Archiving <https://ci-builds.apache.org/job/ActiveMQ/job/ActiveMQ-Artemis-JDK11/ws/artemis-protocols/artemis-openwire-protocol/pom.xml> to org.apache.activemq/artemis-openwire-protocol/2.31.0-SNAPSHOT/artemis-openwire-protocol-2.31.0-SNAPSHOT.pom
[JENKINS] Archiving <https://ci-builds.apache.org/job/ActiveMQ/job/ActiveMQ-Artemis-JDK11/ws/artemis-protocols/artemis-openwire-protocol/target/artemis-openwire-protocol-2.31.0-SNAPSHOT.jar> to org.apache.activemq/artemis-openwire-protocol/2.31.0-SNAPSHOT/artemis-openwire-protocol-2.31.0-SNAPSHOT.jar
[JENKINS] Archiving <https://ci-builds.apache.org/job/ActiveMQ/job/ActiveMQ-Artemis-JDK11/ws/artemis-protocols/artemis-openwire-protocol/target/artemis-openwire-protocol-2.31.0-SNAPSHOT-sources.jar> to org.apache.activemq/artemis-openwire-protocol/2.31.0-SNAPSHOT/artemis-openwire-protocol-2.31.0-SNAPSHOT-sources.jar
[JENKINS] Archiving <https://ci-builds.apache.org/job/ActiveMQ/job/ActiveMQ-Artemis-JDK11/ws/artemis-image/pom.xml> to org.apache.activemq/artemis-image/2.31.0-SNAPSHOT/artemis-image-2.31.0-SNAPSHOT.pom
[JENKINS] Archiving <https://ci-builds.apache.org/job/ActiveMQ/job/ActiveMQ-Artemis-JDK11/ws/artemis-distribution/pom.xml> to org.apache.activemq/apache-artemis/2.31.0-SNAPSHOT/apache-artemis-2.31.0-SNAPSHOT.pom
[JENKINS] Archiving <https://ci-builds.apache.org/job/ActiveMQ/job/ActiveMQ-Artemis-JDK11/ws/artemis-hawtio/artemis-console/pom.xml> to org.apache.activemq/artemis-console/2.31.0-SNAPSHOT/artemis-console-2.31.0-SNAPSHOT.pom
[JENKINS] Archiving <https://ci-builds.apache.org/job/ActiveMQ/job/ActiveMQ-Artemis-JDK11/ws/tests/artemis-test-support/pom.xml> to org.apache.activemq.tests/artemis-test-support/2.31.0-SNAPSHOT/artemis-test-support-2.31.0-SNAPSHOT.pom
[JENKINS] Archiving <https://ci-builds.apache.org/job/ActiveMQ/job/ActiveMQ-Artemis-JDK11/ws/artemis-selector/pom.xml> to org.apache.activemq/artemis-selector/2.31.0-SNAPSHOT/artemis-selector-2.31.0-SNAPSHOT.pom
[JENKINS] Archiving <https://ci-builds.apache.org/job/ActiveMQ/job/ActiveMQ-Artemis-JDK11/ws/artemis-selector/target/artemis-selector-2.31.0-SNAPSHOT.jar> to org.apache.activemq/artemis-selector/2.31.0-SNAPSHOT/artemis-selector-2.31.0-SNAPSHOT.jar
[JENKINS] Archiving <https://ci-builds.apache.org/job/ActiveMQ/job/ActiveMQ-Artemis-JDK11/ws/artemis-selector/target/artemis-selector-2.31.0-SNAPSHOT-sources.jar> to org.apache.activemq/artemis-selector/2.31.0-SNAPSHOT/artemis-selector-2.31.0-SNAPSHOT-sources.jar
[JENKINS] Archiving <https://ci-builds.apache.org/job/ActiveMQ/job/ActiveMQ-Artemis-JDK11/ws/artemis-jdbc-store/pom.xml> to org.apache.activemq/artemis-jdbc-store/2.31.0-SNAPSHOT/artemis-jdbc-store-2.31.0-SNAPSHOT.pom
[JENKINS] Archiving <https://ci-builds.apache.org/job/ActiveMQ/job/ActiveMQ-Artemis-JDK11/ws/artemis-jdbc-store/target/artemis-jdbc-store-2.31.0-SNAPSHOT.jar> to org.apache.activemq/artemis-jdbc-store/2.31.0-SNAPSHOT/artemis-jdbc-store-2.31.0-SNAPSHOT.jar
[JENKINS] Archiving <https://ci-builds.apache.org/job/ActiveMQ/job/ActiveMQ-Artemis-JDK11/ws/artemis-jdbc-store/target/artemis-jdbc-store-2.31.0-SNAPSHOT-sources.jar> to org.apache.activemq/artemis-jdbc-store/2.31.0-SNAPSHOT/artemis-jdbc-store-2.31.0-SNAPSHOT-sources.jar
[JENKINS] Archiving <https://ci-builds.apache.org/job/ActiveMQ/job/ActiveMQ-Artemis-JDK11/ws/integration/activemq-spring-integration/pom.xml> to org.apache.activemq/artemis-spring-integration/2.31.0-SNAPSHOT/artemis-spring-integration-2.31.0-SNAPSHOT.pom
[JENKINS] Archiving <https://ci-builds.apache.org/job/ActiveMQ/job/ActiveMQ-Artemis-JDK11/ws/artemis-quorum-ri/pom.xml> to org.apache.activemq/artemis-quorum-ri/2.31.0-SNAPSHOT/artemis-quorum-ri-2.31.0-SNAPSHOT.pom
[JENKINS] Archiving <https://ci-builds.apache.org/job/ActiveMQ/job/ActiveMQ-Artemis-JDK11/ws/artemis-web/pom.xml> to org.apache.activemq/artemis-web/2.31.0-SNAPSHOT/artemis-web-2.31.0-SNAPSHOT.pom
[JENKINS] Archiving <https://ci-builds.apache.org/job/ActiveMQ/job/ActiveMQ-Artemis-JDK11/ws/artemis-junit/artemis-junit-commons/pom.xml> to org.apache.activemq/artemis-junit-commons/2.31.0-SNAPSHOT/artemis-junit-commons-2.31.0-SNAPSHOT.pom
[JENKINS] Archiving <https://ci-builds.apache.org/job/ActiveMQ/job/ActiveMQ-Artemis-JDK11/ws/artemis-junit/artemis-junit-commons/target/artemis-junit-commons-2.31.0-SNAPSHOT.jar> to org.apache.activemq/artemis-junit-commons/2.31.0-SNAPSHOT/artemis-junit-commons-2.31.0-SNAPSHOT.jar
[JENKINS] Archiving <https://ci-builds.apache.org/job/ActiveMQ/job/ActiveMQ-Artemis-JDK11/ws/artemis-junit/artemis-junit-commons/target/artemis-junit-commons-2.31.0-SNAPSHOT-sources.jar> to org.apache.activemq/artemis-junit-commons/2.31.0-SNAPSHOT/artemis-junit-commons-2.31.0-SNAPSHOT-sources.jar
[JENKINS] Archiving <https://ci-builds.apache.org/job/ActiveMQ/job/ActiveMQ-Artemis-JDK11/ws/artemis-cdi-client/pom.xml> to org.apache.activemq/artemis-cdi-client/2.31.0-SNAPSHOT/artemis-cdi-client-2.31.0-SNAPSHOT.pom
[JENKINS] Archiving <https://ci-builds.apache.org/job/ActiveMQ/job/ActiveMQ-Artemis-JDK11/ws/artemis-cdi-client/target/artemis-cdi-client-2.31.0-SNAPSHOT.jar> to org.apache.activemq/artemis-cdi-client/2.31.0-SNAPSHOT/artemis-cdi-client-2.31.0-SNAPSHOT.jar
[JENKINS] Archiving <https://ci-builds.apache.org/job/ActiveMQ/job/ActiveMQ-Artemis-JDK11/ws/artemis-cdi-client/target/artemis-cdi-client-2.31.0-SNAPSHOT-sources.jar> to org.apache.activemq/artemis-cdi-client/2.31.0-SNAPSHOT/artemis-cdi-client-2.31.0-SNAPSHOT-sources.jar
[JENKINS] Archiving <https://ci-builds.apache.org/job/ActiveMQ/job/ActiveMQ-Artemis-JDK11/ws/tests/jms-tests/pom.xml> to org.apache.activemq.tests/jms-tests/2.31.0-SNAPSHOT/jms-tests-2.31.0-SNAPSHOT.pom
[JENKINS] Archiving <https://ci-builds.apache.org/job/ActiveMQ/job/ActiveMQ-Artemis-JDK11/ws/artemis-ra/pom.xml> to org.apache.activemq/artemis-ra/2.31.0-SNAPSHOT/artemis-ra-2.31.0-SNAPSHOT.pom
[JENKINS] Archiving <https://ci-builds.apache.org/job/ActiveMQ/job/ActiveMQ-Artemis-JDK11/ws/pom.xml> to org.apache.activemq/artemis-pom/2.31.0-SNAPSHOT/artemis-pom-2.31.0-SNAPSHOT.pom
[JENKINS] Archiving <https://ci-builds.apache.org/job/ActiveMQ/job/ActiveMQ-Artemis-JDK11/ws/tests/karaf-client-integration-tests/pom.xml> to org.apache.activemq.tests/karaf-client-integration-tests/2.31.0-SNAPSHOT/karaf-client-integration-tests-2.31.0-SNAPSHOT.pom
[JENKINS] Archiving <https://ci-builds.apache.org/job/ActiveMQ/job/ActiveMQ-Artemis-JDK11/ws/artemis-maven-plugin/pom.xml> to org.apache.activemq/artemis-maven-plugin/2.31.0-SNAPSHOT/artemis-maven-plugin-2.31.0-SNAPSHOT.pom
[JENKINS] Archiving <https://ci-builds.apache.org/job/ActiveMQ/job/ActiveMQ-Artemis-JDK11/ws/artemis-junit/artemis-junit-4/pom.xml> to org.apache.activemq/artemis-junit/2.31.0-SNAPSHOT/artemis-junit-2.31.0-SNAPSHOT.pom
[JENKINS] Archiving <https://ci-builds.apache.org/job/ActiveMQ/job/ActiveMQ-Artemis-JDK11/ws/artemis-junit/artemis-junit-4/target/artemis-junit-2.31.0-SNAPSHOT.jar> to org.apache.activemq/artemis-junit/2.31.0-SNAPSHOT/artemis-junit-2.31.0-SNAPSHOT.jar
[JENKINS] Archiving <https://ci-builds.apache.org/job/ActiveMQ/job/ActiveMQ-Artemis-JDK11/ws/artemis-junit/artemis-junit-4/target/artemis-junit-2.31.0-SNAPSHOT-sources.jar> to org.apache.activemq/artemis-junit/2.31.0-SNAPSHOT/artemis-junit-2.31.0-SNAPSHOT-sources.jar
[JENKINS] Archiving <https://ci-builds.apache.org/job/ActiveMQ/job/ActiveMQ-Artemis-JDK11/ws/artemis-service-extensions/pom.xml> to org.apache.activemq/artemis-service-extensions/2.31.0-SNAPSHOT/artemis-service-extensions-2.31.0-SNAPSHOT.pom
[JENKINS] Archiving <https://ci-builds.apache.org/job/ActiveMQ/job/ActiveMQ-Artemis-JDK11/ws/artemis-service-extensions/target/artemis-service-extensions-2.31.0-SNAPSHOT.jar> to org.apache.activemq/artemis-service-extensions/2.31.0-SNAPSHOT/artemis-service-extensions-2.31.0-SNAPSHOT.jar
[JENKINS] Archiving <https://ci-builds.apache.org/job/ActiveMQ/job/ActiveMQ-Artemis-JDK11/ws/artemis-service-extensions/target/artemis-service-extensions-2.31.0-SNAPSHOT-sources.jar> to org.apache.activemq/artemis-service-extensions/2.31.0-SNAPSHOT/artemis-service-extensions-2.31.0-SNAPSHOT-sources.jar
[JENKINS] Archiving <https://ci-builds.apache.org/job/ActiveMQ/job/ActiveMQ-Artemis-JDK11/ws/artemis-server-osgi/pom.xml> to org.apache.activemq/artemis-server-osgi/2.31.0-SNAPSHOT/artemis-server-osgi-2.31.0-SNAPSHOT.pom
[JENKINS] Archiving <https://ci-builds.apache.org/job/ActiveMQ/job/ActiveMQ-Artemis-JDK11/ws/artemis-junit/pom.xml> to org.apache.activemq/artemis-junit-parent/2.31.0-SNAPSHOT/artemis-junit-parent-2.31.0-SNAPSHOT.pom
[JENKINS] Archiving <https://ci-builds.apache.org/job/ActiveMQ/job/ActiveMQ-Artemis-JDK11/ws/tests/unit-tests/pom.xml> to org.apache.activemq.tests/unit-tests/2.31.0-SNAPSHOT/unit-tests-2.31.0-SNAPSHOT.pom
[JENKINS] Archiving <https://ci-builds.apache.org/job/ActiveMQ/job/ActiveMQ-Artemis-JDK11/ws/tests/leak-tests/pom.xml> to org.apache.activemq.tests/leak-tests/2.31.0-SNAPSHOT/leak-tests-2.31.0-SNAPSHOT.pom
[JENKINS] Archiving <https://ci-builds.apache.org/job/ActiveMQ/job/ActiveMQ-Artemis-JDK11/ws/artemis-protocols/artemis-stomp-protocol/pom.xml> to org.apache.activemq/artemis-stomp-protocol/2.31.0-SNAPSHOT/artemis-stomp-protocol-2.31.0-SNAPSHOT.pom
[JENKINS] Archiving <https://ci-builds.apache.org/job/ActiveMQ/job/ActiveMQ-Artemis-JDK11/ws/artemis-protocols/artemis-stomp-protocol/target/artemis-stomp-protocol-2.31.0-SNAPSHOT.jar> to org.apache.activemq/artemis-stomp-protocol/2.31.0-SNAPSHOT/artemis-stomp-protocol-2.31.0-SNAPSHOT.jar
[JENKINS] Archiving <https://ci-builds.apache.org/job/ActiveMQ/job/ActiveMQ-Artemis-JDK11/ws/artemis-protocols/artemis-stomp-protocol/target/artemis-stomp-protocol-2.31.0-SNAPSHOT-sources.jar> to org.apache.activemq/artemis-stomp-protocol/2.31.0-SNAPSHOT/artemis-stomp-protocol-2.31.0-SNAPSHOT-sources.jar
[JENKINS] Archiving <https://ci-builds.apache.org/job/ActiveMQ/job/ActiveMQ-Artemis-JDK11/ws/artemis-protocols/artemis-hornetq-protocol/pom.xml> to org.apache.activemq/artemis-hornetq-protocol/2.31.0-SNAPSHOT/artemis-hornetq-protocol-2.31.0-SNAPSHOT.pom
[JENKINS] Archiving <https://ci-builds.apache.org/job/ActiveMQ/job/ActiveMQ-Artemis-JDK11/ws/artemis-protocols/artemis-hornetq-protocol/target/artemis-hornetq-protocol-2.31.0-SNAPSHOT.jar> to org.apache.activemq/artemis-hornetq-protocol/2.31.0-SNAPSHOT/artemis-hornetq-protocol-2.31.0-SNAPSHOT.jar
[JENKINS] Archiving <https://ci-builds.apache.org/job/ActiveMQ/job/ActiveMQ-Artemis-JDK11/ws/artemis-protocols/artemis-hornetq-protocol/target/artemis-hornetq-protocol-2.31.0-SNAPSHOT-sources.jar> to org.apache.activemq/artemis-hornetq-protocol/2.31.0-SNAPSHOT/artemis-hornetq-protocol-2.31.0-SNAPSHOT-sources.jar
[JENKINS] Archiving <https://ci-builds.apache.org/job/ActiveMQ/job/ActiveMQ-Artemis-JDK11/ws/artemis-core-client-osgi/pom.xml> to org.apache.activemq/artemis-core-client-osgi/2.31.0-SNAPSHOT/artemis-core-client-osgi-2.31.0-SNAPSHOT.pom
[JENKINS] Archiving <https://ci-builds.apache.org/job/ActiveMQ/job/ActiveMQ-Artemis-JDK11/ws/tests/performance-tests/pom.xml> to org.apache.activemq.tests/performance-tests/2.31.0-SNAPSHOT/performance-tests-2.31.0-SNAPSHOT.pom
[JENKINS] Archiving <https://ci-builds.apache.org/job/ActiveMQ/job/ActiveMQ-Artemis-JDK11/ws/artemis-features/pom.xml> to org.apache.activemq/artemis-features/2.31.0-SNAPSHOT/artemis-features-2.31.0-SNAPSHOT.pom
[JENKINS] Archiving <https://ci-builds.apache.org/job/ActiveMQ/job/ActiveMQ-Artemis-JDK11/ws/artemis-commons/dependency-reduced-pom.xml> to org.apache.activemq/artemis-commons/2.31.0-SNAPSHOT/artemis-commons-2.31.0-SNAPSHOT.pom
[JENKINS] Archiving <https://ci-builds.apache.org/job/ActiveMQ/job/ActiveMQ-Artemis-JDK11/ws/artemis-commons/target/artemis-commons-2.31.0-SNAPSHOT.jar> to org.apache.activemq/artemis-commons/2.31.0-SNAPSHOT/artemis-commons-2.31.0-SNAPSHOT.jar
[JENKINS] Archiving <https://ci-builds.apache.org/job/ActiveMQ/job/ActiveMQ-Artemis-JDK11/ws/artemis-commons/target/artemis-commons-2.31.0-SNAPSHOT-sources.jar> to org.apache.activemq/artemis-commons/2.31.0-SNAPSHOT/artemis-commons-2.31.0-SNAPSHOT-sources.jar
[JENKINS] Archiving <https://ci-builds.apache.org/job/ActiveMQ/job/ActiveMQ-Artemis-JDK11/ws/artemis-journal/pom.xml> to org.apache.activemq/artemis-journal/2.31.0-SNAPSHOT/artemis-journal-2.31.0-SNAPSHOT.pom
[JENKINS] Archiving <https://ci-builds.apache.org/job/ActiveMQ/job/ActiveMQ-Artemis-JDK11/ws/artemis-journal/target/artemis-journal-2.31.0-SNAPSHOT.jar> to org.apache.activemq/artemis-journal/2.31.0-SNAPSHOT/artemis-journal-2.31.0-SNAPSHOT.jar
[JENKINS] Archiving <https://ci-builds.apache.org/job/ActiveMQ/job/ActiveMQ-Artemis-JDK11/ws/artemis-journal/target/artemis-journal-2.31.0-SNAPSHOT-sources.jar> to org.apache.activemq/artemis-journal/2.31.0-SNAPSHOT/artemis-journal-2.31.0-SNAPSHOT-sources.jar
[JENKINS] Archiving <https://ci-builds.apache.org/job/ActiveMQ/job/ActiveMQ-Artemis-JDK11/ws/tests/soak-tests/pom.xml> to org.apache.activemq.tests/soak-tests/2.31.0-SNAPSHOT/soak-tests-2.31.0-SNAPSHOT.pom
[JENKINS] Archiving <https://ci-builds.apache.org/job/ActiveMQ/job/ActiveMQ-Artemis-JDK11/ws/artemis-core-client/pom.xml> to org.apache.activemq/artemis-core-client/2.31.0-SNAPSHOT/artemis-core-client-2.31.0-SNAPSHOT.pom
[JENKINS] Archiving <https://ci-builds.apache.org/job/ActiveMQ/job/ActiveMQ-Artemis-JDK11/ws/artemis-core-client/target/artemis-core-client-2.31.0-SNAPSHOT.jar> to org.apache.activemq/artemis-core-client/2.31.0-SNAPSHOT/artemis-core-client-2.31.0-SNAPSHOT.jar
[JENKINS] Archiving <https://ci-builds.apache.org/job/ActiveMQ/job/ActiveMQ-Artemis-JDK11/ws/artemis-core-client/target/artemis-core-client-2.31.0-SNAPSHOT-sources.jar> to org.apache.activemq/artemis-core-client/2.31.0-SNAPSHOT/artemis-core-client-2.31.0-SNAPSHOT-sources.jar
[JENKINS] Archiving <https://ci-builds.apache.org/job/ActiveMQ/job/ActiveMQ-Artemis-JDK11/ws/tests/integration-tests-isolated/pom.xml> to org.apache.activemq.tests/integration-tests-isolated/2.31.0-SNAPSHOT/integration-tests-isolated-2.31.0-SNAPSHOT.pom
[JENKINS] Archiving <https://ci-builds.apache.org/job/ActiveMQ/job/ActiveMQ-Artemis-JDK11/ws/artemis-jakarta-ra/pom.xml> to org.apache.activemq/artemis-jakarta-ra/2.31.0-SNAPSHOT/artemis-jakarta-ra-2.31.0-SNAPSHOT.pom
[JENKINS] Archiving <https://ci-builds.apache.org/job/ActiveMQ/job/ActiveMQ-Artemis-JDK11/ws/tests/timing-tests/pom.xml> to org.apache.activemq.tests/timing-tests/2.31.0-SNAPSHOT/timing-tests-2.31.0-SNAPSHOT.pom
[JENKINS] Archiving <https://ci-builds.apache.org/job/ActiveMQ/job/ActiveMQ-Artemis-JDK11/ws/artemis-junit/artemis-junit-5/pom.xml> to org.apache.activemq/artemis-junit-5/2.31.0-SNAPSHOT/artemis-junit-5-2.31.0-SNAPSHOT.pom
[JENKINS] Archiving <https://ci-builds.apache.org/job/ActiveMQ/job/ActiveMQ-Artemis-JDK11/ws/artemis-jms-client-all/pom.xml> to org.apache.activemq/artemis-jms-client-all/2.31.0-SNAPSHOT/artemis-jms-client-all-2.31.0-SNAPSHOT.pom
[JENKINS] Archiving <https://ci-builds.apache.org/job/ActiveMQ/job/ActiveMQ-Artemis-JDK11/ws/artemis-protocols/pom.xml> to org.apache.activemq/artemis-protocols/2.31.0-SNAPSHOT/artemis-protocols-2.31.0-SNAPSHOT.pom
[JENKINS] Archiving <https://ci-builds.apache.org/job/ActiveMQ/job/ActiveMQ-Artemis-JDK11/ws/tests/karaf-server-integration-tests/pom.xml> to org.apache.activemq.tests/karaf-server-integration-tests/2.31.0-SNAPSHOT/karaf-server-integration-tests-2.31.0-SNAPSHOT.pom
[JENKINS] Archiving <https://ci-builds.apache.org/job/ActiveMQ/job/ActiveMQ-Artemis-JDK11/ws/artemis-hawtio/artemis-plugin/pom.xml> to org.apache.activemq/artemis-plugin/2.31.0-SNAPSHOT/artemis-plugin-2.31.0-SNAPSHOT.pom
[JENKINS] Archiving <https://ci-builds.apache.org/job/ActiveMQ/job/ActiveMQ-Artemis-JDK11/ws/artemis-quorum-api/pom.xml> to org.apache.activemq/artemis-quorum-api/2.31.0-SNAPSHOT/artemis-quorum-api-2.31.0-SNAPSHOT.pom
[JENKINS] Archiving <https://ci-builds.apache.org/job/ActiveMQ/job/ActiveMQ-Artemis-JDK11/ws/artemis-quorum-api/target/artemis-quorum-api-2.31.0-SNAPSHOT.jar> to org.apache.activemq/artemis-quorum-api/2.31.0-SNAPSHOT/artemis-quorum-api-2.31.0-SNAPSHOT.jar
[JENKINS] Archiving <https://ci-builds.apache.org/job/ActiveMQ/job/ActiveMQ-Artemis-JDK11/ws/artemis-quorum-api/target/artemis-quorum-api-2.31.0-SNAPSHOT-sources.jar> to org.apache.activemq/artemis-quorum-api/2.31.0-SNAPSHOT/artemis-quorum-api-2.31.0-SNAPSHOT-sources.jar
[JENKINS] Archiving <https://ci-builds.apache.org/job/ActiveMQ/job/ActiveMQ-Artemis-JDK11/ws/artemis-dto/pom.xml> to org.apache.activemq/artemis-dto/2.31.0-SNAPSHOT/artemis-dto-2.31.0-SNAPSHOT.pom
[JENKINS] Archiving <https://ci-builds.apache.org/job/ActiveMQ/job/ActiveMQ-Artemis-JDK11/ws/artemis-dto/target/artemis-dto-2.31.0-SNAPSHOT.jar> to org.apache.activemq/artemis-dto/2.31.0-SNAPSHOT/artemis-dto-2.31.0-SNAPSHOT.jar
[JENKINS] Archiving <https://ci-builds.apache.org/job/ActiveMQ/job/ActiveMQ-Artemis-JDK11/ws/artemis-dto/target/artemis-dto-2.31.0-SNAPSHOT-sources.jar> to org.apache.activemq/artemis-dto/2.31.0-SNAPSHOT/artemis-dto-2.31.0-SNAPSHOT-sources.jar
[JENKINS] Archiving <https://ci-builds.apache.org/job/ActiveMQ/job/ActiveMQ-Artemis-JDK11/ws/artemis-unit-test-support/pom.xml> to org.apache.activemq/artemis-unit-test-support/2.31.0-SNAPSHOT/artemis-unit-test-support-2.31.0-SNAPSHOT.pom
[JENKINS] Archiving <https://ci-builds.apache.org/job/ActiveMQ/job/ActiveMQ-Artemis-JDK11/ws/artemis-unit-test-support/target/artemis-unit-test-support-2.31.0-SNAPSHOT.jar> to org.apache.activemq/artemis-unit-test-support/2.31.0-SNAPSHOT/artemis-unit-test-support-2.31.0-SNAPSHOT.jar
[JENKINS] Archiving <https://ci-builds.apache.org/job/ActiveMQ/job/ActiveMQ-Artemis-JDK11/ws/artemis-unit-test-support/target/artemis-unit-test-support-2.31.0-SNAPSHOT-sources.jar> to org.apache.activemq/artemis-unit-test-support/2.31.0-SNAPSHOT/artemis-unit-test-support-2.31.0-SNAPSHOT-sources.jar
[JENKINS] Archiving <https://ci-builds.apache.org/job/ActiveMQ/job/ActiveMQ-Artemis-JDK11/ws/artemis-jakarta-service-extensions/pom.xml> to org.apache.activemq/artemis-jakarta-service-extensions/2.31.0-SNAPSHOT/artemis-jakarta-service-extensions-2.31.0-SNAPSHOT.pom
[JENKINS] Archiving <https://ci-builds.apache.org/job/ActiveMQ/job/ActiveMQ-Artemis-JDK11/ws/artemis-protocols/artemis-hqclient-protocol/pom.xml> to org.apache.activemq/artemis-hqclient-protocol/2.31.0-SNAPSHOT/artemis-hqclient-protocol-2.31.0-SNAPSHOT.pom
[JENKINS] Archiving <https://ci-builds.apache.org/job/ActiveMQ/job/ActiveMQ-Artemis-JDK11/ws/artemis-protocols/artemis-hqclient-protocol/target/artemis-hqclient-protocol-2.31.0-SNAPSHOT.jar> to org.apache.activemq/artemis-hqclient-protocol/2.31.0-SNAPSHOT/artemis-hqclient-protocol-2.31.0-SNAPSHOT.jar
[JENKINS] Archiving <https://ci-builds.apache.org/job/ActiveMQ/job/ActiveMQ-Artemis-JDK11/ws/artemis-protocols/artemis-hqclient-protocol/target/artemis-hqclient-protocol-2.31.0-SNAPSHOT-sources.jar> to org.apache.activemq/artemis-hqclient-protocol/2.31.0-SNAPSHOT/artemis-hqclient-protocol-2.31.0-SNAPSHOT-sources.jar
[JENKINS] Archiving <https://ci-builds.apache.org/job/ActiveMQ/job/ActiveMQ-Artemis-JDK11/ws/artemis-jms-client-osgi/pom.xml> to org.apache.activemq/artemis-jms-client-osgi/2.31.0-SNAPSHOT/artemis-jms-client-osgi-2.31.0-SNAPSHOT.pom
[JENKINS] Archiving <https://ci-builds.apache.org/job/ActiveMQ/job/ActiveMQ-Artemis-JDK11/ws/tests/integration-tests/pom.xml> to org.apache.activemq.tests/integration-tests/2.31.0-SNAPSHOT/integration-tests-2.31.0-SNAPSHOT.pom
[JENKINS] Archiving <https://ci-builds.apache.org/job/ActiveMQ/job/ActiveMQ-Artemis-JDK11/ws/artemis-boot/pom.xml> to org.apache.activemq/artemis-boot/2.31.0-SNAPSHOT/artemis-boot-2.31.0-SNAPSHOT.pom
[JENKINS] Archiving <https://ci-builds.apache.org/job/ActiveMQ/job/ActiveMQ-Artemis-JDK11/ws/artemis-boot/target/artemis-boot-2.31.0-SNAPSHOT.jar> to org.apache.activemq/artemis-boot/2.31.0-SNAPSHOT/artemis-boot-2.31.0-SNAPSHOT.jar
[JENKINS] Archiving <https://ci-builds.apache.org/job/ActiveMQ/job/ActiveMQ-Artemis-JDK11/ws/artemis-boot/target/artemis-boot-2.31.0-SNAPSHOT-sources.jar> to org.apache.activemq/artemis-boot/2.31.0-SNAPSHOT/artemis-boot-2.31.0-SNAPSHOT-sources.jar
[JENKINS] Archiving <https://ci-builds.apache.org/job/ActiveMQ/job/ActiveMQ-Artemis-JDK11/ws/artemis-jakarta-client/pom.xml> to org.apache.activemq/artemis-jakarta-client/2.31.0-SNAPSHOT/artemis-jakarta-client-2.31.0-SNAPSHOT.pom
[JENKINS] Archiving <https://ci-builds.apache.org/job/ActiveMQ/job/ActiveMQ-Artemis-JDK11/ws/artemis-protocols/artemis-amqp-protocol/pom.xml> to org.apache.activemq/artemis-amqp-protocol/2.31.0-SNAPSHOT/artemis-amqp-protocol-2.31.0-SNAPSHOT.pom
[JENKINS] Archiving <https://ci-builds.apache.org/job/ActiveMQ/job/ActiveMQ-Artemis-JDK11/ws/artemis-protocols/artemis-amqp-protocol/target/artemis-amqp-protocol-2.31.0-SNAPSHOT.jar> to org.apache.activemq/artemis-amqp-protocol/2.31.0-SNAPSHOT/artemis-amqp-protocol-2.31.0-SNAPSHOT.jar
[JENKINS] Archiving <https://ci-builds.apache.org/job/ActiveMQ/job/ActiveMQ-Artemis-JDK11/ws/artemis-protocols/artemis-amqp-protocol/target/artemis-amqp-protocol-2.31.0-SNAPSHOT-sources.jar> to org.apache.activemq/artemis-amqp-protocol/2.31.0-SNAPSHOT/artemis-amqp-protocol-2.31.0-SNAPSHOT-sources.jar
[JENKINS] Archiving <https://ci-builds.apache.org/job/ActiveMQ/job/ActiveMQ-Artemis-JDK11/ws/artemis-jakarta-server/pom.xml> to org.apache.activemq/artemis-jakarta-server/2.31.0-SNAPSHOT/artemis-jakarta-server-2.31.0-SNAPSHOT.pom
[JENKINS] Archiving <https://ci-builds.apache.org/job/ActiveMQ/job/ActiveMQ-Artemis-JDK11/ws/artemis-protocols/artemis-mqtt-protocol/pom.xml> to org.apache.activemq/artemis-mqtt-protocol/2.31.0-SNAPSHOT/artemis-mqtt-protocol-2.31.0-SNAPSHOT.pom
[JENKINS] Archiving <https://ci-builds.apache.org/job/ActiveMQ/job/ActiveMQ-Artemis-JDK11/ws/artemis-protocols/artemis-mqtt-protocol/target/artemis-mqtt-protocol-2.31.0-SNAPSHOT.jar> to org.apache.activemq/artemis-mqtt-protocol/2.31.0-SNAPSHOT/artemis-mqtt-protocol-2.31.0-SNAPSHOT.jar
[JENKINS] Archiving <https://ci-builds.apache.org/job/ActiveMQ/job/ActiveMQ-Artemis-JDK11/ws/artemis-protocols/artemis-mqtt-protocol/target/artemis-mqtt-protocol-2.31.0-SNAPSHOT-sources.jar> to org.apache.activemq/artemis-mqtt-protocol/2.31.0-SNAPSHOT/artemis-mqtt-protocol-2.31.0-SNAPSHOT-sources.jar
[JENKINS] Archiving <https://ci-builds.apache.org/job/ActiveMQ/job/ActiveMQ-Artemis-JDK11/ws/tests/e2e-tests/pom.xml> to org.apache.activemq.tests/e2e-tests/2.31.0-SNAPSHOT/e2e-tests-2.31.0-SNAPSHOT.pom
[JENKINS] Archiving <https://ci-builds.apache.org/job/ActiveMQ/job/ActiveMQ-Artemis-JDK11/ws/artemis-hawtio/pom.xml> to org.apache.activemq/artemis-hawtio-pom/2.31.0-SNAPSHOT/artemis-hawtio-pom-2.31.0-SNAPSHOT.pom
[JENKINS] Archiving <https://ci-builds.apache.org/job/ActiveMQ/job/ActiveMQ-Artemis-JDK11/ws/tests/stress-tests/pom.xml> to org.apache.activemq.tests/stress-tests/2.31.0-SNAPSHOT/stress-tests-2.31.0-SNAPSHOT.pom
channel stopped

Build failed in Jenkins: ActiveMQ » ActiveMQ-Artemis-JDK11 #1514

Posted by Apache Jenkins Server <je...@builds.apache.org>.
See <https://ci-builds.apache.org/job/ActiveMQ/job/ActiveMQ-Artemis-JDK11/1514/display/redirect?page=changes>

Changes:

[Clebert Suconic] ARTEMIS-4375 Block console if starting server from shell


------------------------------------------
[...truncated 1.96 MB...]
[ERROR] org.apache.activemq.cli.test.MessageSerializerTest.testAnycastToMulticastTopic(org.apache.activemq.cli.test.MessageSerializerTest)
[ERROR]   Run 1: MessageSerializerTest.setup:70->CliTestBase.startServer:95 » CLI Error: There ...
[ERROR]   Run 2: MessageSerializerTest.tearDown:78->CliTestBase.closeConnection:135->CliTestBase.stopServer:107 » Configuration
[INFO] 
[ERROR] org.apache.activemq.cli.test.MessageSerializerTest.testLargeMessageExport(org.apache.activemq.cli.test.MessageSerializerTest)
[ERROR]   Run 1: MessageSerializerTest.setup:70->CliTestBase.startServer:95 » CLI Error: There ...
[ERROR]   Run 2: MessageSerializerTest.tearDown:78->CliTestBase.closeConnection:135->CliTestBase.stopServer:107 » Configuration
[INFO] 
[ERROR] org.apache.activemq.cli.test.MessageSerializerTest.testMapMessageImportExport(org.apache.activemq.cli.test.MessageSerializerTest)
[ERROR]   Run 1: MessageSerializerTest.setup:70->CliTestBase.startServer:95 » CLI Error: There ...
[ERROR]   Run 2: MessageSerializerTest.tearDown:78->CliTestBase.closeConnection:135->CliTestBase.stopServer:107 » Configuration
[INFO] 
[ERROR] org.apache.activemq.cli.test.MessageSerializerTest.testMulticastTopicToAnycastQueueBothAddress(org.apache.activemq.cli.test.MessageSerializerTest)
[ERROR]   Run 1: MessageSerializerTest.setup:70->CliTestBase.startServer:95 » CLI Error: There ...
[ERROR]   Run 2: MessageSerializerTest.tearDown:78->CliTestBase.closeConnection:135->CliTestBase.stopServer:107 » Configuration
[INFO] 
[ERROR] org.apache.activemq.cli.test.MessageSerializerTest.testObjectMessageImportExport(org.apache.activemq.cli.test.MessageSerializerTest)
[ERROR]   Run 1: MessageSerializerTest.setup:70->CliTestBase.startServer:95 » CLI Error: There ...
[ERROR]   Run 2: MessageSerializerTest.tearDown:78->CliTestBase.closeConnection:135->CliTestBase.stopServer:107 » Configuration
[INFO] 
[ERROR] org.apache.activemq.cli.test.MessageSerializerTest.testSendDirectToAnycastQueue(org.apache.activemq.cli.test.MessageSerializerTest)
[ERROR]   Run 1: MessageSerializerTest.setup:70->CliTestBase.startServer:95 » CLI Error: There ...
[ERROR]   Run 2: MessageSerializerTest.tearDown:78->CliTestBase.closeConnection:135->CliTestBase.stopServer:107 » Configuration
[INFO] 
[ERROR] org.apache.activemq.cli.test.MessageSerializerTest.testSendDirectToMulticastQueue(org.apache.activemq.cli.test.MessageSerializerTest)
[ERROR]   Run 1: MessageSerializerTest.setup:70->CliTestBase.startServer:95 » CLI Error: There ...
[ERROR]   Run 2: MessageSerializerTest.tearDown:78->CliTestBase.closeConnection:135->CliTestBase.stopServer:107 » Configuration
[INFO] 
[ERROR] org.apache.activemq.cli.test.MessageSerializerTest.testTextMessageImportExport(org.apache.activemq.cli.test.MessageSerializerTest)
[ERROR]   Run 1: MessageSerializerTest.setup:70->CliTestBase.startServer:95 » CLI Error: There ...
[ERROR]   Run 2: MessageSerializerTest.tearDown:78->CliTestBase.closeConnection:135->CliTestBase.stopServer:107 » Configuration
[INFO] 
[ERROR]   RetryCLIClientIDTest.testWrongUserAndPass:54->CliTestBase.stopServer:107 » Configuration
[ERROR] org.apache.activemq.cli.test.TransferTest.testTransferMessagesWithMessageCount(org.apache.activemq.cli.test.TransferTest)
[ERROR]   Run 1: TransferTest.setup:47->CliTestBase.startServer:95 » CLI Error: There is anothe...
[ERROR]   Run 2: TransferTest.tearDown:55->CliTestBase.closeConnection:135->CliTestBase.stopServer:107 » Configuration
[INFO] 
[INFO] 
[ERROR] Tests run: 108, Failures: 2, Errors: 19, Skipped: 0
[INFO] 
[JENKINS] Recording test results
[INFO] ------------------------------------------------------------------------
[INFO] Reactor Summary for ActiveMQ Artemis Parent 2.31.0-SNAPSHOT:
[INFO] 
[INFO] ActiveMQ Artemis Parent ............................ SUCCESS [ 11.063 s]
[INFO] ActiveMQ Artemis Unit Test Support ................. SUCCESS [ 10.783 s]
[INFO] ActiveMQ Log Annotation Processor .................. SUCCESS [ 25.680 s]
[INFO] ActiveMQ Artemis Commons ........................... SUCCESS [ 29.098 s]
[INFO] ActiveMQ Artemis Selector Implementation ........... SUCCESS [  8.894 s]
[INFO] ActiveMQ Artemis Core Client ....................... SUCCESS [ 26.180 s]
[INFO] ActiveMQ Artemis Journal ........................... SUCCESS [ 10.229 s]
[INFO] ActiveMQ Artemis JDBC Store ........................ SUCCESS [ 17.553 s]
[INFO] ActiveMQ Artemis Quorum API ........................ SUCCESS [  5.632 s]
[INFO] ActiveMQ Artemis Server ............................ SUCCESS [02:05 min]
[INFO] ActiveMQ Artemis Protocols ......................... SUCCESS [  2.741 s]
[INFO] ActiveMQ Artemis AMQP Protocol ..................... SUCCESS [ 19.732 s]
[INFO] ActiveMQ Artemis STOMP Protocol .................... SUCCESS [  6.074 s]
[INFO] ActiveMQ Artemis JMS Client ........................ SUCCESS [  8.220 s]
[INFO] ActiveMQ Artemis OpenWire Protocol ................. SUCCESS [ 17.143 s]
[INFO] ActiveMQ Artemis HQClient Protocol ................. SUCCESS [  6.336 s]
[INFO] ActiveMQ Artemis HornetQ Protocol .................. SUCCESS [  8.164 s]
[INFO] ActiveMQ Artemis MQTT Protocol ..................... SUCCESS [  6.132 s]
[INFO] ActiveMQ Artemis DTO ............................... SUCCESS [  6.917 s]
[INFO] ActiveMQ Artemis CDI Integration ................... SUCCESS [  9.149 s]
[INFO] ActiveMQ Artemis Boot .............................. SUCCESS [  4.922 s]
[INFO] ActiveMQ Artemis Service Extensions ................ SUCCESS [  7.044 s]
[INFO] ActiveMQ Artemis JMS Server ........................ SUCCESS [  5.628 s]
[INFO] ActiveMQ Artemis JUnit ............................. SUCCESS [  3.189 s]
[INFO] ActiveMQ Artemis JUnit Commons ..................... SUCCESS [  5.239 s]
[INFO] ActiveMQ Artemis JUnit 4 Rules ..................... SUCCESS [ 10.782 s]
[INFO] ActiveMQ Artemis CLI ............................... FAILURE [02:36 min]
[INFO] ActiveMQ Artemis Web ............................... SKIPPED
[INFO] ActiveMQ Artemis Core Client All ................... SKIPPED
[INFO] ActiveMQ Artemis Client OSGi ....................... SKIPPED
[INFO] ActiveMQ Artemis JUnit 5 Extensions ................ SKIPPED
[INFO] ActiveMQ Artemis JMS Client All .................... SKIPPED
[INFO] ActiveMQ Artemis JMS Client OSGi ................... SKIPPED
[INFO] ActiveMQ Artemis Jakarta Messaging Client .......... SKIPPED
[INFO] ActiveMQ Artemis Jakarta Messaging Client All ...... SKIPPED
[INFO] ActiveMQ Artemis Jakarta Service Extensions ........ SKIPPED
[INFO] ActiveMQ Artemis Jakarta Messaging Server .......... SKIPPED
[INFO] ActiveMQ Artemis RAR POM ........................... SKIPPED
[INFO] ActiveMQ Artemis Jakarta RAR ....................... SKIPPED
[INFO] ActiveMQ Artemis Maven Plugin ...................... SKIPPED
[INFO] ActiveMQ Artemis Server OSGi ....................... SKIPPED
[INFO] ActiveMQ Artemis Cons .............................. SKIPPED
[INFO] ActiveMQ Artemis HawtIO Branding ................... SKIPPED
[INFO] ActiveMQ Artemis HawtIO Plugin ..................... SKIPPED
[INFO] ActiveMQ Artemis Console ........................... SKIPPED
[INFO] ActiveMQ Artemis Spring Integration ................ SKIPPED
[INFO] ActiveMQ Artemis Quorum RI ......................... SKIPPED
[INFO] Apache ActiveMQ Artemis Distribution ............... SKIPPED
[INFO] ActiveMQ Artemis Tests POM ......................... SKIPPED
[INFO] ActiveMQ Artemis Test Support ...................... SKIPPED
[INFO] ActiveMQ Artemis Unit Tests ........................ SKIPPED
[INFO] ActiveMQ Artemis Joram Tests ....................... SKIPPED
[INFO] ActiveMQ Artemis timing Tests ...................... SKIPPED
[INFO] ActiveMQ Artemis JMS Tests ......................... SKIPPED
[INFO] ActiveMQ Artemis Integration Tests ................. SKIPPED
[INFO] ActiveMQ Artemis Isolated Integration Tests ........ SKIPPED
[INFO] ActiveMQ Artemis Features .......................... SKIPPED
[INFO] ActiveMQ Artemis Karaf Client Integration Tests .... SKIPPED
[INFO] ActiveMQ Artemis Karaf Server Integration Tests .... SKIPPED
[INFO] ActiveMQ Artemis Compatibility Tests ............... SKIPPED
[INFO] ActiveMQ Artemis soak Tests ........................ SKIPPED
[INFO] ActiveMQ Artemis stress Tests ...................... SKIPPED
[INFO] ActiveMQ Artemis performance Tests ................. SKIPPED
[INFO] Smoke Tests ........................................ SKIPPED
[INFO] End-to-End Tests ................................... SKIPPED
[INFO] ActiveMQ Artemis Leak Tests ........................ SKIPPED
[INFO] Apache ActiveMQ Artemis Image ...................... SKIPPED
[INFO] Apache ActiveMQ Artemis Image Examples ............. SKIPPED
[INFO] ------------------------------------------------------------------------
[INFO] BUILD FAILURE
[INFO] ------------------------------------------------------------------------
[INFO] Total time:  11:54 min
[INFO] Finished at: 2023-07-31T15:45:45Z
[INFO] ------------------------------------------------------------------------
Waiting for Jenkins to finish collecting data
[ERROR] Failed to execute goal org.apache.maven.plugins:maven-surefire-plugin:2.22.2:test (default-test) on project artemis-cli: There are test failures.
[ERROR] 
[ERROR] Please refer to <https://ci-builds.apache.org/job/ActiveMQ/job/ActiveMQ-Artemis-JDK11/ws/artemis-cli/target/surefire-reports> for the individual test results.
[JENKINS] Archiving <https://ci-builds.apache.org/job/ActiveMQ/job/ActiveMQ-Artemis-JDK11/ws/artemis-server/pom.xml> to org.apache.activemq/artemis-server/2.31.0-SNAPSHOT/artemis-server-2.31.0-SNAPSHOT.pom
[JENKINS] Archiving <https://ci-builds.apache.org/job/ActiveMQ/job/ActiveMQ-Artemis-JDK11/ws/artemis-server/target/artemis-server-2.31.0-SNAPSHOT.jar> to org.apache.activemq/artemis-server/2.31.0-SNAPSHOT/artemis-server-2.31.0-SNAPSHOT.jar
[JENKINS] Archiving <https://ci-builds.apache.org/job/ActiveMQ/job/ActiveMQ-Artemis-JDK11/ws/artemis-server/target/artemis-server-2.31.0-SNAPSHOT-tests.jar> to org.apache.activemq/artemis-server/2.31.0-SNAPSHOT/artemis-server-2.31.0-SNAPSHOT-tests.jar
[JENKINS] Archiving <https://ci-builds.apache.org/job/ActiveMQ/job/ActiveMQ-Artemis-JDK11/ws/artemis-server/target/artemis-server-2.31.0-SNAPSHOT-sources.jar> to org.apache.activemq/artemis-server/2.31.0-SNAPSHOT/artemis-server-2.31.0-SNAPSHOT-sources.jar
[ERROR] Please refer to dump files (if any exist) [date].dump, [date]-jvmRun[N].dump and [date].dumpstream.
[ERROR] -> [Help 1]
[ERROR] 
[ERROR] To see the full stack trace of the errors, re-run Maven with the -e switch.
[ERROR] Re-run Maven using the -X switch to enable full debug logging.
[ERROR] 
[ERROR] For more information about the errors and possible solutions, please read the following articles:
[ERROR] [Help 1] http://cwiki.apache.org/confluence/display/MAVEN/MojoFailureException
[ERROR] 
[ERROR] After correcting the problems, you can resume the build with the command
[ERROR]   mvn <goals> -rf :artemis-cli
[JENKINS] Archiving <https://ci-builds.apache.org/job/ActiveMQ/job/ActiveMQ-Artemis-JDK11/ws/artemis-image/examples/pom.xml> to org.apache.activemq/artemis-image-examples/2.31.0-SNAPSHOT/artemis-image-examples-2.31.0-SNAPSHOT.pom
[JENKINS] Archiving <https://ci-builds.apache.org/job/ActiveMQ/job/ActiveMQ-Artemis-JDK11/ws/tests/compatibility-tests/pom.xml> to org.apache.activemq.tests/compatibility-tests/2.31.0-SNAPSHOT/compatibility-tests-2.31.0-SNAPSHOT.pom
[JENKINS] Archiving <https://ci-builds.apache.org/job/ActiveMQ/job/ActiveMQ-Artemis-JDK11/ws/artemis-jms-client/pom.xml> to org.apache.activemq/artemis-jms-client/2.31.0-SNAPSHOT/artemis-jms-client-2.31.0-SNAPSHOT.pom
[JENKINS] Archiving <https://ci-builds.apache.org/job/ActiveMQ/job/ActiveMQ-Artemis-JDK11/ws/artemis-jms-client/target/artemis-jms-client-2.31.0-SNAPSHOT.jar> to org.apache.activemq/artemis-jms-client/2.31.0-SNAPSHOT/artemis-jms-client-2.31.0-SNAPSHOT.jar
[JENKINS] Archiving <https://ci-builds.apache.org/job/ActiveMQ/job/ActiveMQ-Artemis-JDK11/ws/artemis-jms-client/target/artemis-jms-client-2.31.0-SNAPSHOT-sources.jar> to org.apache.activemq/artemis-jms-client/2.31.0-SNAPSHOT/artemis-jms-client-2.31.0-SNAPSHOT-sources.jar
[JENKINS] Archiving <https://ci-builds.apache.org/job/ActiveMQ/job/ActiveMQ-Artemis-JDK11/ws/artemis-hawtio/activemq-branding/pom.xml> to org.apache.activemq/activemq-branding/2.31.0-SNAPSHOT/activemq-branding-2.31.0-SNAPSHOT.pom
[JENKINS] Archiving <https://ci-builds.apache.org/job/ActiveMQ/job/ActiveMQ-Artemis-JDK11/ws/tests/smoke-tests/pom.xml> to org.apache.activemq.tests/smoke-tests/2.31.0-SNAPSHOT/smoke-tests-2.31.0-SNAPSHOT.pom
[JENKINS] Archiving <https://ci-builds.apache.org/job/ActiveMQ/job/ActiveMQ-Artemis-JDK11/ws/tests/joram-tests/pom.xml> to org.apache.activemq.tests/joram-tests/2.31.0-SNAPSHOT/joram-tests-2.31.0-SNAPSHOT.pom
[JENKINS] Archiving <https://ci-builds.apache.org/job/ActiveMQ/job/ActiveMQ-Artemis-JDK11/ws/artemis-log-annotation-processor/pom.xml> to org.apache.activemq/artemis-log-annotation-processor/2.31.0-SNAPSHOT/artemis-log-annotation-processor-2.31.0-SNAPSHOT.pom
[JENKINS] Archiving <https://ci-builds.apache.org/job/ActiveMQ/job/ActiveMQ-Artemis-JDK11/ws/artemis-log-annotation-processor/target/artemis-log-annotation-processor-2.31.0-SNAPSHOT.jar> to org.apache.activemq/artemis-log-annotation-processor/2.31.0-SNAPSHOT/artemis-log-annotation-processor-2.31.0-SNAPSHOT.jar
[JENKINS] Archiving <https://ci-builds.apache.org/job/ActiveMQ/job/ActiveMQ-Artemis-JDK11/ws/artemis-log-annotation-processor/target/artemis-log-annotation-processor-2.31.0-SNAPSHOT-sources.jar> to org.apache.activemq/artemis-log-annotation-processor/2.31.0-SNAPSHOT/artemis-log-annotation-processor-2.31.0-SNAPSHOT-sources.jar
[JENKINS] Archiving <https://ci-builds.apache.org/job/ActiveMQ/job/ActiveMQ-Artemis-JDK11/ws/artemis-jms-server/pom.xml> to org.apache.activemq/artemis-jms-server/2.31.0-SNAPSHOT/artemis-jms-server-2.31.0-SNAPSHOT.pom
[JENKINS] Archiving <https://ci-builds.apache.org/job/ActiveMQ/job/ActiveMQ-Artemis-JDK11/ws/artemis-jms-server/target/artemis-jms-server-2.31.0-SNAPSHOT.jar> to org.apache.activemq/artemis-jms-server/2.31.0-SNAPSHOT/artemis-jms-server-2.31.0-SNAPSHOT.jar
[JENKINS] Archiving <https://ci-builds.apache.org/job/ActiveMQ/job/ActiveMQ-Artemis-JDK11/ws/artemis-jms-server/target/artemis-jms-server-2.31.0-SNAPSHOT-sources.jar> to org.apache.activemq/artemis-jms-server/2.31.0-SNAPSHOT/artemis-jms-server-2.31.0-SNAPSHOT-sources.jar
[JENKINS] Archiving <https://ci-builds.apache.org/job/ActiveMQ/job/ActiveMQ-Artemis-JDK11/ws/artemis-cli/pom.xml> to org.apache.activemq/artemis-cli/2.31.0-SNAPSHOT/artemis-cli-2.31.0-SNAPSHOT.pom
[JENKINS] Archiving <https://ci-builds.apache.org/job/ActiveMQ/job/ActiveMQ-Artemis-JDK11/ws/artemis-jakarta-client-all/pom.xml> to org.apache.activemq/artemis-jakarta-client-all/2.31.0-SNAPSHOT/artemis-jakarta-client-all-2.31.0-SNAPSHOT.pom
[JENKINS] Archiving <https://ci-builds.apache.org/job/ActiveMQ/job/ActiveMQ-Artemis-JDK11/ws/artemis-core-client-all/pom.xml> to org.apache.activemq/artemis-core-client-all/2.31.0-SNAPSHOT/artemis-core-client-all-2.31.0-SNAPSHOT.pom
[JENKINS] Archiving <https://ci-builds.apache.org/job/ActiveMQ/job/ActiveMQ-Artemis-JDK11/ws/tests/pom.xml> to org.apache.activemq.tests/artemis-tests-pom/2.31.0-SNAPSHOT/artemis-tests-pom-2.31.0-SNAPSHOT.pom
[JENKINS] Archiving <https://ci-builds.apache.org/job/ActiveMQ/job/ActiveMQ-Artemis-JDK11/ws/artemis-protocols/artemis-openwire-protocol/pom.xml> to org.apache.activemq/artemis-openwire-protocol/2.31.0-SNAPSHOT/artemis-openwire-protocol-2.31.0-SNAPSHOT.pom
[JENKINS] Archiving <https://ci-builds.apache.org/job/ActiveMQ/job/ActiveMQ-Artemis-JDK11/ws/artemis-protocols/artemis-openwire-protocol/target/artemis-openwire-protocol-2.31.0-SNAPSHOT.jar> to org.apache.activemq/artemis-openwire-protocol/2.31.0-SNAPSHOT/artemis-openwire-protocol-2.31.0-SNAPSHOT.jar
[JENKINS] Archiving <https://ci-builds.apache.org/job/ActiveMQ/job/ActiveMQ-Artemis-JDK11/ws/artemis-protocols/artemis-openwire-protocol/target/artemis-openwire-protocol-2.31.0-SNAPSHOT-sources.jar> to org.apache.activemq/artemis-openwire-protocol/2.31.0-SNAPSHOT/artemis-openwire-protocol-2.31.0-SNAPSHOT-sources.jar
[JENKINS] Archiving <https://ci-builds.apache.org/job/ActiveMQ/job/ActiveMQ-Artemis-JDK11/ws/artemis-image/pom.xml> to org.apache.activemq/artemis-image/2.31.0-SNAPSHOT/artemis-image-2.31.0-SNAPSHOT.pom
[JENKINS] Archiving <https://ci-builds.apache.org/job/ActiveMQ/job/ActiveMQ-Artemis-JDK11/ws/artemis-distribution/pom.xml> to org.apache.activemq/apache-artemis/2.31.0-SNAPSHOT/apache-artemis-2.31.0-SNAPSHOT.pom
[JENKINS] Archiving <https://ci-builds.apache.org/job/ActiveMQ/job/ActiveMQ-Artemis-JDK11/ws/artemis-hawtio/artemis-console/pom.xml> to org.apache.activemq/artemis-console/2.31.0-SNAPSHOT/artemis-console-2.31.0-SNAPSHOT.pom
[JENKINS] Archiving <https://ci-builds.apache.org/job/ActiveMQ/job/ActiveMQ-Artemis-JDK11/ws/tests/artemis-test-support/pom.xml> to org.apache.activemq.tests/artemis-test-support/2.31.0-SNAPSHOT/artemis-test-support-2.31.0-SNAPSHOT.pom
[JENKINS] Archiving <https://ci-builds.apache.org/job/ActiveMQ/job/ActiveMQ-Artemis-JDK11/ws/artemis-selector/pom.xml> to org.apache.activemq/artemis-selector/2.31.0-SNAPSHOT/artemis-selector-2.31.0-SNAPSHOT.pom
[JENKINS] Archiving <https://ci-builds.apache.org/job/ActiveMQ/job/ActiveMQ-Artemis-JDK11/ws/artemis-selector/target/artemis-selector-2.31.0-SNAPSHOT.jar> to org.apache.activemq/artemis-selector/2.31.0-SNAPSHOT/artemis-selector-2.31.0-SNAPSHOT.jar
[JENKINS] Archiving <https://ci-builds.apache.org/job/ActiveMQ/job/ActiveMQ-Artemis-JDK11/ws/artemis-selector/target/artemis-selector-2.31.0-SNAPSHOT-sources.jar> to org.apache.activemq/artemis-selector/2.31.0-SNAPSHOT/artemis-selector-2.31.0-SNAPSHOT-sources.jar
[JENKINS] Archiving <https://ci-builds.apache.org/job/ActiveMQ/job/ActiveMQ-Artemis-JDK11/ws/artemis-jdbc-store/pom.xml> to org.apache.activemq/artemis-jdbc-store/2.31.0-SNAPSHOT/artemis-jdbc-store-2.31.0-SNAPSHOT.pom
[JENKINS] Archiving <https://ci-builds.apache.org/job/ActiveMQ/job/ActiveMQ-Artemis-JDK11/ws/artemis-jdbc-store/target/artemis-jdbc-store-2.31.0-SNAPSHOT.jar> to org.apache.activemq/artemis-jdbc-store/2.31.0-SNAPSHOT/artemis-jdbc-store-2.31.0-SNAPSHOT.jar
[JENKINS] Archiving <https://ci-builds.apache.org/job/ActiveMQ/job/ActiveMQ-Artemis-JDK11/ws/artemis-jdbc-store/target/artemis-jdbc-store-2.31.0-SNAPSHOT-sources.jar> to org.apache.activemq/artemis-jdbc-store/2.31.0-SNAPSHOT/artemis-jdbc-store-2.31.0-SNAPSHOT-sources.jar
[JENKINS] Archiving <https://ci-builds.apache.org/job/ActiveMQ/job/ActiveMQ-Artemis-JDK11/ws/integration/activemq-spring-integration/pom.xml> to org.apache.activemq/artemis-spring-integration/2.31.0-SNAPSHOT/artemis-spring-integration-2.31.0-SNAPSHOT.pom
[JENKINS] Archiving <https://ci-builds.apache.org/job/ActiveMQ/job/ActiveMQ-Artemis-JDK11/ws/artemis-quorum-ri/pom.xml> to org.apache.activemq/artemis-quorum-ri/2.31.0-SNAPSHOT/artemis-quorum-ri-2.31.0-SNAPSHOT.pom
[JENKINS] Archiving <https://ci-builds.apache.org/job/ActiveMQ/job/ActiveMQ-Artemis-JDK11/ws/artemis-web/pom.xml> to org.apache.activemq/artemis-web/2.31.0-SNAPSHOT/artemis-web-2.31.0-SNAPSHOT.pom
[JENKINS] Archiving <https://ci-builds.apache.org/job/ActiveMQ/job/ActiveMQ-Artemis-JDK11/ws/artemis-junit/artemis-junit-commons/pom.xml> to org.apache.activemq/artemis-junit-commons/2.31.0-SNAPSHOT/artemis-junit-commons-2.31.0-SNAPSHOT.pom
[JENKINS] Archiving <https://ci-builds.apache.org/job/ActiveMQ/job/ActiveMQ-Artemis-JDK11/ws/artemis-junit/artemis-junit-commons/target/artemis-junit-commons-2.31.0-SNAPSHOT.jar> to org.apache.activemq/artemis-junit-commons/2.31.0-SNAPSHOT/artemis-junit-commons-2.31.0-SNAPSHOT.jar
[JENKINS] Archiving <https://ci-builds.apache.org/job/ActiveMQ/job/ActiveMQ-Artemis-JDK11/ws/artemis-junit/artemis-junit-commons/target/artemis-junit-commons-2.31.0-SNAPSHOT-sources.jar> to org.apache.activemq/artemis-junit-commons/2.31.0-SNAPSHOT/artemis-junit-commons-2.31.0-SNAPSHOT-sources.jar
[JENKINS] Archiving <https://ci-builds.apache.org/job/ActiveMQ/job/ActiveMQ-Artemis-JDK11/ws/artemis-cdi-client/pom.xml> to org.apache.activemq/artemis-cdi-client/2.31.0-SNAPSHOT/artemis-cdi-client-2.31.0-SNAPSHOT.pom
[JENKINS] Archiving <https://ci-builds.apache.org/job/ActiveMQ/job/ActiveMQ-Artemis-JDK11/ws/artemis-cdi-client/target/artemis-cdi-client-2.31.0-SNAPSHOT.jar> to org.apache.activemq/artemis-cdi-client/2.31.0-SNAPSHOT/artemis-cdi-client-2.31.0-SNAPSHOT.jar
[JENKINS] Archiving <https://ci-builds.apache.org/job/ActiveMQ/job/ActiveMQ-Artemis-JDK11/ws/artemis-cdi-client/target/artemis-cdi-client-2.31.0-SNAPSHOT-sources.jar> to org.apache.activemq/artemis-cdi-client/2.31.0-SNAPSHOT/artemis-cdi-client-2.31.0-SNAPSHOT-sources.jar
[JENKINS] Archiving <https://ci-builds.apache.org/job/ActiveMQ/job/ActiveMQ-Artemis-JDK11/ws/tests/jms-tests/pom.xml> to org.apache.activemq.tests/jms-tests/2.31.0-SNAPSHOT/jms-tests-2.31.0-SNAPSHOT.pom
[JENKINS] Archiving <https://ci-builds.apache.org/job/ActiveMQ/job/ActiveMQ-Artemis-JDK11/ws/artemis-ra/pom.xml> to org.apache.activemq/artemis-ra/2.31.0-SNAPSHOT/artemis-ra-2.31.0-SNAPSHOT.pom
[JENKINS] Archiving <https://ci-builds.apache.org/job/ActiveMQ/job/ActiveMQ-Artemis-JDK11/ws/pom.xml> to org.apache.activemq/artemis-pom/2.31.0-SNAPSHOT/artemis-pom-2.31.0-SNAPSHOT.pom
[JENKINS] Archiving <https://ci-builds.apache.org/job/ActiveMQ/job/ActiveMQ-Artemis-JDK11/ws/tests/karaf-client-integration-tests/pom.xml> to org.apache.activemq.tests/karaf-client-integration-tests/2.31.0-SNAPSHOT/karaf-client-integration-tests-2.31.0-SNAPSHOT.pom
[JENKINS] Archiving <https://ci-builds.apache.org/job/ActiveMQ/job/ActiveMQ-Artemis-JDK11/ws/artemis-maven-plugin/pom.xml> to org.apache.activemq/artemis-maven-plugin/2.31.0-SNAPSHOT/artemis-maven-plugin-2.31.0-SNAPSHOT.pom
[JENKINS] Archiving <https://ci-builds.apache.org/job/ActiveMQ/job/ActiveMQ-Artemis-JDK11/ws/artemis-junit/artemis-junit-4/pom.xml> to org.apache.activemq/artemis-junit/2.31.0-SNAPSHOT/artemis-junit-2.31.0-SNAPSHOT.pom
[JENKINS] Archiving <https://ci-builds.apache.org/job/ActiveMQ/job/ActiveMQ-Artemis-JDK11/ws/artemis-junit/artemis-junit-4/target/artemis-junit-2.31.0-SNAPSHOT.jar> to org.apache.activemq/artemis-junit/2.31.0-SNAPSHOT/artemis-junit-2.31.0-SNAPSHOT.jar
[JENKINS] Archiving <https://ci-builds.apache.org/job/ActiveMQ/job/ActiveMQ-Artemis-JDK11/ws/artemis-junit/artemis-junit-4/target/artemis-junit-2.31.0-SNAPSHOT-sources.jar> to org.apache.activemq/artemis-junit/2.31.0-SNAPSHOT/artemis-junit-2.31.0-SNAPSHOT-sources.jar
[JENKINS] Archiving <https://ci-builds.apache.org/job/ActiveMQ/job/ActiveMQ-Artemis-JDK11/ws/artemis-service-extensions/pom.xml> to org.apache.activemq/artemis-service-extensions/2.31.0-SNAPSHOT/artemis-service-extensions-2.31.0-SNAPSHOT.pom
[JENKINS] Archiving <https://ci-builds.apache.org/job/ActiveMQ/job/ActiveMQ-Artemis-JDK11/ws/artemis-service-extensions/target/artemis-service-extensions-2.31.0-SNAPSHOT.jar> to org.apache.activemq/artemis-service-extensions/2.31.0-SNAPSHOT/artemis-service-extensions-2.31.0-SNAPSHOT.jar
[JENKINS] Archiving <https://ci-builds.apache.org/job/ActiveMQ/job/ActiveMQ-Artemis-JDK11/ws/artemis-service-extensions/target/artemis-service-extensions-2.31.0-SNAPSHOT-sources.jar> to org.apache.activemq/artemis-service-extensions/2.31.0-SNAPSHOT/artemis-service-extensions-2.31.0-SNAPSHOT-sources.jar
[JENKINS] Archiving <https://ci-builds.apache.org/job/ActiveMQ/job/ActiveMQ-Artemis-JDK11/ws/artemis-server-osgi/pom.xml> to org.apache.activemq/artemis-server-osgi/2.31.0-SNAPSHOT/artemis-server-osgi-2.31.0-SNAPSHOT.pom
[JENKINS] Archiving <https://ci-builds.apache.org/job/ActiveMQ/job/ActiveMQ-Artemis-JDK11/ws/artemis-junit/pom.xml> to org.apache.activemq/artemis-junit-parent/2.31.0-SNAPSHOT/artemis-junit-parent-2.31.0-SNAPSHOT.pom
[JENKINS] Archiving <https://ci-builds.apache.org/job/ActiveMQ/job/ActiveMQ-Artemis-JDK11/ws/tests/unit-tests/pom.xml> to org.apache.activemq.tests/unit-tests/2.31.0-SNAPSHOT/unit-tests-2.31.0-SNAPSHOT.pom
[JENKINS] Archiving <https://ci-builds.apache.org/job/ActiveMQ/job/ActiveMQ-Artemis-JDK11/ws/tests/leak-tests/pom.xml> to org.apache.activemq.tests/leak-tests/2.31.0-SNAPSHOT/leak-tests-2.31.0-SNAPSHOT.pom
[JENKINS] Archiving <https://ci-builds.apache.org/job/ActiveMQ/job/ActiveMQ-Artemis-JDK11/ws/artemis-protocols/artemis-stomp-protocol/pom.xml> to org.apache.activemq/artemis-stomp-protocol/2.31.0-SNAPSHOT/artemis-stomp-protocol-2.31.0-SNAPSHOT.pom
[JENKINS] Archiving <https://ci-builds.apache.org/job/ActiveMQ/job/ActiveMQ-Artemis-JDK11/ws/artemis-protocols/artemis-stomp-protocol/target/artemis-stomp-protocol-2.31.0-SNAPSHOT.jar> to org.apache.activemq/artemis-stomp-protocol/2.31.0-SNAPSHOT/artemis-stomp-protocol-2.31.0-SNAPSHOT.jar
[JENKINS] Archiving <https://ci-builds.apache.org/job/ActiveMQ/job/ActiveMQ-Artemis-JDK11/ws/artemis-protocols/artemis-stomp-protocol/target/artemis-stomp-protocol-2.31.0-SNAPSHOT-sources.jar> to org.apache.activemq/artemis-stomp-protocol/2.31.0-SNAPSHOT/artemis-stomp-protocol-2.31.0-SNAPSHOT-sources.jar
[JENKINS] Archiving <https://ci-builds.apache.org/job/ActiveMQ/job/ActiveMQ-Artemis-JDK11/ws/artemis-protocols/artemis-hornetq-protocol/pom.xml> to org.apache.activemq/artemis-hornetq-protocol/2.31.0-SNAPSHOT/artemis-hornetq-protocol-2.31.0-SNAPSHOT.pom
[JENKINS] Archiving <https://ci-builds.apache.org/job/ActiveMQ/job/ActiveMQ-Artemis-JDK11/ws/artemis-protocols/artemis-hornetq-protocol/target/artemis-hornetq-protocol-2.31.0-SNAPSHOT.jar> to org.apache.activemq/artemis-hornetq-protocol/2.31.0-SNAPSHOT/artemis-hornetq-protocol-2.31.0-SNAPSHOT.jar
[JENKINS] Archiving <https://ci-builds.apache.org/job/ActiveMQ/job/ActiveMQ-Artemis-JDK11/ws/artemis-protocols/artemis-hornetq-protocol/target/artemis-hornetq-protocol-2.31.0-SNAPSHOT-sources.jar> to org.apache.activemq/artemis-hornetq-protocol/2.31.0-SNAPSHOT/artemis-hornetq-protocol-2.31.0-SNAPSHOT-sources.jar
[JENKINS] Archiving <https://ci-builds.apache.org/job/ActiveMQ/job/ActiveMQ-Artemis-JDK11/ws/artemis-core-client-osgi/pom.xml> to org.apache.activemq/artemis-core-client-osgi/2.31.0-SNAPSHOT/artemis-core-client-osgi-2.31.0-SNAPSHOT.pom
[JENKINS] Archiving <https://ci-builds.apache.org/job/ActiveMQ/job/ActiveMQ-Artemis-JDK11/ws/tests/performance-tests/pom.xml> to org.apache.activemq.tests/performance-tests/2.31.0-SNAPSHOT/performance-tests-2.31.0-SNAPSHOT.pom
[JENKINS] Archiving <https://ci-builds.apache.org/job/ActiveMQ/job/ActiveMQ-Artemis-JDK11/ws/artemis-features/pom.xml> to org.apache.activemq/artemis-features/2.31.0-SNAPSHOT/artemis-features-2.31.0-SNAPSHOT.pom
[JENKINS] Archiving <https://ci-builds.apache.org/job/ActiveMQ/job/ActiveMQ-Artemis-JDK11/ws/artemis-commons/dependency-reduced-pom.xml> to org.apache.activemq/artemis-commons/2.31.0-SNAPSHOT/artemis-commons-2.31.0-SNAPSHOT.pom
[JENKINS] Archiving <https://ci-builds.apache.org/job/ActiveMQ/job/ActiveMQ-Artemis-JDK11/ws/artemis-commons/target/artemis-commons-2.31.0-SNAPSHOT.jar> to org.apache.activemq/artemis-commons/2.31.0-SNAPSHOT/artemis-commons-2.31.0-SNAPSHOT.jar
[JENKINS] Archiving <https://ci-builds.apache.org/job/ActiveMQ/job/ActiveMQ-Artemis-JDK11/ws/artemis-commons/target/artemis-commons-2.31.0-SNAPSHOT-sources.jar> to org.apache.activemq/artemis-commons/2.31.0-SNAPSHOT/artemis-commons-2.31.0-SNAPSHOT-sources.jar
[JENKINS] Archiving <https://ci-builds.apache.org/job/ActiveMQ/job/ActiveMQ-Artemis-JDK11/ws/artemis-journal/pom.xml> to org.apache.activemq/artemis-journal/2.31.0-SNAPSHOT/artemis-journal-2.31.0-SNAPSHOT.pom
[JENKINS] Archiving <https://ci-builds.apache.org/job/ActiveMQ/job/ActiveMQ-Artemis-JDK11/ws/artemis-journal/target/artemis-journal-2.31.0-SNAPSHOT.jar> to org.apache.activemq/artemis-journal/2.31.0-SNAPSHOT/artemis-journal-2.31.0-SNAPSHOT.jar
[JENKINS] Archiving <https://ci-builds.apache.org/job/ActiveMQ/job/ActiveMQ-Artemis-JDK11/ws/artemis-journal/target/artemis-journal-2.31.0-SNAPSHOT-sources.jar> to org.apache.activemq/artemis-journal/2.31.0-SNAPSHOT/artemis-journal-2.31.0-SNAPSHOT-sources.jar
[JENKINS] Archiving <https://ci-builds.apache.org/job/ActiveMQ/job/ActiveMQ-Artemis-JDK11/ws/tests/soak-tests/pom.xml> to org.apache.activemq.tests/soak-tests/2.31.0-SNAPSHOT/soak-tests-2.31.0-SNAPSHOT.pom
[JENKINS] Archiving <https://ci-builds.apache.org/job/ActiveMQ/job/ActiveMQ-Artemis-JDK11/ws/artemis-core-client/pom.xml> to org.apache.activemq/artemis-core-client/2.31.0-SNAPSHOT/artemis-core-client-2.31.0-SNAPSHOT.pom
[JENKINS] Archiving <https://ci-builds.apache.org/job/ActiveMQ/job/ActiveMQ-Artemis-JDK11/ws/artemis-core-client/target/artemis-core-client-2.31.0-SNAPSHOT.jar> to org.apache.activemq/artemis-core-client/2.31.0-SNAPSHOT/artemis-core-client-2.31.0-SNAPSHOT.jar
[JENKINS] Archiving <https://ci-builds.apache.org/job/ActiveMQ/job/ActiveMQ-Artemis-JDK11/ws/artemis-core-client/target/artemis-core-client-2.31.0-SNAPSHOT-sources.jar> to org.apache.activemq/artemis-core-client/2.31.0-SNAPSHOT/artemis-core-client-2.31.0-SNAPSHOT-sources.jar
[JENKINS] Archiving <https://ci-builds.apache.org/job/ActiveMQ/job/ActiveMQ-Artemis-JDK11/ws/tests/integration-tests-isolated/pom.xml> to org.apache.activemq.tests/integration-tests-isolated/2.31.0-SNAPSHOT/integration-tests-isolated-2.31.0-SNAPSHOT.pom
[JENKINS] Archiving <https://ci-builds.apache.org/job/ActiveMQ/job/ActiveMQ-Artemis-JDK11/ws/artemis-jakarta-ra/pom.xml> to org.apache.activemq/artemis-jakarta-ra/2.31.0-SNAPSHOT/artemis-jakarta-ra-2.31.0-SNAPSHOT.pom
[JENKINS] Archiving <https://ci-builds.apache.org/job/ActiveMQ/job/ActiveMQ-Artemis-JDK11/ws/tests/timing-tests/pom.xml> to org.apache.activemq.tests/timing-tests/2.31.0-SNAPSHOT/timing-tests-2.31.0-SNAPSHOT.pom
[JENKINS] Archiving <https://ci-builds.apache.org/job/ActiveMQ/job/ActiveMQ-Artemis-JDK11/ws/artemis-junit/artemis-junit-5/pom.xml> to org.apache.activemq/artemis-junit-5/2.31.0-SNAPSHOT/artemis-junit-5-2.31.0-SNAPSHOT.pom
[JENKINS] Archiving <https://ci-builds.apache.org/job/ActiveMQ/job/ActiveMQ-Artemis-JDK11/ws/artemis-jms-client-all/pom.xml> to org.apache.activemq/artemis-jms-client-all/2.31.0-SNAPSHOT/artemis-jms-client-all-2.31.0-SNAPSHOT.pom
[JENKINS] Archiving <https://ci-builds.apache.org/job/ActiveMQ/job/ActiveMQ-Artemis-JDK11/ws/artemis-protocols/pom.xml> to org.apache.activemq/artemis-protocols/2.31.0-SNAPSHOT/artemis-protocols-2.31.0-SNAPSHOT.pom
[JENKINS] Archiving <https://ci-builds.apache.org/job/ActiveMQ/job/ActiveMQ-Artemis-JDK11/ws/tests/karaf-server-integration-tests/pom.xml> to org.apache.activemq.tests/karaf-server-integration-tests/2.31.0-SNAPSHOT/karaf-server-integration-tests-2.31.0-SNAPSHOT.pom
[JENKINS] Archiving <https://ci-builds.apache.org/job/ActiveMQ/job/ActiveMQ-Artemis-JDK11/ws/artemis-hawtio/artemis-plugin/pom.xml> to org.apache.activemq/artemis-plugin/2.31.0-SNAPSHOT/artemis-plugin-2.31.0-SNAPSHOT.pom
[JENKINS] Archiving <https://ci-builds.apache.org/job/ActiveMQ/job/ActiveMQ-Artemis-JDK11/ws/artemis-quorum-api/pom.xml> to org.apache.activemq/artemis-quorum-api/2.31.0-SNAPSHOT/artemis-quorum-api-2.31.0-SNAPSHOT.pom
[JENKINS] Archiving <https://ci-builds.apache.org/job/ActiveMQ/job/ActiveMQ-Artemis-JDK11/ws/artemis-quorum-api/target/artemis-quorum-api-2.31.0-SNAPSHOT.jar> to org.apache.activemq/artemis-quorum-api/2.31.0-SNAPSHOT/artemis-quorum-api-2.31.0-SNAPSHOT.jar
[JENKINS] Archiving <https://ci-builds.apache.org/job/ActiveMQ/job/ActiveMQ-Artemis-JDK11/ws/artemis-quorum-api/target/artemis-quorum-api-2.31.0-SNAPSHOT-sources.jar> to org.apache.activemq/artemis-quorum-api/2.31.0-SNAPSHOT/artemis-quorum-api-2.31.0-SNAPSHOT-sources.jar
[JENKINS] Archiving <https://ci-builds.apache.org/job/ActiveMQ/job/ActiveMQ-Artemis-JDK11/ws/artemis-dto/pom.xml> to org.apache.activemq/artemis-dto/2.31.0-SNAPSHOT/artemis-dto-2.31.0-SNAPSHOT.pom
[JENKINS] Archiving <https://ci-builds.apache.org/job/ActiveMQ/job/ActiveMQ-Artemis-JDK11/ws/artemis-dto/target/artemis-dto-2.31.0-SNAPSHOT.jar> to org.apache.activemq/artemis-dto/2.31.0-SNAPSHOT/artemis-dto-2.31.0-SNAPSHOT.jar
[JENKINS] Archiving <https://ci-builds.apache.org/job/ActiveMQ/job/ActiveMQ-Artemis-JDK11/ws/artemis-dto/target/artemis-dto-2.31.0-SNAPSHOT-sources.jar> to org.apache.activemq/artemis-dto/2.31.0-SNAPSHOT/artemis-dto-2.31.0-SNAPSHOT-sources.jar
[JENKINS] Archiving <https://ci-builds.apache.org/job/ActiveMQ/job/ActiveMQ-Artemis-JDK11/ws/artemis-unit-test-support/pom.xml> to org.apache.activemq/artemis-unit-test-support/2.31.0-SNAPSHOT/artemis-unit-test-support-2.31.0-SNAPSHOT.pom
[JENKINS] Archiving <https://ci-builds.apache.org/job/ActiveMQ/job/ActiveMQ-Artemis-JDK11/ws/artemis-unit-test-support/target/artemis-unit-test-support-2.31.0-SNAPSHOT.jar> to org.apache.activemq/artemis-unit-test-support/2.31.0-SNAPSHOT/artemis-unit-test-support-2.31.0-SNAPSHOT.jar
[JENKINS] Archiving <https://ci-builds.apache.org/job/ActiveMQ/job/ActiveMQ-Artemis-JDK11/ws/artemis-unit-test-support/target/artemis-unit-test-support-2.31.0-SNAPSHOT-sources.jar> to org.apache.activemq/artemis-unit-test-support/2.31.0-SNAPSHOT/artemis-unit-test-support-2.31.0-SNAPSHOT-sources.jar
[JENKINS] Archiving <https://ci-builds.apache.org/job/ActiveMQ/job/ActiveMQ-Artemis-JDK11/ws/artemis-jakarta-service-extensions/pom.xml> to org.apache.activemq/artemis-jakarta-service-extensions/2.31.0-SNAPSHOT/artemis-jakarta-service-extensions-2.31.0-SNAPSHOT.pom
[JENKINS] Archiving <https://ci-builds.apache.org/job/ActiveMQ/job/ActiveMQ-Artemis-JDK11/ws/artemis-protocols/artemis-hqclient-protocol/pom.xml> to org.apache.activemq/artemis-hqclient-protocol/2.31.0-SNAPSHOT/artemis-hqclient-protocol-2.31.0-SNAPSHOT.pom
[JENKINS] Archiving <https://ci-builds.apache.org/job/ActiveMQ/job/ActiveMQ-Artemis-JDK11/ws/artemis-protocols/artemis-hqclient-protocol/target/artemis-hqclient-protocol-2.31.0-SNAPSHOT.jar> to org.apache.activemq/artemis-hqclient-protocol/2.31.0-SNAPSHOT/artemis-hqclient-protocol-2.31.0-SNAPSHOT.jar
[JENKINS] Archiving <https://ci-builds.apache.org/job/ActiveMQ/job/ActiveMQ-Artemis-JDK11/ws/artemis-protocols/artemis-hqclient-protocol/target/artemis-hqclient-protocol-2.31.0-SNAPSHOT-sources.jar> to org.apache.activemq/artemis-hqclient-protocol/2.31.0-SNAPSHOT/artemis-hqclient-protocol-2.31.0-SNAPSHOT-sources.jar
[JENKINS] Archiving <https://ci-builds.apache.org/job/ActiveMQ/job/ActiveMQ-Artemis-JDK11/ws/artemis-jms-client-osgi/pom.xml> to org.apache.activemq/artemis-jms-client-osgi/2.31.0-SNAPSHOT/artemis-jms-client-osgi-2.31.0-SNAPSHOT.pom
[JENKINS] Archiving <https://ci-builds.apache.org/job/ActiveMQ/job/ActiveMQ-Artemis-JDK11/ws/tests/integration-tests/pom.xml> to org.apache.activemq.tests/integration-tests/2.31.0-SNAPSHOT/integration-tests-2.31.0-SNAPSHOT.pom
[JENKINS] Archiving <https://ci-builds.apache.org/job/ActiveMQ/job/ActiveMQ-Artemis-JDK11/ws/artemis-boot/pom.xml> to org.apache.activemq/artemis-boot/2.31.0-SNAPSHOT/artemis-boot-2.31.0-SNAPSHOT.pom
[JENKINS] Archiving <https://ci-builds.apache.org/job/ActiveMQ/job/ActiveMQ-Artemis-JDK11/ws/artemis-boot/target/artemis-boot-2.31.0-SNAPSHOT.jar> to org.apache.activemq/artemis-boot/2.31.0-SNAPSHOT/artemis-boot-2.31.0-SNAPSHOT.jar
[JENKINS] Archiving <https://ci-builds.apache.org/job/ActiveMQ/job/ActiveMQ-Artemis-JDK11/ws/artemis-boot/target/artemis-boot-2.31.0-SNAPSHOT-sources.jar> to org.apache.activemq/artemis-boot/2.31.0-SNAPSHOT/artemis-boot-2.31.0-SNAPSHOT-sources.jar
[JENKINS] Archiving <https://ci-builds.apache.org/job/ActiveMQ/job/ActiveMQ-Artemis-JDK11/ws/artemis-jakarta-client/pom.xml> to org.apache.activemq/artemis-jakarta-client/2.31.0-SNAPSHOT/artemis-jakarta-client-2.31.0-SNAPSHOT.pom
[JENKINS] Archiving <https://ci-builds.apache.org/job/ActiveMQ/job/ActiveMQ-Artemis-JDK11/ws/artemis-protocols/artemis-amqp-protocol/pom.xml> to org.apache.activemq/artemis-amqp-protocol/2.31.0-SNAPSHOT/artemis-amqp-protocol-2.31.0-SNAPSHOT.pom
[JENKINS] Archiving <https://ci-builds.apache.org/job/ActiveMQ/job/ActiveMQ-Artemis-JDK11/ws/artemis-protocols/artemis-amqp-protocol/target/artemis-amqp-protocol-2.31.0-SNAPSHOT.jar> to org.apache.activemq/artemis-amqp-protocol/2.31.0-SNAPSHOT/artemis-amqp-protocol-2.31.0-SNAPSHOT.jar
[JENKINS] Archiving <https://ci-builds.apache.org/job/ActiveMQ/job/ActiveMQ-Artemis-JDK11/ws/artemis-protocols/artemis-amqp-protocol/target/artemis-amqp-protocol-2.31.0-SNAPSHOT-sources.jar> to org.apache.activemq/artemis-amqp-protocol/2.31.0-SNAPSHOT/artemis-amqp-protocol-2.31.0-SNAPSHOT-sources.jar
[JENKINS] Archiving <https://ci-builds.apache.org/job/ActiveMQ/job/ActiveMQ-Artemis-JDK11/ws/artemis-jakarta-server/pom.xml> to org.apache.activemq/artemis-jakarta-server/2.31.0-SNAPSHOT/artemis-jakarta-server-2.31.0-SNAPSHOT.pom
[JENKINS] Archiving <https://ci-builds.apache.org/job/ActiveMQ/job/ActiveMQ-Artemis-JDK11/ws/artemis-protocols/artemis-mqtt-protocol/pom.xml> to org.apache.activemq/artemis-mqtt-protocol/2.31.0-SNAPSHOT/artemis-mqtt-protocol-2.31.0-SNAPSHOT.pom
[JENKINS] Archiving <https://ci-builds.apache.org/job/ActiveMQ/job/ActiveMQ-Artemis-JDK11/ws/artemis-protocols/artemis-mqtt-protocol/target/artemis-mqtt-protocol-2.31.0-SNAPSHOT.jar> to org.apache.activemq/artemis-mqtt-protocol/2.31.0-SNAPSHOT/artemis-mqtt-protocol-2.31.0-SNAPSHOT.jar
[JENKINS] Archiving <https://ci-builds.apache.org/job/ActiveMQ/job/ActiveMQ-Artemis-JDK11/ws/artemis-protocols/artemis-mqtt-protocol/target/artemis-mqtt-protocol-2.31.0-SNAPSHOT-sources.jar> to org.apache.activemq/artemis-mqtt-protocol/2.31.0-SNAPSHOT/artemis-mqtt-protocol-2.31.0-SNAPSHOT-sources.jar
[JENKINS] Archiving <https://ci-builds.apache.org/job/ActiveMQ/job/ActiveMQ-Artemis-JDK11/ws/tests/e2e-tests/pom.xml> to org.apache.activemq.tests/e2e-tests/2.31.0-SNAPSHOT/e2e-tests-2.31.0-SNAPSHOT.pom
[JENKINS] Archiving <https://ci-builds.apache.org/job/ActiveMQ/job/ActiveMQ-Artemis-JDK11/ws/artemis-hawtio/pom.xml> to org.apache.activemq/artemis-hawtio-pom/2.31.0-SNAPSHOT/artemis-hawtio-pom-2.31.0-SNAPSHOT.pom
[JENKINS] Archiving <https://ci-builds.apache.org/job/ActiveMQ/job/ActiveMQ-Artemis-JDK11/ws/tests/stress-tests/pom.xml> to org.apache.activemq.tests/stress-tests/2.31.0-SNAPSHOT/stress-tests-2.31.0-SNAPSHOT.pom
channel stopped

Build failed in Jenkins: ActiveMQ » ActiveMQ-Artemis-JDK11 #1513

Posted by Apache Jenkins Server <je...@builds.apache.org>.
See <https://ci-builds.apache.org/job/ActiveMQ/job/ActiveMQ-Artemis-JDK11/1513/display/redirect?page=changes>

Changes:

[Clebert Suconic] ARTEMIS-4372 Implement Pico-cli and script auto-complete


------------------------------------------
[...truncated 1.95 MB...]
[main] 15:07:49,392 INFO  [org.apache.activemq.artemis.core.server] AMQ221057: Global Max Size is being adjusted to 1/2 of the JVM max size (-Xmx). being defined as 12666798080
[main] 15:07:49,392 INFO  [org.apache.activemq.artemis.core.server] AMQ221043: Protocol module found: [artemis-server]. Adding protocol support for: CORE
[main] 15:07:49,393 INFO  [org.apache.activemq.artemis.core.server] AMQ224092: Despite disabled persistence, page files will be persisted.
[main] 15:07:49,394 INFO  [org.apache.activemq.artemis.core.server] AMQ221080: Deploying address DLQ supporting [ANYCAST]
[main] 15:07:49,395 INFO  [org.apache.activemq.artemis.core.server] AMQ221003: Deploying ANYCAST queue DLQ on address DLQ
[main] 15:07:49,395 INFO  [org.apache.activemq.artemis.core.server] AMQ221080: Deploying address ExpiryQueue supporting [ANYCAST]
[main] 15:07:49,395 INFO  [org.apache.activemq.artemis.core.server] AMQ221003: Deploying ANYCAST queue ExpiryQueue on address ExpiryQueue
[main] 15:07:49,396 WARN  [org.apache.activemq.artemis.core.server] AMQ222203: Classpath lacks a protocol-manager for protocol STOMP, Protocol being ignored on acceptor TransportConfiguration(name=stomp, factory=org-apache-activemq-artemis-core-remoting-impl-netty-NettyAcceptorFactory) ?scheme=tcp&tcpReceiveBufferSize=1048576&port=61613&host=0-0-0-0&protocols=STOMP&useEpoll=true&tcpSendBufferSize=1048576
[main] 15:07:49,396 WARN  [org.apache.activemq.artemis.core.server] AMQ222203: Classpath lacks a protocol-manager for protocol HORNETQ, Protocol being ignored on acceptor TransportConfiguration(name=hornetq, factory=org-apache-activemq-artemis-core-remoting-impl-netty-NettyAcceptorFactory) ?scheme=tcp&port=5445&host=0-0-0-0&protocols=HORNETQ,STOMP&useEpoll=true&anycastPrefix=jms-queue-&multicastPrefix=jms-topic-
[main] 15:07:49,396 WARN  [org.apache.activemq.artemis.core.server] AMQ222203: Classpath lacks a protocol-manager for protocol STOMP, Protocol being ignored on acceptor TransportConfiguration(name=hornetq, factory=org-apache-activemq-artemis-core-remoting-impl-netty-NettyAcceptorFactory) ?scheme=tcp&port=5445&host=0-0-0-0&protocols=HORNETQ,STOMP&useEpoll=true&anycastPrefix=jms-queue-&multicastPrefix=jms-topic-
[main] 15:07:49,397 WARN  [org.apache.activemq.artemis.core.server] AMQ222203: Classpath lacks a protocol-manager for protocol AMQP, Protocol being ignored on acceptor TransportConfiguration(name=amqp, factory=org-apache-activemq-artemis-core-remoting-impl-netty-NettyAcceptorFactory) ?scheme=tcp&tcpReceiveBufferSize=1048576&port=5672&host=0-0-0-0&protocols=AMQP&useEpoll=true&tcpSendBufferSize=1048576&amqpCredits=1000&amqpMinLargeMessageSize=102400&amqpDuplicateDetection=true&amqpLowCredits=300
[main] 15:07:49,398 WARN  [org.apache.activemq.artemis.core.server] AMQ222203: Classpath lacks a protocol-manager for protocol AMQP, Protocol being ignored on acceptor TransportConfiguration(name=artemis, factory=org-apache-activemq-artemis-core-remoting-impl-netty-NettyAcceptorFactory) ?scheme=tcp&tcpReceiveBufferSize=1048576&port=61616&host=0-0-0-0&protocols=CORE,AMQP,STOMP,HORNETQ,MQTT,OPENWIRE&useEpoll=true&tcpSendBufferSize=1048576&amqpCredits=1000&amqpMinLargeMessageSize=102400&supportAdvisory=false&amqpDuplicateDetection=true&amqpLowCredits=300&suppressInternalManagementObjects=false
[main] 15:07:49,398 WARN  [org.apache.activemq.artemis.core.server] AMQ222203: Classpath lacks a protocol-manager for protocol STOMP, Protocol being ignored on acceptor TransportConfiguration(name=artemis, factory=org-apache-activemq-artemis-core-remoting-impl-netty-NettyAcceptorFactory) ?scheme=tcp&tcpReceiveBufferSize=1048576&port=61616&host=0-0-0-0&protocols=CORE,AMQP,STOMP,HORNETQ,MQTT,OPENWIRE&useEpoll=true&tcpSendBufferSize=1048576&amqpCredits=1000&amqpMinLargeMessageSize=102400&supportAdvisory=false&amqpDuplicateDetection=true&amqpLowCredits=300&suppressInternalManagementObjects=false
[main] 15:07:49,398 WARN  [org.apache.activemq.artemis.core.server] AMQ222203: Classpath lacks a protocol-manager for protocol HORNETQ, Protocol being ignored on acceptor TransportConfiguration(name=artemis, factory=org-apache-activemq-artemis-core-remoting-impl-netty-NettyAcceptorFactory) ?scheme=tcp&tcpReceiveBufferSize=1048576&port=61616&host=0-0-0-0&protocols=CORE,AMQP,STOMP,HORNETQ,MQTT,OPENWIRE&useEpoll=true&tcpSendBufferSize=1048576&amqpCredits=1000&amqpMinLargeMessageSize=102400&supportAdvisory=false&amqpDuplicateDetection=true&amqpLowCredits=300&suppressInternalManagementObjects=false
[main] 15:07:49,398 WARN  [org.apache.activemq.artemis.core.server] AMQ222203: Classpath lacks a protocol-manager for protocol MQTT, Protocol being ignored on acceptor TransportConfiguration(name=artemis, factory=org-apache-activemq-artemis-core-remoting-impl-netty-NettyAcceptorFactory) ?scheme=tcp&tcpReceiveBufferSize=1048576&port=61616&host=0-0-0-0&protocols=CORE,AMQP,STOMP,HORNETQ,MQTT,OPENWIRE&useEpoll=true&tcpSendBufferSize=1048576&amqpCredits=1000&amqpMinLargeMessageSize=102400&supportAdvisory=false&amqpDuplicateDetection=true&amqpLowCredits=300&suppressInternalManagementObjects=false
[main] 15:07:49,398 WARN  [org.apache.activemq.artemis.core.server] AMQ222203: Classpath lacks a protocol-manager for protocol OPENWIRE, Protocol being ignored on acceptor TransportConfiguration(name=artemis, factory=org-apache-activemq-artemis-core-remoting-impl-netty-NettyAcceptorFactory) ?scheme=tcp&tcpReceiveBufferSize=1048576&port=61616&host=0-0-0-0&protocols=CORE,AMQP,STOMP,HORNETQ,MQTT,OPENWIRE&useEpoll=true&tcpSendBufferSize=1048576&amqpCredits=1000&amqpMinLargeMessageSize=102400&supportAdvisory=false&amqpDuplicateDetection=true&amqpLowCredits=300&suppressInternalManagementObjects=false
[main] 15:07:49,399 WARN  [org.apache.activemq.artemis.core.server] AMQ222203: Classpath lacks a protocol-manager for protocol MQTT, Protocol being ignored on acceptor TransportConfiguration(name=mqtt, factory=org-apache-activemq-artemis-core-remoting-impl-netty-NettyAcceptorFactory) ?scheme=tcp&tcpReceiveBufferSize=1048576&port=1883&host=0-0-0-0&protocols=MQTT&useEpoll=true&tcpSendBufferSize=1048576
[main] 15:07:49,404 INFO  [org.apache.activemq.artemis.core.server] AMQ221020: Started EPOLL Acceptor at 0.0.0.0:61616 for protocols [CORE]
[main] 15:07:49,406 INFO  [org.apache.activemq.artemis.core.server] AMQ221020: Started EPOLL Acceptor at 0.0.0.0:5445 for protocols [CORE]
[main] 15:07:49,409 INFO  [org.apache.activemq.artemis.core.server] AMQ221020: Started EPOLL Acceptor at 0.0.0.0:5672 for protocols [CORE]
[main] 15:07:49,412 INFO  [org.apache.activemq.artemis.core.server] AMQ221020: Started EPOLL Acceptor at 0.0.0.0:1883 for protocols [CORE]
[main] 15:07:49,415 INFO  [org.apache.activemq.artemis.core.server] AMQ221020: Started EPOLL Acceptor at 0.0.0.0:61613 for protocols [CORE]
[main] 15:07:49,415 INFO  [org.apache.activemq.artemis.core.server] AMQ221007: Server is now live
[main] 15:07:49,415 INFO  [org.apache.activemq.artemis.core.server] AMQ221001: Apache ActiveMQ Artemis Message Broker version 2.31.0-SNAPSHOT [0.0.0.0, nodeID=0378a1b2-2fb4-11ee-b6a1-90b11c386b31] 
Connection brokerURL = tcp://localhost:61616
Transferred a total of 5 messages
[ActiveMQ Artemis Server Shutdown Timer] 15:07:49,975 INFO  [org.apache.activemq.artemis.core.server] AMQ221002: Apache ActiveMQ Artemis Message Broker version 2.31.0-SNAPSHOT [0378a1b2-2fb4-11ee-b6a1-90b11c386b31] stopped, uptime 0.582 seconds
Server stopped!
[INFO] Tests run: 2, Failures: 0, Errors: 0, Skipped: 0, Time elapsed: 1.415 s - in org.apache.activemq.cli.test.TransferTest
[INFO] 
[INFO] Results:
[INFO] 
[ERROR] Failures: 
[ERROR]   ArtemisTest.testCustomPort:1349->testSimpleRun:1409 Exception expected
[ERROR]   ArtemisTest.testSimpleRun:1270->testSimpleRun:1367->testSimpleRun:1409 Exception expected
[ERROR]   ArtemisTest.testSpaces:1343->testSimpleRun:1367->testSimpleRun:1409 Exception expected
[ERROR]   ArtemisTest.testWeirdCharacter:1337->testSimpleRun:1367->testSimpleRun:1409 Exception expected
[INFO] 
[ERROR] Tests run: 108, Failures: 4, Errors: 0, Skipped: 0
[INFO] 
[JENKINS] Recording test results
[INFO] ------------------------------------------------------------------------
[INFO] Reactor Summary for ActiveMQ Artemis Parent 2.31.0-SNAPSHOT:
[INFO] 
[INFO] ActiveMQ Artemis Parent ............................ SUCCESS [ 20.360 s]
[INFO] ActiveMQ Artemis Unit Test Support ................. SUCCESS [ 14.355 s]
[INFO] ActiveMQ Log Annotation Processor .................. SUCCESS [ 30.064 s]
[INFO] ActiveMQ Artemis Commons ........................... SUCCESS [ 33.117 s]
[INFO] ActiveMQ Artemis Selector Implementation ........... SUCCESS [ 11.609 s]
[INFO] ActiveMQ Artemis Core Client ....................... SUCCESS [ 31.507 s]
[INFO] ActiveMQ Artemis Journal ........................... SUCCESS [ 13.415 s]
[INFO] ActiveMQ Artemis JDBC Store ........................ SUCCESS [ 57.566 s]
[INFO] ActiveMQ Artemis Quorum API ........................ SUCCESS [  9.416 s]
[INFO] ActiveMQ Artemis Server ............................ SUCCESS [02:55 min]
[INFO] ActiveMQ Artemis Protocols ......................... SUCCESS [  3.401 s]
[INFO] ActiveMQ Artemis AMQP Protocol ..................... SUCCESS [ 21.786 s]
[INFO] ActiveMQ Artemis STOMP Protocol .................... SUCCESS [  6.614 s]
[INFO] ActiveMQ Artemis JMS Client ........................ SUCCESS [ 10.110 s]
[INFO] ActiveMQ Artemis OpenWire Protocol ................. SUCCESS [ 21.938 s]
[INFO] ActiveMQ Artemis HQClient Protocol ................. SUCCESS [  9.155 s]
[INFO] ActiveMQ Artemis HornetQ Protocol .................. SUCCESS [ 10.969 s]
[INFO] ActiveMQ Artemis MQTT Protocol ..................... SUCCESS [  6.420 s]
[INFO] ActiveMQ Artemis DTO ............................... SUCCESS [  8.723 s]
[INFO] ActiveMQ Artemis CDI Integration ................... SUCCESS [ 12.119 s]
[INFO] ActiveMQ Artemis Boot .............................. SUCCESS [  5.793 s]
[INFO] ActiveMQ Artemis Service Extensions ................ SUCCESS [  8.140 s]
[INFO] ActiveMQ Artemis JMS Server ........................ SUCCESS [  6.106 s]
[INFO] ActiveMQ Artemis JUnit ............................. SUCCESS [  3.279 s]
[INFO] ActiveMQ Artemis JUnit Commons ..................... SUCCESS [  5.825 s]
[INFO] ActiveMQ Artemis JUnit 4 Rules ..................... SUCCESS [ 12.249 s]
[INFO] ActiveMQ Artemis CLI ............................... FAILURE [02:54 min]
[INFO] ActiveMQ Artemis Web ............................... SKIPPED
[INFO] ActiveMQ Artemis Core Client All ................... SKIPPED
[INFO] ActiveMQ Artemis Client OSGi ....................... SKIPPED
[INFO] ActiveMQ Artemis JUnit 5 Extensions ................ SKIPPED
[INFO] ActiveMQ Artemis JMS Client All .................... SKIPPED
[INFO] ActiveMQ Artemis JMS Client OSGi ................... SKIPPED
[INFO] ActiveMQ Artemis Jakarta Messaging Client .......... SKIPPED
[INFO] ActiveMQ Artemis Jakarta Messaging Client All ...... SKIPPED
[INFO] ActiveMQ Artemis Jakarta Service Extensions ........ SKIPPED
[INFO] ActiveMQ Artemis Jakarta Messaging Server .......... SKIPPED
[INFO] ActiveMQ Artemis RAR POM ........................... SKIPPED
[INFO] ActiveMQ Artemis Jakarta RAR ....................... SKIPPED
[INFO] ActiveMQ Artemis Maven Plugin ...................... SKIPPED
[INFO] ActiveMQ Artemis Server OSGi ....................... SKIPPED
[INFO] ActiveMQ Artemis Cons .............................. SKIPPED
[INFO] ActiveMQ Artemis HawtIO Branding ................... SKIPPED
[INFO] ActiveMQ Artemis HawtIO Plugin ..................... SKIPPED
[INFO] ActiveMQ Artemis Console ........................... SKIPPED
[INFO] ActiveMQ Artemis Spring Integration ................ SKIPPED
[INFO] ActiveMQ Artemis Quorum RI ......................... SKIPPED
[INFO] Apache ActiveMQ Artemis Distribution ............... SKIPPED
[INFO] ActiveMQ Artemis Tests POM ......................... SKIPPED
[INFO] ActiveMQ Artemis Test Support ...................... SKIPPED
[INFO] ActiveMQ Artemis Unit Tests ........................ SKIPPED
[INFO] ActiveMQ Artemis Joram Tests ....................... SKIPPED
[INFO] ActiveMQ Artemis timing Tests ...................... SKIPPED
[INFO] ActiveMQ Artemis JMS Tests ......................... SKIPPED
[INFO] ActiveMQ Artemis Integration Tests ................. SKIPPED
[INFO] ActiveMQ Artemis Isolated Integration Tests ........ SKIPPED
[INFO] ActiveMQ Artemis Features .......................... SKIPPED
[INFO] ActiveMQ Artemis Karaf Client Integration Tests .... SKIPPED
[INFO] ActiveMQ Artemis Karaf Server Integration Tests .... SKIPPED
[INFO] ActiveMQ Artemis Compatibility Tests ............... SKIPPED
[INFO] ActiveMQ Artemis soak Tests ........................ SKIPPED
[INFO] ActiveMQ Artemis stress Tests ...................... SKIPPED
[INFO] ActiveMQ Artemis performance Tests ................. SKIPPED
[INFO] Smoke Tests ........................................ SKIPPED
[INFO] End-to-End Tests ................................... SKIPPED
[INFO] ActiveMQ Artemis Leak Tests ........................ SKIPPED
[INFO] Apache ActiveMQ Artemis Image ...................... SKIPPED
[INFO] Apache ActiveMQ Artemis Image Examples ............. SKIPPED
[INFO] ------------------------------------------------------------------------
[INFO] BUILD FAILURE
[INFO] ------------------------------------------------------------------------
[INFO] Total time:  15:10 min
[INFO] Finished at: 2023-07-31T15:09:15Z
[INFO] ------------------------------------------------------------------------
Waiting for Jenkins to finish collecting data
[ERROR] Failed to execute goal org.apache.maven.plugins:maven-surefire-plugin:2.22.2:test (default-test) on project artemis-cli: There are test failures.
[ERROR] 
[ERROR] Please refer to <https://ci-builds.apache.org/job/ActiveMQ/job/ActiveMQ-Artemis-JDK11/ws/artemis-cli/target/surefire-reports> for the individual test results.
[ERROR] Please refer to dump files (if any exist) [date].dump, [date]-jvmRun[N].dump and [date].dumpstream.
[ERROR] -> [Help 1]
[ERROR] 
[ERROR] To see the full stack trace of the errors, re-run Maven with the -e switch.
[ERROR] Re-run Maven using the -X switch to enable full debug logging.
[ERROR] 
[ERROR] For more information about the errors and possible solutions, please read the following articles:
[ERROR] [Help 1] http://cwiki.apache.org/confluence/display/MAVEN/MojoFailureException
[ERROR] 
[ERROR] After correcting the problems, you can resume the build with the command
[ERROR]   mvn <goals> -rf :artemis-cli
[JENKINS] Archiving <https://ci-builds.apache.org/job/ActiveMQ/job/ActiveMQ-Artemis-JDK11/ws/artemis-server/pom.xml> to org.apache.activemq/artemis-server/2.31.0-SNAPSHOT/artemis-server-2.31.0-SNAPSHOT.pom
[JENKINS] Archiving <https://ci-builds.apache.org/job/ActiveMQ/job/ActiveMQ-Artemis-JDK11/ws/artemis-server/target/artemis-server-2.31.0-SNAPSHOT.jar> to org.apache.activemq/artemis-server/2.31.0-SNAPSHOT/artemis-server-2.31.0-SNAPSHOT.jar
[JENKINS] Archiving <https://ci-builds.apache.org/job/ActiveMQ/job/ActiveMQ-Artemis-JDK11/ws/artemis-server/target/artemis-server-2.31.0-SNAPSHOT-tests.jar> to org.apache.activemq/artemis-server/2.31.0-SNAPSHOT/artemis-server-2.31.0-SNAPSHOT-tests.jar
[JENKINS] Archiving <https://ci-builds.apache.org/job/ActiveMQ/job/ActiveMQ-Artemis-JDK11/ws/artemis-server/target/artemis-server-2.31.0-SNAPSHOT-sources.jar> to org.apache.activemq/artemis-server/2.31.0-SNAPSHOT/artemis-server-2.31.0-SNAPSHOT-sources.jar
[JENKINS] Archiving <https://ci-builds.apache.org/job/ActiveMQ/job/ActiveMQ-Artemis-JDK11/ws/artemis-image/examples/pom.xml> to org.apache.activemq/artemis-image-examples/2.31.0-SNAPSHOT/artemis-image-examples-2.31.0-SNAPSHOT.pom
[JENKINS] Archiving <https://ci-builds.apache.org/job/ActiveMQ/job/ActiveMQ-Artemis-JDK11/ws/tests/compatibility-tests/pom.xml> to org.apache.activemq.tests/compatibility-tests/2.31.0-SNAPSHOT/compatibility-tests-2.31.0-SNAPSHOT.pom
[JENKINS] Archiving <https://ci-builds.apache.org/job/ActiveMQ/job/ActiveMQ-Artemis-JDK11/ws/artemis-jms-client/pom.xml> to org.apache.activemq/artemis-jms-client/2.31.0-SNAPSHOT/artemis-jms-client-2.31.0-SNAPSHOT.pom
[JENKINS] Archiving <https://ci-builds.apache.org/job/ActiveMQ/job/ActiveMQ-Artemis-JDK11/ws/artemis-jms-client/target/artemis-jms-client-2.31.0-SNAPSHOT.jar> to org.apache.activemq/artemis-jms-client/2.31.0-SNAPSHOT/artemis-jms-client-2.31.0-SNAPSHOT.jar
[JENKINS] Archiving <https://ci-builds.apache.org/job/ActiveMQ/job/ActiveMQ-Artemis-JDK11/ws/artemis-jms-client/target/artemis-jms-client-2.31.0-SNAPSHOT-sources.jar> to org.apache.activemq/artemis-jms-client/2.31.0-SNAPSHOT/artemis-jms-client-2.31.0-SNAPSHOT-sources.jar
[JENKINS] Archiving <https://ci-builds.apache.org/job/ActiveMQ/job/ActiveMQ-Artemis-JDK11/ws/artemis-hawtio/activemq-branding/pom.xml> to org.apache.activemq/activemq-branding/2.31.0-SNAPSHOT/activemq-branding-2.31.0-SNAPSHOT.pom
[JENKINS] Archiving <https://ci-builds.apache.org/job/ActiveMQ/job/ActiveMQ-Artemis-JDK11/ws/tests/smoke-tests/pom.xml> to org.apache.activemq.tests/smoke-tests/2.31.0-SNAPSHOT/smoke-tests-2.31.0-SNAPSHOT.pom
[JENKINS] Archiving <https://ci-builds.apache.org/job/ActiveMQ/job/ActiveMQ-Artemis-JDK11/ws/tests/joram-tests/pom.xml> to org.apache.activemq.tests/joram-tests/2.31.0-SNAPSHOT/joram-tests-2.31.0-SNAPSHOT.pom
[JENKINS] Archiving <https://ci-builds.apache.org/job/ActiveMQ/job/ActiveMQ-Artemis-JDK11/ws/artemis-log-annotation-processor/pom.xml> to org.apache.activemq/artemis-log-annotation-processor/2.31.0-SNAPSHOT/artemis-log-annotation-processor-2.31.0-SNAPSHOT.pom
[JENKINS] Archiving <https://ci-builds.apache.org/job/ActiveMQ/job/ActiveMQ-Artemis-JDK11/ws/artemis-log-annotation-processor/target/artemis-log-annotation-processor-2.31.0-SNAPSHOT.jar> to org.apache.activemq/artemis-log-annotation-processor/2.31.0-SNAPSHOT/artemis-log-annotation-processor-2.31.0-SNAPSHOT.jar
[JENKINS] Archiving <https://ci-builds.apache.org/job/ActiveMQ/job/ActiveMQ-Artemis-JDK11/ws/artemis-log-annotation-processor/target/artemis-log-annotation-processor-2.31.0-SNAPSHOT-sources.jar> to org.apache.activemq/artemis-log-annotation-processor/2.31.0-SNAPSHOT/artemis-log-annotation-processor-2.31.0-SNAPSHOT-sources.jar
[JENKINS] Archiving <https://ci-builds.apache.org/job/ActiveMQ/job/ActiveMQ-Artemis-JDK11/ws/artemis-jms-server/pom.xml> to org.apache.activemq/artemis-jms-server/2.31.0-SNAPSHOT/artemis-jms-server-2.31.0-SNAPSHOT.pom
[JENKINS] Archiving <https://ci-builds.apache.org/job/ActiveMQ/job/ActiveMQ-Artemis-JDK11/ws/artemis-jms-server/target/artemis-jms-server-2.31.0-SNAPSHOT.jar> to org.apache.activemq/artemis-jms-server/2.31.0-SNAPSHOT/artemis-jms-server-2.31.0-SNAPSHOT.jar
[JENKINS] Archiving <https://ci-builds.apache.org/job/ActiveMQ/job/ActiveMQ-Artemis-JDK11/ws/artemis-jms-server/target/artemis-jms-server-2.31.0-SNAPSHOT-sources.jar> to org.apache.activemq/artemis-jms-server/2.31.0-SNAPSHOT/artemis-jms-server-2.31.0-SNAPSHOT-sources.jar
[JENKINS] Archiving <https://ci-builds.apache.org/job/ActiveMQ/job/ActiveMQ-Artemis-JDK11/ws/artemis-cli/pom.xml> to org.apache.activemq/artemis-cli/2.31.0-SNAPSHOT/artemis-cli-2.31.0-SNAPSHOT.pom
[JENKINS] Archiving <https://ci-builds.apache.org/job/ActiveMQ/job/ActiveMQ-Artemis-JDK11/ws/artemis-jakarta-client-all/pom.xml> to org.apache.activemq/artemis-jakarta-client-all/2.31.0-SNAPSHOT/artemis-jakarta-client-all-2.31.0-SNAPSHOT.pom
[JENKINS] Archiving <https://ci-builds.apache.org/job/ActiveMQ/job/ActiveMQ-Artemis-JDK11/ws/artemis-core-client-all/pom.xml> to org.apache.activemq/artemis-core-client-all/2.31.0-SNAPSHOT/artemis-core-client-all-2.31.0-SNAPSHOT.pom
[JENKINS] Archiving <https://ci-builds.apache.org/job/ActiveMQ/job/ActiveMQ-Artemis-JDK11/ws/tests/pom.xml> to org.apache.activemq.tests/artemis-tests-pom/2.31.0-SNAPSHOT/artemis-tests-pom-2.31.0-SNAPSHOT.pom
[JENKINS] Archiving <https://ci-builds.apache.org/job/ActiveMQ/job/ActiveMQ-Artemis-JDK11/ws/artemis-protocols/artemis-openwire-protocol/pom.xml> to org.apache.activemq/artemis-openwire-protocol/2.31.0-SNAPSHOT/artemis-openwire-protocol-2.31.0-SNAPSHOT.pom
[JENKINS] Archiving <https://ci-builds.apache.org/job/ActiveMQ/job/ActiveMQ-Artemis-JDK11/ws/artemis-protocols/artemis-openwire-protocol/target/artemis-openwire-protocol-2.31.0-SNAPSHOT.jar> to org.apache.activemq/artemis-openwire-protocol/2.31.0-SNAPSHOT/artemis-openwire-protocol-2.31.0-SNAPSHOT.jar
[JENKINS] Archiving <https://ci-builds.apache.org/job/ActiveMQ/job/ActiveMQ-Artemis-JDK11/ws/artemis-protocols/artemis-openwire-protocol/target/artemis-openwire-protocol-2.31.0-SNAPSHOT-sources.jar> to org.apache.activemq/artemis-openwire-protocol/2.31.0-SNAPSHOT/artemis-openwire-protocol-2.31.0-SNAPSHOT-sources.jar
[JENKINS] Archiving <https://ci-builds.apache.org/job/ActiveMQ/job/ActiveMQ-Artemis-JDK11/ws/artemis-image/pom.xml> to org.apache.activemq/artemis-image/2.31.0-SNAPSHOT/artemis-image-2.31.0-SNAPSHOT.pom
[JENKINS] Archiving <https://ci-builds.apache.org/job/ActiveMQ/job/ActiveMQ-Artemis-JDK11/ws/artemis-distribution/pom.xml> to org.apache.activemq/apache-artemis/2.31.0-SNAPSHOT/apache-artemis-2.31.0-SNAPSHOT.pom
[JENKINS] Archiving <https://ci-builds.apache.org/job/ActiveMQ/job/ActiveMQ-Artemis-JDK11/ws/artemis-hawtio/artemis-console/pom.xml> to org.apache.activemq/artemis-console/2.31.0-SNAPSHOT/artemis-console-2.31.0-SNAPSHOT.pom
[JENKINS] Archiving <https://ci-builds.apache.org/job/ActiveMQ/job/ActiveMQ-Artemis-JDK11/ws/tests/artemis-test-support/pom.xml> to org.apache.activemq.tests/artemis-test-support/2.31.0-SNAPSHOT/artemis-test-support-2.31.0-SNAPSHOT.pom
[JENKINS] Archiving <https://ci-builds.apache.org/job/ActiveMQ/job/ActiveMQ-Artemis-JDK11/ws/artemis-selector/pom.xml> to org.apache.activemq/artemis-selector/2.31.0-SNAPSHOT/artemis-selector-2.31.0-SNAPSHOT.pom
[JENKINS] Archiving <https://ci-builds.apache.org/job/ActiveMQ/job/ActiveMQ-Artemis-JDK11/ws/artemis-selector/target/artemis-selector-2.31.0-SNAPSHOT.jar> to org.apache.activemq/artemis-selector/2.31.0-SNAPSHOT/artemis-selector-2.31.0-SNAPSHOT.jar
[JENKINS] Archiving <https://ci-builds.apache.org/job/ActiveMQ/job/ActiveMQ-Artemis-JDK11/ws/artemis-selector/target/artemis-selector-2.31.0-SNAPSHOT-sources.jar> to org.apache.activemq/artemis-selector/2.31.0-SNAPSHOT/artemis-selector-2.31.0-SNAPSHOT-sources.jar
[JENKINS] Archiving <https://ci-builds.apache.org/job/ActiveMQ/job/ActiveMQ-Artemis-JDK11/ws/artemis-jdbc-store/pom.xml> to org.apache.activemq/artemis-jdbc-store/2.31.0-SNAPSHOT/artemis-jdbc-store-2.31.0-SNAPSHOT.pom
[JENKINS] Archiving <https://ci-builds.apache.org/job/ActiveMQ/job/ActiveMQ-Artemis-JDK11/ws/artemis-jdbc-store/target/artemis-jdbc-store-2.31.0-SNAPSHOT.jar> to org.apache.activemq/artemis-jdbc-store/2.31.0-SNAPSHOT/artemis-jdbc-store-2.31.0-SNAPSHOT.jar
[JENKINS] Archiving <https://ci-builds.apache.org/job/ActiveMQ/job/ActiveMQ-Artemis-JDK11/ws/artemis-jdbc-store/target/artemis-jdbc-store-2.31.0-SNAPSHOT-sources.jar> to org.apache.activemq/artemis-jdbc-store/2.31.0-SNAPSHOT/artemis-jdbc-store-2.31.0-SNAPSHOT-sources.jar
[JENKINS] Archiving <https://ci-builds.apache.org/job/ActiveMQ/job/ActiveMQ-Artemis-JDK11/ws/integration/activemq-spring-integration/pom.xml> to org.apache.activemq/artemis-spring-integration/2.31.0-SNAPSHOT/artemis-spring-integration-2.31.0-SNAPSHOT.pom
[JENKINS] Archiving <https://ci-builds.apache.org/job/ActiveMQ/job/ActiveMQ-Artemis-JDK11/ws/artemis-quorum-ri/pom.xml> to org.apache.activemq/artemis-quorum-ri/2.31.0-SNAPSHOT/artemis-quorum-ri-2.31.0-SNAPSHOT.pom
[JENKINS] Archiving <https://ci-builds.apache.org/job/ActiveMQ/job/ActiveMQ-Artemis-JDK11/ws/artemis-web/pom.xml> to org.apache.activemq/artemis-web/2.31.0-SNAPSHOT/artemis-web-2.31.0-SNAPSHOT.pom
[JENKINS] Archiving <https://ci-builds.apache.org/job/ActiveMQ/job/ActiveMQ-Artemis-JDK11/ws/artemis-junit/artemis-junit-commons/pom.xml> to org.apache.activemq/artemis-junit-commons/2.31.0-SNAPSHOT/artemis-junit-commons-2.31.0-SNAPSHOT.pom
[JENKINS] Archiving <https://ci-builds.apache.org/job/ActiveMQ/job/ActiveMQ-Artemis-JDK11/ws/artemis-junit/artemis-junit-commons/target/artemis-junit-commons-2.31.0-SNAPSHOT.jar> to org.apache.activemq/artemis-junit-commons/2.31.0-SNAPSHOT/artemis-junit-commons-2.31.0-SNAPSHOT.jar
[JENKINS] Archiving <https://ci-builds.apache.org/job/ActiveMQ/job/ActiveMQ-Artemis-JDK11/ws/artemis-junit/artemis-junit-commons/target/artemis-junit-commons-2.31.0-SNAPSHOT-sources.jar> to org.apache.activemq/artemis-junit-commons/2.31.0-SNAPSHOT/artemis-junit-commons-2.31.0-SNAPSHOT-sources.jar
[JENKINS] Archiving <https://ci-builds.apache.org/job/ActiveMQ/job/ActiveMQ-Artemis-JDK11/ws/artemis-cdi-client/pom.xml> to org.apache.activemq/artemis-cdi-client/2.31.0-SNAPSHOT/artemis-cdi-client-2.31.0-SNAPSHOT.pom
[JENKINS] Archiving <https://ci-builds.apache.org/job/ActiveMQ/job/ActiveMQ-Artemis-JDK11/ws/artemis-cdi-client/target/artemis-cdi-client-2.31.0-SNAPSHOT.jar> to org.apache.activemq/artemis-cdi-client/2.31.0-SNAPSHOT/artemis-cdi-client-2.31.0-SNAPSHOT.jar
[JENKINS] Archiving <https://ci-builds.apache.org/job/ActiveMQ/job/ActiveMQ-Artemis-JDK11/ws/artemis-cdi-client/target/artemis-cdi-client-2.31.0-SNAPSHOT-sources.jar> to org.apache.activemq/artemis-cdi-client/2.31.0-SNAPSHOT/artemis-cdi-client-2.31.0-SNAPSHOT-sources.jar
[JENKINS] Archiving <https://ci-builds.apache.org/job/ActiveMQ/job/ActiveMQ-Artemis-JDK11/ws/tests/jms-tests/pom.xml> to org.apache.activemq.tests/jms-tests/2.31.0-SNAPSHOT/jms-tests-2.31.0-SNAPSHOT.pom
[JENKINS] Archiving <https://ci-builds.apache.org/job/ActiveMQ/job/ActiveMQ-Artemis-JDK11/ws/artemis-ra/pom.xml> to org.apache.activemq/artemis-ra/2.31.0-SNAPSHOT/artemis-ra-2.31.0-SNAPSHOT.pom
[JENKINS] Archiving <https://ci-builds.apache.org/job/ActiveMQ/job/ActiveMQ-Artemis-JDK11/ws/pom.xml> to org.apache.activemq/artemis-pom/2.31.0-SNAPSHOT/artemis-pom-2.31.0-SNAPSHOT.pom
[JENKINS] Archiving <https://ci-builds.apache.org/job/ActiveMQ/job/ActiveMQ-Artemis-JDK11/ws/tests/karaf-client-integration-tests/pom.xml> to org.apache.activemq.tests/karaf-client-integration-tests/2.31.0-SNAPSHOT/karaf-client-integration-tests-2.31.0-SNAPSHOT.pom
[JENKINS] Archiving <https://ci-builds.apache.org/job/ActiveMQ/job/ActiveMQ-Artemis-JDK11/ws/artemis-maven-plugin/pom.xml> to org.apache.activemq/artemis-maven-plugin/2.31.0-SNAPSHOT/artemis-maven-plugin-2.31.0-SNAPSHOT.pom
[JENKINS] Archiving <https://ci-builds.apache.org/job/ActiveMQ/job/ActiveMQ-Artemis-JDK11/ws/artemis-junit/artemis-junit-4/pom.xml> to org.apache.activemq/artemis-junit/2.31.0-SNAPSHOT/artemis-junit-2.31.0-SNAPSHOT.pom
[JENKINS] Archiving <https://ci-builds.apache.org/job/ActiveMQ/job/ActiveMQ-Artemis-JDK11/ws/artemis-junit/artemis-junit-4/target/artemis-junit-2.31.0-SNAPSHOT.jar> to org.apache.activemq/artemis-junit/2.31.0-SNAPSHOT/artemis-junit-2.31.0-SNAPSHOT.jar
[JENKINS] Archiving <https://ci-builds.apache.org/job/ActiveMQ/job/ActiveMQ-Artemis-JDK11/ws/artemis-junit/artemis-junit-4/target/artemis-junit-2.31.0-SNAPSHOT-sources.jar> to org.apache.activemq/artemis-junit/2.31.0-SNAPSHOT/artemis-junit-2.31.0-SNAPSHOT-sources.jar
[JENKINS] Archiving <https://ci-builds.apache.org/job/ActiveMQ/job/ActiveMQ-Artemis-JDK11/ws/artemis-service-extensions/pom.xml> to org.apache.activemq/artemis-service-extensions/2.31.0-SNAPSHOT/artemis-service-extensions-2.31.0-SNAPSHOT.pom
[JENKINS] Archiving <https://ci-builds.apache.org/job/ActiveMQ/job/ActiveMQ-Artemis-JDK11/ws/artemis-service-extensions/target/artemis-service-extensions-2.31.0-SNAPSHOT.jar> to org.apache.activemq/artemis-service-extensions/2.31.0-SNAPSHOT/artemis-service-extensions-2.31.0-SNAPSHOT.jar
[JENKINS] Archiving <https://ci-builds.apache.org/job/ActiveMQ/job/ActiveMQ-Artemis-JDK11/ws/artemis-service-extensions/target/artemis-service-extensions-2.31.0-SNAPSHOT-sources.jar> to org.apache.activemq/artemis-service-extensions/2.31.0-SNAPSHOT/artemis-service-extensions-2.31.0-SNAPSHOT-sources.jar
[JENKINS] Archiving <https://ci-builds.apache.org/job/ActiveMQ/job/ActiveMQ-Artemis-JDK11/ws/artemis-server-osgi/pom.xml> to org.apache.activemq/artemis-server-osgi/2.31.0-SNAPSHOT/artemis-server-osgi-2.31.0-SNAPSHOT.pom
[JENKINS] Archiving <https://ci-builds.apache.org/job/ActiveMQ/job/ActiveMQ-Artemis-JDK11/ws/artemis-junit/pom.xml> to org.apache.activemq/artemis-junit-parent/2.31.0-SNAPSHOT/artemis-junit-parent-2.31.0-SNAPSHOT.pom
[JENKINS] Archiving <https://ci-builds.apache.org/job/ActiveMQ/job/ActiveMQ-Artemis-JDK11/ws/tests/unit-tests/pom.xml> to org.apache.activemq.tests/unit-tests/2.31.0-SNAPSHOT/unit-tests-2.31.0-SNAPSHOT.pom
[JENKINS] Archiving <https://ci-builds.apache.org/job/ActiveMQ/job/ActiveMQ-Artemis-JDK11/ws/tests/leak-tests/pom.xml> to org.apache.activemq.tests/leak-tests/2.31.0-SNAPSHOT/leak-tests-2.31.0-SNAPSHOT.pom
[JENKINS] Archiving <https://ci-builds.apache.org/job/ActiveMQ/job/ActiveMQ-Artemis-JDK11/ws/artemis-protocols/artemis-stomp-protocol/pom.xml> to org.apache.activemq/artemis-stomp-protocol/2.31.0-SNAPSHOT/artemis-stomp-protocol-2.31.0-SNAPSHOT.pom
[JENKINS] Archiving <https://ci-builds.apache.org/job/ActiveMQ/job/ActiveMQ-Artemis-JDK11/ws/artemis-protocols/artemis-stomp-protocol/target/artemis-stomp-protocol-2.31.0-SNAPSHOT.jar> to org.apache.activemq/artemis-stomp-protocol/2.31.0-SNAPSHOT/artemis-stomp-protocol-2.31.0-SNAPSHOT.jar
[JENKINS] Archiving <https://ci-builds.apache.org/job/ActiveMQ/job/ActiveMQ-Artemis-JDK11/ws/artemis-protocols/artemis-stomp-protocol/target/artemis-stomp-protocol-2.31.0-SNAPSHOT-sources.jar> to org.apache.activemq/artemis-stomp-protocol/2.31.0-SNAPSHOT/artemis-stomp-protocol-2.31.0-SNAPSHOT-sources.jar
[JENKINS] Archiving <https://ci-builds.apache.org/job/ActiveMQ/job/ActiveMQ-Artemis-JDK11/ws/artemis-protocols/artemis-hornetq-protocol/pom.xml> to org.apache.activemq/artemis-hornetq-protocol/2.31.0-SNAPSHOT/artemis-hornetq-protocol-2.31.0-SNAPSHOT.pom
[JENKINS] Archiving <https://ci-builds.apache.org/job/ActiveMQ/job/ActiveMQ-Artemis-JDK11/ws/artemis-protocols/artemis-hornetq-protocol/target/artemis-hornetq-protocol-2.31.0-SNAPSHOT.jar> to org.apache.activemq/artemis-hornetq-protocol/2.31.0-SNAPSHOT/artemis-hornetq-protocol-2.31.0-SNAPSHOT.jar
[JENKINS] Archiving <https://ci-builds.apache.org/job/ActiveMQ/job/ActiveMQ-Artemis-JDK11/ws/artemis-protocols/artemis-hornetq-protocol/target/artemis-hornetq-protocol-2.31.0-SNAPSHOT-sources.jar> to org.apache.activemq/artemis-hornetq-protocol/2.31.0-SNAPSHOT/artemis-hornetq-protocol-2.31.0-SNAPSHOT-sources.jar
[JENKINS] Archiving <https://ci-builds.apache.org/job/ActiveMQ/job/ActiveMQ-Artemis-JDK11/ws/artemis-core-client-osgi/pom.xml> to org.apache.activemq/artemis-core-client-osgi/2.31.0-SNAPSHOT/artemis-core-client-osgi-2.31.0-SNAPSHOT.pom
[JENKINS] Archiving <https://ci-builds.apache.org/job/ActiveMQ/job/ActiveMQ-Artemis-JDK11/ws/tests/performance-tests/pom.xml> to org.apache.activemq.tests/performance-tests/2.31.0-SNAPSHOT/performance-tests-2.31.0-SNAPSHOT.pom
[JENKINS] Archiving <https://ci-builds.apache.org/job/ActiveMQ/job/ActiveMQ-Artemis-JDK11/ws/artemis-features/pom.xml> to org.apache.activemq/artemis-features/2.31.0-SNAPSHOT/artemis-features-2.31.0-SNAPSHOT.pom
[JENKINS] Archiving <https://ci-builds.apache.org/job/ActiveMQ/job/ActiveMQ-Artemis-JDK11/ws/artemis-commons/dependency-reduced-pom.xml> to org.apache.activemq/artemis-commons/2.31.0-SNAPSHOT/artemis-commons-2.31.0-SNAPSHOT.pom
[JENKINS] Archiving <https://ci-builds.apache.org/job/ActiveMQ/job/ActiveMQ-Artemis-JDK11/ws/artemis-commons/target/artemis-commons-2.31.0-SNAPSHOT.jar> to org.apache.activemq/artemis-commons/2.31.0-SNAPSHOT/artemis-commons-2.31.0-SNAPSHOT.jar
[JENKINS] Archiving <https://ci-builds.apache.org/job/ActiveMQ/job/ActiveMQ-Artemis-JDK11/ws/artemis-commons/target/artemis-commons-2.31.0-SNAPSHOT-sources.jar> to org.apache.activemq/artemis-commons/2.31.0-SNAPSHOT/artemis-commons-2.31.0-SNAPSHOT-sources.jar
[JENKINS] Archiving <https://ci-builds.apache.org/job/ActiveMQ/job/ActiveMQ-Artemis-JDK11/ws/artemis-journal/pom.xml> to org.apache.activemq/artemis-journal/2.31.0-SNAPSHOT/artemis-journal-2.31.0-SNAPSHOT.pom
[JENKINS] Archiving <https://ci-builds.apache.org/job/ActiveMQ/job/ActiveMQ-Artemis-JDK11/ws/artemis-journal/target/artemis-journal-2.31.0-SNAPSHOT.jar> to org.apache.activemq/artemis-journal/2.31.0-SNAPSHOT/artemis-journal-2.31.0-SNAPSHOT.jar
[JENKINS] Archiving <https://ci-builds.apache.org/job/ActiveMQ/job/ActiveMQ-Artemis-JDK11/ws/artemis-journal/target/artemis-journal-2.31.0-SNAPSHOT-sources.jar> to org.apache.activemq/artemis-journal/2.31.0-SNAPSHOT/artemis-journal-2.31.0-SNAPSHOT-sources.jar
[JENKINS] Archiving <https://ci-builds.apache.org/job/ActiveMQ/job/ActiveMQ-Artemis-JDK11/ws/tests/soak-tests/pom.xml> to org.apache.activemq.tests/soak-tests/2.31.0-SNAPSHOT/soak-tests-2.31.0-SNAPSHOT.pom
[JENKINS] Archiving <https://ci-builds.apache.org/job/ActiveMQ/job/ActiveMQ-Artemis-JDK11/ws/artemis-core-client/pom.xml> to org.apache.activemq/artemis-core-client/2.31.0-SNAPSHOT/artemis-core-client-2.31.0-SNAPSHOT.pom
[JENKINS] Archiving <https://ci-builds.apache.org/job/ActiveMQ/job/ActiveMQ-Artemis-JDK11/ws/artemis-core-client/target/artemis-core-client-2.31.0-SNAPSHOT.jar> to org.apache.activemq/artemis-core-client/2.31.0-SNAPSHOT/artemis-core-client-2.31.0-SNAPSHOT.jar
[JENKINS] Archiving <https://ci-builds.apache.org/job/ActiveMQ/job/ActiveMQ-Artemis-JDK11/ws/artemis-core-client/target/artemis-core-client-2.31.0-SNAPSHOT-sources.jar> to org.apache.activemq/artemis-core-client/2.31.0-SNAPSHOT/artemis-core-client-2.31.0-SNAPSHOT-sources.jar
[JENKINS] Archiving <https://ci-builds.apache.org/job/ActiveMQ/job/ActiveMQ-Artemis-JDK11/ws/tests/integration-tests-isolated/pom.xml> to org.apache.activemq.tests/integration-tests-isolated/2.31.0-SNAPSHOT/integration-tests-isolated-2.31.0-SNAPSHOT.pom
[JENKINS] Archiving <https://ci-builds.apache.org/job/ActiveMQ/job/ActiveMQ-Artemis-JDK11/ws/artemis-jakarta-ra/pom.xml> to org.apache.activemq/artemis-jakarta-ra/2.31.0-SNAPSHOT/artemis-jakarta-ra-2.31.0-SNAPSHOT.pom
[JENKINS] Archiving <https://ci-builds.apache.org/job/ActiveMQ/job/ActiveMQ-Artemis-JDK11/ws/tests/timing-tests/pom.xml> to org.apache.activemq.tests/timing-tests/2.31.0-SNAPSHOT/timing-tests-2.31.0-SNAPSHOT.pom
[JENKINS] Archiving <https://ci-builds.apache.org/job/ActiveMQ/job/ActiveMQ-Artemis-JDK11/ws/artemis-junit/artemis-junit-5/pom.xml> to org.apache.activemq/artemis-junit-5/2.31.0-SNAPSHOT/artemis-junit-5-2.31.0-SNAPSHOT.pom
[JENKINS] Archiving <https://ci-builds.apache.org/job/ActiveMQ/job/ActiveMQ-Artemis-JDK11/ws/artemis-jms-client-all/pom.xml> to org.apache.activemq/artemis-jms-client-all/2.31.0-SNAPSHOT/artemis-jms-client-all-2.31.0-SNAPSHOT.pom
[JENKINS] Archiving <https://ci-builds.apache.org/job/ActiveMQ/job/ActiveMQ-Artemis-JDK11/ws/artemis-protocols/pom.xml> to org.apache.activemq/artemis-protocols/2.31.0-SNAPSHOT/artemis-protocols-2.31.0-SNAPSHOT.pom
[JENKINS] Archiving <https://ci-builds.apache.org/job/ActiveMQ/job/ActiveMQ-Artemis-JDK11/ws/tests/karaf-server-integration-tests/pom.xml> to org.apache.activemq.tests/karaf-server-integration-tests/2.31.0-SNAPSHOT/karaf-server-integration-tests-2.31.0-SNAPSHOT.pom
[JENKINS] Archiving <https://ci-builds.apache.org/job/ActiveMQ/job/ActiveMQ-Artemis-JDK11/ws/artemis-hawtio/artemis-plugin/pom.xml> to org.apache.activemq/artemis-plugin/2.31.0-SNAPSHOT/artemis-plugin-2.31.0-SNAPSHOT.pom
[JENKINS] Archiving <https://ci-builds.apache.org/job/ActiveMQ/job/ActiveMQ-Artemis-JDK11/ws/artemis-quorum-api/pom.xml> to org.apache.activemq/artemis-quorum-api/2.31.0-SNAPSHOT/artemis-quorum-api-2.31.0-SNAPSHOT.pom
[JENKINS] Archiving <https://ci-builds.apache.org/job/ActiveMQ/job/ActiveMQ-Artemis-JDK11/ws/artemis-quorum-api/target/artemis-quorum-api-2.31.0-SNAPSHOT.jar> to org.apache.activemq/artemis-quorum-api/2.31.0-SNAPSHOT/artemis-quorum-api-2.31.0-SNAPSHOT.jar
[JENKINS] Archiving <https://ci-builds.apache.org/job/ActiveMQ/job/ActiveMQ-Artemis-JDK11/ws/artemis-quorum-api/target/artemis-quorum-api-2.31.0-SNAPSHOT-sources.jar> to org.apache.activemq/artemis-quorum-api/2.31.0-SNAPSHOT/artemis-quorum-api-2.31.0-SNAPSHOT-sources.jar
[JENKINS] Archiving <https://ci-builds.apache.org/job/ActiveMQ/job/ActiveMQ-Artemis-JDK11/ws/artemis-dto/pom.xml> to org.apache.activemq/artemis-dto/2.31.0-SNAPSHOT/artemis-dto-2.31.0-SNAPSHOT.pom
[JENKINS] Archiving <https://ci-builds.apache.org/job/ActiveMQ/job/ActiveMQ-Artemis-JDK11/ws/artemis-dto/target/artemis-dto-2.31.0-SNAPSHOT.jar> to org.apache.activemq/artemis-dto/2.31.0-SNAPSHOT/artemis-dto-2.31.0-SNAPSHOT.jar
[JENKINS] Archiving <https://ci-builds.apache.org/job/ActiveMQ/job/ActiveMQ-Artemis-JDK11/ws/artemis-dto/target/artemis-dto-2.31.0-SNAPSHOT-sources.jar> to org.apache.activemq/artemis-dto/2.31.0-SNAPSHOT/artemis-dto-2.31.0-SNAPSHOT-sources.jar
[JENKINS] Archiving <https://ci-builds.apache.org/job/ActiveMQ/job/ActiveMQ-Artemis-JDK11/ws/artemis-unit-test-support/pom.xml> to org.apache.activemq/artemis-unit-test-support/2.31.0-SNAPSHOT/artemis-unit-test-support-2.31.0-SNAPSHOT.pom
[JENKINS] Archiving <https://ci-builds.apache.org/job/ActiveMQ/job/ActiveMQ-Artemis-JDK11/ws/artemis-unit-test-support/target/artemis-unit-test-support-2.31.0-SNAPSHOT.jar> to org.apache.activemq/artemis-unit-test-support/2.31.0-SNAPSHOT/artemis-unit-test-support-2.31.0-SNAPSHOT.jar
[JENKINS] Archiving <https://ci-builds.apache.org/job/ActiveMQ/job/ActiveMQ-Artemis-JDK11/ws/artemis-unit-test-support/target/artemis-unit-test-support-2.31.0-SNAPSHOT-sources.jar> to org.apache.activemq/artemis-unit-test-support/2.31.0-SNAPSHOT/artemis-unit-test-support-2.31.0-SNAPSHOT-sources.jar
[JENKINS] Archiving <https://ci-builds.apache.org/job/ActiveMQ/job/ActiveMQ-Artemis-JDK11/ws/artemis-jakarta-service-extensions/pom.xml> to org.apache.activemq/artemis-jakarta-service-extensions/2.31.0-SNAPSHOT/artemis-jakarta-service-extensions-2.31.0-SNAPSHOT.pom
[JENKINS] Archiving <https://ci-builds.apache.org/job/ActiveMQ/job/ActiveMQ-Artemis-JDK11/ws/artemis-protocols/artemis-hqclient-protocol/pom.xml> to org.apache.activemq/artemis-hqclient-protocol/2.31.0-SNAPSHOT/artemis-hqclient-protocol-2.31.0-SNAPSHOT.pom
[JENKINS] Archiving <https://ci-builds.apache.org/job/ActiveMQ/job/ActiveMQ-Artemis-JDK11/ws/artemis-protocols/artemis-hqclient-protocol/target/artemis-hqclient-protocol-2.31.0-SNAPSHOT.jar> to org.apache.activemq/artemis-hqclient-protocol/2.31.0-SNAPSHOT/artemis-hqclient-protocol-2.31.0-SNAPSHOT.jar
[JENKINS] Archiving <https://ci-builds.apache.org/job/ActiveMQ/job/ActiveMQ-Artemis-JDK11/ws/artemis-protocols/artemis-hqclient-protocol/target/artemis-hqclient-protocol-2.31.0-SNAPSHOT-sources.jar> to org.apache.activemq/artemis-hqclient-protocol/2.31.0-SNAPSHOT/artemis-hqclient-protocol-2.31.0-SNAPSHOT-sources.jar
[JENKINS] Archiving <https://ci-builds.apache.org/job/ActiveMQ/job/ActiveMQ-Artemis-JDK11/ws/artemis-jms-client-osgi/pom.xml> to org.apache.activemq/artemis-jms-client-osgi/2.31.0-SNAPSHOT/artemis-jms-client-osgi-2.31.0-SNAPSHOT.pom
[JENKINS] Archiving <https://ci-builds.apache.org/job/ActiveMQ/job/ActiveMQ-Artemis-JDK11/ws/tests/integration-tests/pom.xml> to org.apache.activemq.tests/integration-tests/2.31.0-SNAPSHOT/integration-tests-2.31.0-SNAPSHOT.pom
[JENKINS] Archiving <https://ci-builds.apache.org/job/ActiveMQ/job/ActiveMQ-Artemis-JDK11/ws/artemis-boot/pom.xml> to org.apache.activemq/artemis-boot/2.31.0-SNAPSHOT/artemis-boot-2.31.0-SNAPSHOT.pom
[JENKINS] Archiving <https://ci-builds.apache.org/job/ActiveMQ/job/ActiveMQ-Artemis-JDK11/ws/artemis-boot/target/artemis-boot-2.31.0-SNAPSHOT.jar> to org.apache.activemq/artemis-boot/2.31.0-SNAPSHOT/artemis-boot-2.31.0-SNAPSHOT.jar
[JENKINS] Archiving <https://ci-builds.apache.org/job/ActiveMQ/job/ActiveMQ-Artemis-JDK11/ws/artemis-boot/target/artemis-boot-2.31.0-SNAPSHOT-sources.jar> to org.apache.activemq/artemis-boot/2.31.0-SNAPSHOT/artemis-boot-2.31.0-SNAPSHOT-sources.jar
[JENKINS] Archiving <https://ci-builds.apache.org/job/ActiveMQ/job/ActiveMQ-Artemis-JDK11/ws/artemis-jakarta-client/pom.xml> to org.apache.activemq/artemis-jakarta-client/2.31.0-SNAPSHOT/artemis-jakarta-client-2.31.0-SNAPSHOT.pom
[JENKINS] Archiving <https://ci-builds.apache.org/job/ActiveMQ/job/ActiveMQ-Artemis-JDK11/ws/artemis-protocols/artemis-amqp-protocol/pom.xml> to org.apache.activemq/artemis-amqp-protocol/2.31.0-SNAPSHOT/artemis-amqp-protocol-2.31.0-SNAPSHOT.pom
[JENKINS] Archiving <https://ci-builds.apache.org/job/ActiveMQ/job/ActiveMQ-Artemis-JDK11/ws/artemis-protocols/artemis-amqp-protocol/target/artemis-amqp-protocol-2.31.0-SNAPSHOT.jar> to org.apache.activemq/artemis-amqp-protocol/2.31.0-SNAPSHOT/artemis-amqp-protocol-2.31.0-SNAPSHOT.jar
[JENKINS] Archiving <https://ci-builds.apache.org/job/ActiveMQ/job/ActiveMQ-Artemis-JDK11/ws/artemis-protocols/artemis-amqp-protocol/target/artemis-amqp-protocol-2.31.0-SNAPSHOT-sources.jar> to org.apache.activemq/artemis-amqp-protocol/2.31.0-SNAPSHOT/artemis-amqp-protocol-2.31.0-SNAPSHOT-sources.jar
[JENKINS] Archiving <https://ci-builds.apache.org/job/ActiveMQ/job/ActiveMQ-Artemis-JDK11/ws/artemis-jakarta-server/pom.xml> to org.apache.activemq/artemis-jakarta-server/2.31.0-SNAPSHOT/artemis-jakarta-server-2.31.0-SNAPSHOT.pom
[JENKINS] Archiving <https://ci-builds.apache.org/job/ActiveMQ/job/ActiveMQ-Artemis-JDK11/ws/artemis-protocols/artemis-mqtt-protocol/pom.xml> to org.apache.activemq/artemis-mqtt-protocol/2.31.0-SNAPSHOT/artemis-mqtt-protocol-2.31.0-SNAPSHOT.pom
[JENKINS] Archiving <https://ci-builds.apache.org/job/ActiveMQ/job/ActiveMQ-Artemis-JDK11/ws/artemis-protocols/artemis-mqtt-protocol/target/artemis-mqtt-protocol-2.31.0-SNAPSHOT.jar> to org.apache.activemq/artemis-mqtt-protocol/2.31.0-SNAPSHOT/artemis-mqtt-protocol-2.31.0-SNAPSHOT.jar
[JENKINS] Archiving <https://ci-builds.apache.org/job/ActiveMQ/job/ActiveMQ-Artemis-JDK11/ws/artemis-protocols/artemis-mqtt-protocol/target/artemis-mqtt-protocol-2.31.0-SNAPSHOT-sources.jar> to org.apache.activemq/artemis-mqtt-protocol/2.31.0-SNAPSHOT/artemis-mqtt-protocol-2.31.0-SNAPSHOT-sources.jar
[JENKINS] Archiving <https://ci-builds.apache.org/job/ActiveMQ/job/ActiveMQ-Artemis-JDK11/ws/tests/e2e-tests/pom.xml> to org.apache.activemq.tests/e2e-tests/2.31.0-SNAPSHOT/e2e-tests-2.31.0-SNAPSHOT.pom
[JENKINS] Archiving <https://ci-builds.apache.org/job/ActiveMQ/job/ActiveMQ-Artemis-JDK11/ws/artemis-hawtio/pom.xml> to org.apache.activemq/artemis-hawtio-pom/2.31.0-SNAPSHOT/artemis-hawtio-pom-2.31.0-SNAPSHOT.pom
[JENKINS] Archiving <https://ci-builds.apache.org/job/ActiveMQ/job/ActiveMQ-Artemis-JDK11/ws/tests/stress-tests/pom.xml> to org.apache.activemq.tests/stress-tests/2.31.0-SNAPSHOT/stress-tests-2.31.0-SNAPSHOT.pom
channel stopped