You are viewing a plain text version of this content. The canonical link for it is here.
Posted to builds@solr.apache.org by Policeman Jenkins Server <je...@thetaphi.de> on 2025/08/22 23:16:04 UTC

[JENKINS-EA] Solr-main-Linux (64bit/hotspot/jdk-26-ea+10) - Build # 28052 - Still Unstable!

Build: https://jenkins.thetaphi.de/job/Solr-main-Linux/28052/
Java: 64bit/hotspot/jdk-26-ea+10 -XX:+UseCompressedOops -XX:+UseSerialGC

1 tests failed.
FAILED:  org.apache.solr.handler.component.DistributedDebugComponentTest.testTolerantSearch

Error Message:
org.apache.solr.client.solrj.SolrClient$RemoteSolrException: Error from server at https://127.0.0.1:40673/solr: org.apache.solr.client.solrj.SolrServerException: Connection refused

Stack Trace:
org.apache.solr.client.solrj.SolrClient$RemoteSolrException: Error from server at https://127.0.0.1:40673/solr: org.apache.solr.client.solrj.SolrServerException: Connection refused
	at __randomizedtesting.SeedInfo.seed([7FEAA3709BA2C56:C10761E9CA78F103]:0)
	at app//org.apache.solr.client.solrj.impl.HttpSolrClient.executeMethod(HttpSolrClient.java:708)
	at app//org.apache.solr.client.solrj.impl.HttpSolrClient.request(HttpSolrClient.java:250)
	at app//org.apache.solr.client.solrj.impl.HttpSolrClient.request(HttpSolrClient.java:229)
	at app//org.apache.solr.client.solrj.SolrRequest.process(SolrRequest.java:285)
	at app//org.apache.solr.client.solrj.SolrClient.query(SolrClient.java:926)
	at app//org.apache.solr.client.solrj.SolrClient.query(SolrClient.java:939)
	at app//org.apache.solr.handler.component.DistributedDebugComponentTest.testTolerantSearch(DistributedDebugComponentTest.java:424)
	at java.base@26-ea/jdk.internal.reflect.DirectMethodHandleAccessor.invoke(DirectMethodHandleAccessor.java:104)
	at java.base@26-ea/java.lang.reflect.Method.invoke(Method.java:565)
	at app//com.carrotsearch.randomizedtesting.RandomizedRunner.invoke(RandomizedRunner.java:1758)
	at app//com.carrotsearch.randomizedtesting.RandomizedRunner$8.evaluate(RandomizedRunner.java:946)
	at app//com.carrotsearch.randomizedtesting.RandomizedRunner$9.evaluate(RandomizedRunner.java:982)
	at app//com.carrotsearch.randomizedtesting.RandomizedRunner$10.evaluate(RandomizedRunner.java:996)
	at app//com.carrotsearch.randomizedtesting.rules.SystemPropertiesRestoreRule$1.evaluate(SystemPropertiesRestoreRule.java:80)
	at app//org.junit.rules.RunRules.evaluate(RunRules.java:20)
	at app//org.apache.lucene.tests.util.TestRuleSetupTeardownChained$1.evaluate(TestRuleSetupTeardownChained.java:48)
	at app//org.apache.lucene.tests.util.AbstractBeforeAfterRule$1.evaluate(AbstractBeforeAfterRule.java:43)
	at app//org.apache.lucene.tests.util.TestRuleThreadAndTestName$1.evaluate(TestRuleThreadAndTestName.java:45)
	at app//org.apache.lucene.tests.util.TestRuleIgnoreAfterMaxFailures$1.evaluate(TestRuleIgnoreAfterMaxFailures.java:60)
	at app//org.apache.lucene.tests.util.TestRuleMarkFailure$1.evaluate(TestRuleMarkFailure.java:44)
	at app//org.junit.rules.RunRules.evaluate(RunRules.java:20)
	at app//com.carrotsearch.randomizedtesting.rules.StatementAdapter.evaluate(StatementAdapter.java:36)
	at app//com.carrotsearch.randomizedtesting.ThreadLeakControl$StatementRunner.run(ThreadLeakControl.java:390)
	at app//com.carrotsearch.randomizedtesting.ThreadLeakControl.forkTimeoutingTask(ThreadLeakControl.java:843)
	at app//com.carrotsearch.randomizedtesting.ThreadLeakControl$3.evaluate(ThreadLeakControl.java:490)
	at app//com.carrotsearch.randomizedtesting.RandomizedRunner.runSingleTest(RandomizedRunner.java:955)
	at app//com.carrotsearch.randomizedtesting.RandomizedRunner$5.evaluate(RandomizedRunner.java:840)
	at app//com.carrotsearch.randomizedtesting.RandomizedRunner$6.evaluate(RandomizedRunner.java:891)
	at app//com.carrotsearch.randomizedtesting.RandomizedRunner$7.evaluate(RandomizedRunner.java:902)
	at app//org.junit.rules.ExternalResource$1.evaluate(ExternalResource.java:54)
	at app//com.carrotsearch.randomizedtesting.rules.StatementAdapter.evaluate(StatementAdapter.java:36)
	at app//com.carrotsearch.randomizedtesting.rules.StatementAdapter.evaluate(StatementAdapter.java:36)
	at app//org.apache.lucene.tests.util.AbstractBeforeAfterRule$1.evaluate(AbstractBeforeAfterRule.java:43)
	at app//com.carrotsearch.randomizedtesting.rules.SystemPropertiesRestoreRule$1.evaluate(SystemPropertiesRestoreRule.java:80)
	at app//org.junit.rules.RunRules.evaluate(RunRules.java:20)
	at app//org.apache.lucene.tests.util.AbstractBeforeAfterRule$1.evaluate(AbstractBeforeAfterRule.java:43)
	at app//com.carrotsearch.randomizedtesting.rules.StatementAdapter.evaluate(StatementAdapter.java:36)
	at app//org.apache.lucene.tests.util.TestRuleStoreClassName$1.evaluate(TestRuleStoreClassName.java:38)
	at app//com.carrotsearch.randomizedtesting.rules.NoShadowingOrOverridesOnMethodsRule$1.evaluate(NoShadowingOrOverridesOnMethodsRule.java:40)
	at app//com.carrotsearch.randomizedtesting.rules.NoShadowingOrOverridesOnMethodsRule$1.evaluate(NoShadowingOrOverridesOnMethodsRule.java:40)
	at app//com.carrotsearch.randomizedtesting.rules.StatementAdapter.evaluate(StatementAdapter.java:36)
	at app//com.carrotsearch.randomizedtesting.rules.StatementAdapter.evaluate(StatementAdapter.java:36)
	at app//org.apache.lucene.tests.util.TestRuleAssertionsRequired$1.evaluate(TestRuleAssertionsRequired.java:53)
	at app//org.apache.lucene.tests.util.AbstractBeforeAfterRule$1.evaluate(AbstractBeforeAfterRule.java:43)
	at app//org.apache.lucene.tests.util.TestRuleMarkFailure$1.evaluate(TestRuleMarkFailure.java:44)
	at app//org.apache.lucene.tests.util.TestRuleIgnoreAfterMaxFailures$1.evaluate(TestRuleIgnoreAfterMaxFailures.java:60)
	at app//org.apache.lucene.tests.util.TestRuleIgnoreTestSuites$1.evaluate(TestRuleIgnoreTestSuites.java:47)
	at app//org.junit.rules.RunRules.evaluate(RunRules.java:20)
	at app//com.carrotsearch.randomizedtesting.rules.StatementAdapter.evaluate(StatementAdapter.java:36)
	at app//com.carrotsearch.randomizedtesting.ThreadLeakControl$StatementRunner.run(ThreadLeakControl.java:390)
	at app//com.carrotsearch.randomizedtesting.ThreadLeakControl.lambda$forkTimeoutingTask$0(ThreadLeakControl.java:850)
	at java.base@26-ea/java.lang.Thread.run(Thread.java:1474)

[JENKINS] Solr-main-Linux (64bit/hotspot/jdk-23.0.2) - Build # 28059 - Still Unstable!

Posted by Policeman Jenkins Server <je...@thetaphi.de>.
Build: https://jenkins.thetaphi.de/job/Solr-main-Linux/28059/
Java: 64bit/hotspot/jdk-23.0.2 -XX:+UseCompressedOops -XX:+UseG1GC

4 tests failed.
FAILED:  org.apache.solr.cloud.TestDistribDocBasedVersion.testPullReplica

Error Message:
com.carrotsearch.randomizedtesting.UncaughtExceptionError: Captured an uncaught exception in thread: Thread[id=227, name=updateExecutor-19-thread-1, state=RUNNABLE, group=TGRP-TestDistribDocBasedVersion]

Stack Trace:
com.carrotsearch.randomizedtesting.UncaughtExceptionError: Captured an uncaught exception in thread: Thread[id=227, name=updateExecutor-19-thread-1, state=RUNNABLE, group=TGRP-TestDistribDocBasedVersion]
	at __randomizedtesting.SeedInfo.seed([5D31866F1DA2F53:4D6F8FA85408062A]:0)
Caused by: org.apache.solr.common.SolrException: java.util.concurrent.ExecutionException: org.apache.solr.common.cloud.ZooKeeperException: 
	at __randomizedtesting.SeedInfo.seed([5D31866F1DA2F53]:0)
	at app//org.apache.solr.update.DefaultSolrCoreState$2.run(DefaultSolrCoreState.java:356)
	at app//com.codahale.metrics.InstrumentedExecutorService$InstrumentedRunnable.run(InstrumentedExecutorService.java:212)
	at app//org.apache.solr.common.util.ExecutorUtil$MDCAwareThreadPoolExecutor.lambda$execute$0(ExecutorUtil.java:381)
	at java.base@23.0.2/java.util.concurrent.ThreadPoolExecutor.runWorker(ThreadPoolExecutor.java:1144)
	at java.base@23.0.2/java.util.concurrent.ThreadPoolExecutor$Worker.run(ThreadPoolExecutor.java:642)
	at java.base@23.0.2/java.lang.Thread.run(Thread.java:1575)
Caused by: java.util.concurrent.ExecutionException: org.apache.solr.common.cloud.ZooKeeperException: 
	at java.base/java.util.concurrent.FutureTask.report(FutureTask.java:122)
	at java.base/java.util.concurrent.FutureTask.get(FutureTask.java:191)
	at org.apache.solr.update.DefaultSolrCoreState$2.run(DefaultSolrCoreState.java:351)
	... 5 more
Caused by: org.apache.solr.common.cloud.ZooKeeperException: 
	at app//org.apache.solr.cloud.RecoveryStrategy.run(RecoveryStrategy.java:330)
	at app//com.codahale.metrics.InstrumentedExecutorService$InstrumentedRunnable.run(InstrumentedExecutorService.java:212)
	at java.base@23.0.2/java.util.concurrent.Executors$RunnableAdapter.call(Executors.java:572)
	at java.base@23.0.2/java.util.concurrent.FutureTask.run(FutureTask.java:317)
	... 4 more
Caused by: org.apache.solr.common.SolrException: SolrCore not found:collection1_shard1_replica_p5 in [control_collection_shard1_replica_n1]
	at app//org.apache.solr.cloud.ReplicateFromLeader.startReplication(ReplicateFromLeader.java:75)
	at app//org.apache.solr.cloud.ZkController.startReplicationFromLeader(ZkController.java:1519)
	at app//org.apache.solr.cloud.RecoveryStrategy.doReplicateOnlyRecovery(RecoveryStrategy.java:431)
	at app//org.apache.solr.cloud.RecoveryStrategy.doRecovery(RecoveryStrategy.java:349)
	at app//org.apache.solr.cloud.RecoveryStrategy.run(RecoveryStrategy.java:323)
	... 7 more


FAILED:  org.apache.solr.cloud.TestDistribDocBasedVersion.testPullReplica

Error Message:
com.carrotsearch.randomizedtesting.UncaughtExceptionError: Captured an uncaught exception in thread: Thread[id=5281, name=updateExecutor-2796-thread-1, state=RUNNABLE, group=TGRP-TestDistribDocBasedVersion]

Stack Trace:
com.carrotsearch.randomizedtesting.UncaughtExceptionError: Captured an uncaught exception in thread: Thread[id=5281, name=updateExecutor-2796-thread-1, state=RUNNABLE, group=TGRP-TestDistribDocBasedVersion]
	at __randomizedtesting.SeedInfo.seed([5D31866F1DA2F53:4D6F8FA85408062A]:0)
Caused by: org.apache.solr.common.SolrException: java.util.concurrent.ExecutionException: org.apache.solr.common.cloud.ZooKeeperException: 
	at __randomizedtesting.SeedInfo.seed([5D31866F1DA2F53]:0)
	at app//org.apache.solr.update.DefaultSolrCoreState$2.run(DefaultSolrCoreState.java:356)
	at app//com.codahale.metrics.InstrumentedExecutorService$InstrumentedRunnable.run(InstrumentedExecutorService.java:212)
	at app//org.apache.solr.common.util.ExecutorUtil$MDCAwareThreadPoolExecutor.lambda$execute$0(ExecutorUtil.java:381)
	at java.base@23.0.2/java.util.concurrent.ThreadPoolExecutor.runWorker(ThreadPoolExecutor.java:1144)
	at java.base@23.0.2/java.util.concurrent.ThreadPoolExecutor$Worker.run(ThreadPoolExecutor.java:642)
	at java.base@23.0.2/java.lang.Thread.run(Thread.java:1575)
Caused by: java.util.concurrent.ExecutionException: org.apache.solr.common.cloud.ZooKeeperException: 
	at java.base/java.util.concurrent.FutureTask.report(FutureTask.java:122)
	at java.base/java.util.concurrent.FutureTask.get(FutureTask.java:191)
	at org.apache.solr.update.DefaultSolrCoreState$2.run(DefaultSolrCoreState.java:351)
	... 5 more
Caused by: org.apache.solr.common.cloud.ZooKeeperException: 
	at app//org.apache.solr.cloud.RecoveryStrategy.run(RecoveryStrategy.java:330)
	at app//com.codahale.metrics.InstrumentedExecutorService$InstrumentedRunnable.run(InstrumentedExecutorService.java:212)
	at java.base@23.0.2/java.util.concurrent.Executors$RunnableAdapter.call(Executors.java:572)
	at java.base@23.0.2/java.util.concurrent.FutureTask.run(FutureTask.java:317)
	... 4 more
Caused by: org.apache.solr.common.SolrException: SolrCore not found:collection1_shard1_replica_p5 in [control_collection_shard1_replica_n1]
	at app//org.apache.solr.cloud.ReplicateFromLeader.startReplication(ReplicateFromLeader.java:75)
	at app//org.apache.solr.cloud.ZkController.startReplicationFromLeader(ZkController.java:1519)
	at app//org.apache.solr.cloud.RecoveryStrategy.doReplicateOnlyRecovery(RecoveryStrategy.java:431)
	at app//org.apache.solr.cloud.RecoveryStrategy.doRecovery(RecoveryStrategy.java:349)
	at app//org.apache.solr.cloud.RecoveryStrategy.run(RecoveryStrategy.java:323)
	... 7 more


FAILED:  org.apache.solr.cloud.TestDistribDocBasedVersion.testPullReplica

Error Message:
com.carrotsearch.randomizedtesting.UncaughtExceptionError: Captured an uncaught exception in thread: Thread[id=225, name=updateExecutor-19-thread-1, state=RUNNABLE, group=TGRP-TestDistribDocBasedVersion]

Stack Trace:
com.carrotsearch.randomizedtesting.UncaughtExceptionError: Captured an uncaught exception in thread: Thread[id=225, name=updateExecutor-19-thread-1, state=RUNNABLE, group=TGRP-TestDistribDocBasedVersion]
	at __randomizedtesting.SeedInfo.seed([5D31866F1DA2F53:4D6F8FA85408062A]:0)
Caused by: org.apache.solr.common.SolrException: java.util.concurrent.ExecutionException: org.apache.solr.common.cloud.ZooKeeperException: 
	at __randomizedtesting.SeedInfo.seed([5D31866F1DA2F53]:0)
	at app//org.apache.solr.update.DefaultSolrCoreState$2.run(DefaultSolrCoreState.java:356)
	at app//com.codahale.metrics.InstrumentedExecutorService$InstrumentedRunnable.run(InstrumentedExecutorService.java:212)
	at app//org.apache.solr.common.util.ExecutorUtil$MDCAwareThreadPoolExecutor.lambda$execute$0(ExecutorUtil.java:381)
	at java.base@23.0.2/java.util.concurrent.ThreadPoolExecutor.runWorker(ThreadPoolExecutor.java:1144)
	at java.base@23.0.2/java.util.concurrent.ThreadPoolExecutor$Worker.run(ThreadPoolExecutor.java:642)
	at java.base@23.0.2/java.lang.Thread.run(Thread.java:1575)
Caused by: java.util.concurrent.ExecutionException: org.apache.solr.common.cloud.ZooKeeperException: 
	at java.base/java.util.concurrent.FutureTask.report(FutureTask.java:122)
	at java.base/java.util.concurrent.FutureTask.get(FutureTask.java:191)
	at org.apache.solr.update.DefaultSolrCoreState$2.run(DefaultSolrCoreState.java:351)
	... 5 more
Caused by: org.apache.solr.common.cloud.ZooKeeperException: 
	at app//org.apache.solr.cloud.RecoveryStrategy.run(RecoveryStrategy.java:330)
	at app//com.codahale.metrics.InstrumentedExecutorService$InstrumentedRunnable.run(InstrumentedExecutorService.java:212)
	at java.base@23.0.2/java.util.concurrent.Executors$RunnableAdapter.call(Executors.java:572)
	at java.base@23.0.2/java.util.concurrent.FutureTask.run(FutureTask.java:317)
	... 4 more
Caused by: org.apache.solr.common.SolrException: SolrCore not found:collection1_shard1_replica_p5 in [control_collection_shard1_replica_n1]
	at app//org.apache.solr.cloud.ReplicateFromLeader.startReplication(ReplicateFromLeader.java:75)
	at app//org.apache.solr.cloud.ZkController.startReplicationFromLeader(ZkController.java:1519)
	at app//org.apache.solr.cloud.RecoveryStrategy.doReplicateOnlyRecovery(RecoveryStrategy.java:431)
	at app//org.apache.solr.cloud.RecoveryStrategy.doRecovery(RecoveryStrategy.java:349)
	at app//org.apache.solr.cloud.RecoveryStrategy.run(RecoveryStrategy.java:323)
	... 7 more


FAILED:  org.apache.solr.cloud.TestDistribDocBasedVersion.testPullReplica

Error Message:
com.carrotsearch.randomizedtesting.UncaughtExceptionError: Captured an uncaught exception in thread: Thread[id=226, name=updateExecutor-19-thread-1, state=RUNNABLE, group=TGRP-TestDistribDocBasedVersion]

Stack Trace:
com.carrotsearch.randomizedtesting.UncaughtExceptionError: Captured an uncaught exception in thread: Thread[id=226, name=updateExecutor-19-thread-1, state=RUNNABLE, group=TGRP-TestDistribDocBasedVersion]
	at __randomizedtesting.SeedInfo.seed([5D31866F1DA2F53:4D6F8FA85408062A]:0)
Caused by: org.apache.solr.common.SolrException: java.util.concurrent.ExecutionException: org.apache.solr.common.cloud.ZooKeeperException: 
	at __randomizedtesting.SeedInfo.seed([5D31866F1DA2F53]:0)
	at app//org.apache.solr.update.DefaultSolrCoreState$2.run(DefaultSolrCoreState.java:356)
	at app//com.codahale.metrics.InstrumentedExecutorService$InstrumentedRunnable.run(InstrumentedExecutorService.java:212)
	at app//org.apache.solr.common.util.ExecutorUtil$MDCAwareThreadPoolExecutor.lambda$execute$0(ExecutorUtil.java:381)
	at java.base@23.0.2/java.util.concurrent.ThreadPoolExecutor.runWorker(ThreadPoolExecutor.java:1144)
	at java.base@23.0.2/java.util.concurrent.ThreadPoolExecutor$Worker.run(ThreadPoolExecutor.java:642)
	at java.base@23.0.2/java.lang.Thread.run(Thread.java:1575)
Caused by: java.util.concurrent.ExecutionException: org.apache.solr.common.cloud.ZooKeeperException: 
	at java.base/java.util.concurrent.FutureTask.report(FutureTask.java:122)
	at java.base/java.util.concurrent.FutureTask.get(FutureTask.java:191)
	at org.apache.solr.update.DefaultSolrCoreState$2.run(DefaultSolrCoreState.java:351)
	... 5 more
Caused by: org.apache.solr.common.cloud.ZooKeeperException: 
	at app//org.apache.solr.cloud.RecoveryStrategy.run(RecoveryStrategy.java:330)
	at app//com.codahale.metrics.InstrumentedExecutorService$InstrumentedRunnable.run(InstrumentedExecutorService.java:212)
	at java.base@23.0.2/java.util.concurrent.Executors$RunnableAdapter.call(Executors.java:572)
	at java.base@23.0.2/java.util.concurrent.FutureTask.run(FutureTask.java:317)
	... 4 more
Caused by: org.apache.solr.common.SolrException: SolrCore not found:collection1_shard1_replica_p5 in [control_collection_shard1_replica_n1]
	at app//org.apache.solr.cloud.ReplicateFromLeader.startReplication(ReplicateFromLeader.java:75)
	at app//org.apache.solr.cloud.ZkController.startReplicationFromLeader(ZkController.java:1519)
	at app//org.apache.solr.cloud.RecoveryStrategy.doReplicateOnlyRecovery(RecoveryStrategy.java:431)
	at app//org.apache.solr.cloud.RecoveryStrategy.doRecovery(RecoveryStrategy.java:349)
	at app//org.apache.solr.cloud.RecoveryStrategy.run(RecoveryStrategy.java:323)
	... 7 more

[JENKINS] Solr-main-Linux (64bit/hotspot/jdk-22.0.2) - Build # 28058 - Still unstable!

Posted by Policeman Jenkins Server <je...@thetaphi.de>.
Build: https://jenkins.thetaphi.de/job/Solr-main-Linux/28058/
Java: 64bit/hotspot/jdk-22.0.2 -XX:-UseCompressedOops -XX:+UseSerialGC

4 tests failed.
FAILED:  org.apache.solr.cloud.LeaderTragicEventTest.classMethod

Error Message:
java.lang.Exception: Error shutting down MiniSolrCloudCluster

Stack Trace:
java.lang.Exception: Error shutting down MiniSolrCloudCluster
	at __randomizedtesting.SeedInfo.seed([8AA06DDF71D8FD7E]:0)
	at org.apache.solr.cloud.MiniSolrCloudCluster.checkForExceptions(MiniSolrCloudCluster.java:773)
	at org.apache.solr.cloud.MiniSolrCloudCluster.shutdown(MiniSolrCloudCluster.java:682)
	at org.apache.solr.cloud.SolrCloudTestCase.shutdownCluster(SolrCloudTestCase.java:146)
	at java.base/jdk.internal.reflect.DirectMethodHandleAccessor.invoke(DirectMethodHandleAccessor.java:103)
	at java.base/java.lang.reflect.Method.invoke(Method.java:580)
	at com.carrotsearch.randomizedtesting.RandomizedRunner.invoke(RandomizedRunner.java:1758)
	at com.carrotsearch.randomizedtesting.RandomizedRunner$7.evaluate(RandomizedRunner.java:909)
	at com.carrotsearch.randomizedtesting.rules.StatementAdapter.evaluate(StatementAdapter.java:36)
	at com.carrotsearch.randomizedtesting.rules.StatementAdapter.evaluate(StatementAdapter.java:36)
	at org.apache.lucene.tests.util.AbstractBeforeAfterRule$1.evaluate(AbstractBeforeAfterRule.java:43)
	at com.carrotsearch.randomizedtesting.rules.SystemPropertiesRestoreRule$1.evaluate(SystemPropertiesRestoreRule.java:80)
	at org.junit.rules.RunRules.evaluate(RunRules.java:20)
	at org.apache.lucene.tests.util.AbstractBeforeAfterRule$1.evaluate(AbstractBeforeAfterRule.java:43)
	at com.carrotsearch.randomizedtesting.rules.StatementAdapter.evaluate(StatementAdapter.java:36)
	at org.apache.lucene.tests.util.TestRuleStoreClassName$1.evaluate(TestRuleStoreClassName.java:38)
	at com.carrotsearch.randomizedtesting.rules.NoShadowingOrOverridesOnMethodsRule$1.evaluate(NoShadowingOrOverridesOnMethodsRule.java:40)
	at com.carrotsearch.randomizedtesting.rules.NoShadowingOrOverridesOnMethodsRule$1.evaluate(NoShadowingOrOverridesOnMethodsRule.java:40)
	at com.carrotsearch.randomizedtesting.rules.StatementAdapter.evaluate(StatementAdapter.java:36)
	at com.carrotsearch.randomizedtesting.rules.StatementAdapter.evaluate(StatementAdapter.java:36)
	at org.apache.lucene.tests.util.TestRuleAssertionsRequired$1.evaluate(TestRuleAssertionsRequired.java:53)
	at org.apache.lucene.tests.util.AbstractBeforeAfterRule$1.evaluate(AbstractBeforeAfterRule.java:43)
	at org.apache.lucene.tests.util.TestRuleMarkFailure$1.evaluate(TestRuleMarkFailure.java:44)
	at org.apache.lucene.tests.util.TestRuleIgnoreAfterMaxFailures$1.evaluate(TestRuleIgnoreAfterMaxFailures.java:60)
	at org.apache.lucene.tests.util.TestRuleIgnoreTestSuites$1.evaluate(TestRuleIgnoreTestSuites.java:47)
	at org.junit.rules.RunRules.evaluate(RunRules.java:20)
	at com.carrotsearch.randomizedtesting.rules.StatementAdapter.evaluate(StatementAdapter.java:36)
	at com.carrotsearch.randomizedtesting.ThreadLeakControl$StatementRunner.run(ThreadLeakControl.java:390)
	at com.carrotsearch.randomizedtesting.ThreadLeakControl.lambda$forkTimeoutingTask$0(ThreadLeakControl.java:850)
	at java.base/java.lang.Thread.run(Thread.java:1570)
	Suppressed: java.util.concurrent.TimeoutException
		at java.base/java.util.concurrent.CompletableFuture.timedGet(CompletableFuture.java:1960)
		at java.base/java.util.concurrent.CompletableFuture.get(CompletableFuture.java:2095)
		at org.eclipse.jetty.server.Server.doStop(Server.java:663)
		at org.eclipse.jetty.util.component.AbstractLifeCycle.stop(AbstractLifeCycle.java:132)
		at org.apache.solr.embedded.JettySolrRunner.stop(JettySolrRunner.java:633)
		at org.apache.solr.cloud.MiniSolrCloudCluster.stopJettySolrRunner(MiniSolrCloudCluster.java:565)
		at org.apache.solr.cloud.MiniSolrCloudCluster.lambda$shutdown$5(MiniSolrCloudCluster.java:674)
		at java.base/java.util.concurrent.FutureTask.run(FutureTask.java:317)
		at org.apache.solr.common.util.ExecutorUtil$MDCAwareThreadPoolExecutor.lambda$execute$0(ExecutorUtil.java:381)
		at java.base/java.util.concurrent.ThreadPoolExecutor.runWorker(ThreadPoolExecutor.java:1144)
		at java.base/java.util.concurrent.ThreadPoolExecutor$Worker.run(ThreadPoolExecutor.java:642)
		... 1 more


FAILED:  org.apache.solr.cloud.TestCloudConsistency.testOutOfSyncReplicasCannotBecomeLeader

Error Message:
org.apache.solr.client.solrj.SolrClient$RemoteSolrException: Error from server at https://127.0.0.1:32935/solr: Expected mime type in [application/octet-stream, application/vnd.apache.solr.javabin] but got text/html. <html>
<head>
<meta http-equiv="Content-Type" content="text/html;charset=ISO-8859-1"/>
<title>Error 503 Service Unavailable</title>
</head>
<body>
<h2>HTTP ERROR 503 Service Unavailable</h2>
<table>
<tr><th>URI:</th><td>https://127.0.0.1:32935/solr/outOfSyncReplicasCannotBecomeLeader-false/get?qt=%2Fget&amp;id=1&amp;distrib=false&amp;wt=javabin</td></tr>
<tr><th>STATUS:</th><td>503</td></tr>
<tr><th>MESSAGE:</th><td>Service Unavailable</td></tr>
</table>
<hr/><a href="https://jetty.org/">Powered by Jetty:// 12.0.19</a><hr/>

</body>
</html>


Stack Trace:
org.apache.solr.client.solrj.SolrClient$RemoteSolrException: Error from server at https://127.0.0.1:32935/solr: Expected mime type in [application/octet-stream, application/vnd.apache.solr.javabin] but got text/html. <html>
<head>
<meta http-equiv="Content-Type" content="text/html;charset=ISO-8859-1"/>
<title>Error 503 Service Unavailable</title>
</head>
<body>
<h2>HTTP ERROR 503 Service Unavailable</h2>
<table>
<tr><th>URI:</th><td>https://127.0.0.1:32935/solr/outOfSyncReplicasCannotBecomeLeader-false/get?qt=%2Fget&amp;id=1&amp;distrib=false&amp;wt=javabin</td></tr>
<tr><th>STATUS:</th><td>503</td></tr>
<tr><th>MESSAGE:</th><td>Service Unavailable</td></tr>
</table>
<hr/><a href="https://jetty.org/">Powered by Jetty:// 12.0.19</a><hr/>

</body>
</html>

	at __randomizedtesting.SeedInfo.seed([8AA06DDF71D8FD7E:F44B4DCFB2BFF244]:0)
	at app//org.apache.solr.client.solrj.impl.HttpSolrClient.executeMethod(HttpSolrClient.java:649)
	at app//org.apache.solr.client.solrj.impl.HttpSolrClient.request(HttpSolrClient.java:250)
	at app//org.apache.solr.client.solrj.impl.HttpSolrClient.request(HttpSolrClient.java:229)
	at app//org.apache.solr.client.solrj.SolrClient.request(SolrClient.java:1193)
	at app//org.apache.solr.cloud.TestCloudConsistency.realTimeGetDocId(TestCloudConsistency.java:347)
	at app//org.apache.solr.cloud.TestCloudConsistency.assertDocExists(TestCloudConsistency.java:339)
	at app//org.apache.solr.cloud.TestCloudConsistency.assertDocsExistInAllReplicas(TestCloudConsistency.java:323)
	at app//org.apache.solr.cloud.TestCloudConsistency.testOutOfSyncReplicasCannotBecomeLeader(TestCloudConsistency.java:137)
	at app//org.apache.solr.cloud.TestCloudConsistency.testOutOfSyncReplicasCannotBecomeLeader(TestCloudConsistency.java:97)
	at java.base@22.0.2/jdk.internal.reflect.DirectMethodHandleAccessor.invoke(DirectMethodHandleAccessor.java:103)
	at java.base@22.0.2/java.lang.reflect.Method.invoke(Method.java:580)
	at app//com.carrotsearch.randomizedtesting.RandomizedRunner.invoke(RandomizedRunner.java:1758)
	at app//com.carrotsearch.randomizedtesting.RandomizedRunner$8.evaluate(RandomizedRunner.java:946)
	at app//com.carrotsearch.randomizedtesting.RandomizedRunner$9.evaluate(RandomizedRunner.java:982)
	at app//com.carrotsearch.randomizedtesting.RandomizedRunner$10.evaluate(RandomizedRunner.java:996)
	at app//com.carrotsearch.randomizedtesting.rules.SystemPropertiesRestoreRule$1.evaluate(SystemPropertiesRestoreRule.java:80)
	at app//org.junit.rules.RunRules.evaluate(RunRules.java:20)
	at app//org.apache.lucene.tests.util.TestRuleSetupTeardownChained$1.evaluate(TestRuleSetupTeardownChained.java:48)
	at app//org.apache.lucene.tests.util.AbstractBeforeAfterRule$1.evaluate(AbstractBeforeAfterRule.java:43)
	at app//org.apache.lucene.tests.util.TestRuleThreadAndTestName$1.evaluate(TestRuleThreadAndTestName.java:45)
	at app//org.apache.lucene.tests.util.TestRuleIgnoreAfterMaxFailures$1.evaluate(TestRuleIgnoreAfterMaxFailures.java:60)
	at app//org.apache.lucene.tests.util.TestRuleMarkFailure$1.evaluate(TestRuleMarkFailure.java:44)
	at app//org.junit.rules.RunRules.evaluate(RunRules.java:20)
	at app//com.carrotsearch.randomizedtesting.rules.StatementAdapter.evaluate(StatementAdapter.java:36)
	at app//com.carrotsearch.randomizedtesting.ThreadLeakControl$StatementRunner.run(ThreadLeakControl.java:390)
	at app//com.carrotsearch.randomizedtesting.ThreadLeakControl.forkTimeoutingTask(ThreadLeakControl.java:843)
	at app//com.carrotsearch.randomizedtesting.ThreadLeakControl$3.evaluate(ThreadLeakControl.java:490)
	at app//com.carrotsearch.randomizedtesting.RandomizedRunner.runSingleTest(RandomizedRunner.java:955)
	at app//com.carrotsearch.randomizedtesting.RandomizedRunner$5.evaluate(RandomizedRunner.java:840)
	at app//com.carrotsearch.randomizedtesting.RandomizedRunner$6.evaluate(RandomizedRunner.java:891)
	at app//com.carrotsearch.randomizedtesting.RandomizedRunner$7.evaluate(RandomizedRunner.java:902)
	at app//com.carrotsearch.randomizedtesting.rules.StatementAdapter.evaluate(StatementAdapter.java:36)
	at app//com.carrotsearch.randomizedtesting.rules.StatementAdapter.evaluate(StatementAdapter.java:36)
	at app//org.apache.lucene.tests.util.AbstractBeforeAfterRule$1.evaluate(AbstractBeforeAfterRule.java:43)
	at app//com.carrotsearch.randomizedtesting.rules.SystemPropertiesRestoreRule$1.evaluate(SystemPropertiesRestoreRule.java:80)
	at app//org.junit.rules.RunRules.evaluate(RunRules.java:20)
	at app//org.apache.lucene.tests.util.AbstractBeforeAfterRule$1.evaluate(AbstractBeforeAfterRule.java:43)
	at app//com.carrotsearch.randomizedtesting.rules.StatementAdapter.evaluate(StatementAdapter.java:36)
	at app//org.apache.lucene.tests.util.TestRuleStoreClassName$1.evaluate(TestRuleStoreClassName.java:38)
	at app//com.carrotsearch.randomizedtesting.rules.NoShadowingOrOverridesOnMethodsRule$1.evaluate(NoShadowingOrOverridesOnMethodsRule.java:40)
	at app//com.carrotsearch.randomizedtesting.rules.NoShadowingOrOverridesOnMethodsRule$1.evaluate(NoShadowingOrOverridesOnMethodsRule.java:40)
	at app//com.carrotsearch.randomizedtesting.rules.StatementAdapter.evaluate(StatementAdapter.java:36)
	at app//com.carrotsearch.randomizedtesting.rules.StatementAdapter.evaluate(StatementAdapter.java:36)
	at app//org.apache.lucene.tests.util.TestRuleAssertionsRequired$1.evaluate(TestRuleAssertionsRequired.java:53)
	at app//org.apache.lucene.tests.util.AbstractBeforeAfterRule$1.evaluate(AbstractBeforeAfterRule.java:43)
	at app//org.apache.lucene.tests.util.TestRuleMarkFailure$1.evaluate(TestRuleMarkFailure.java:44)
	at app//org.apache.lucene.tests.util.TestRuleIgnoreAfterMaxFailures$1.evaluate(TestRuleIgnoreAfterMaxFailures.java:60)
	at app//org.apache.lucene.tests.util.TestRuleIgnoreTestSuites$1.evaluate(TestRuleIgnoreTestSuites.java:47)
	at app//org.junit.rules.RunRules.evaluate(RunRules.java:20)
	at app//com.carrotsearch.randomizedtesting.rules.StatementAdapter.evaluate(StatementAdapter.java:36)
	at app//com.carrotsearch.randomizedtesting.ThreadLeakControl$StatementRunner.run(ThreadLeakControl.java:390)
	at app//com.carrotsearch.randomizedtesting.ThreadLeakControl.lambda$forkTimeoutingTask$0(ThreadLeakControl.java:850)
	at java.base@22.0.2/java.lang.Thread.run(Thread.java:1570)


FAILED:  org.apache.solr.cloud.TestDistribDocBasedVersion.testPullReplica

Error Message:
com.carrotsearch.randomizedtesting.UncaughtExceptionError: Captured an uncaught exception in thread: Thread[id=206, name=updateExecutor-19-thread-1, state=RUNNABLE, group=TGRP-TestDistribDocBasedVersion]

Stack Trace:
com.carrotsearch.randomizedtesting.UncaughtExceptionError: Captured an uncaught exception in thread: Thread[id=206, name=updateExecutor-19-thread-1, state=RUNNABLE, group=TGRP-TestDistribDocBasedVersion]
	at __randomizedtesting.SeedInfo.seed([8AA06DDF71D8FD7E:C21CFA11D40AD407]:0)
Caused by: org.apache.solr.common.SolrException: java.util.concurrent.ExecutionException: org.apache.solr.common.cloud.ZooKeeperException: 
	at __randomizedtesting.SeedInfo.seed([8AA06DDF71D8FD7E]:0)
	at app//org.apache.solr.update.DefaultSolrCoreState$2.run(DefaultSolrCoreState.java:356)
	at app//com.codahale.metrics.InstrumentedExecutorService$InstrumentedRunnable.run(InstrumentedExecutorService.java:212)
	at app//org.apache.solr.common.util.ExecutorUtil$MDCAwareThreadPoolExecutor.lambda$execute$0(ExecutorUtil.java:381)
	at java.base@22.0.2/java.util.concurrent.ThreadPoolExecutor.runWorker(ThreadPoolExecutor.java:1144)
	at java.base@22.0.2/java.util.concurrent.ThreadPoolExecutor$Worker.run(ThreadPoolExecutor.java:642)
	at java.base@22.0.2/java.lang.Thread.run(Thread.java:1570)
Caused by: java.util.concurrent.ExecutionException: org.apache.solr.common.cloud.ZooKeeperException: 
	at java.base/java.util.concurrent.FutureTask.report(FutureTask.java:122)
	at java.base/java.util.concurrent.FutureTask.get(FutureTask.java:191)
	at org.apache.solr.update.DefaultSolrCoreState$2.run(DefaultSolrCoreState.java:351)
	... 5 more
Caused by: org.apache.solr.common.cloud.ZooKeeperException: 
	at app//org.apache.solr.cloud.RecoveryStrategy.run(RecoveryStrategy.java:330)
	at app//com.codahale.metrics.InstrumentedExecutorService$InstrumentedRunnable.run(InstrumentedExecutorService.java:212)
	at java.base@22.0.2/java.util.concurrent.Executors$RunnableAdapter.call(Executors.java:572)
	at java.base@22.0.2/java.util.concurrent.FutureTask.run(FutureTask.java:317)
	... 4 more
Caused by: org.apache.solr.common.SolrException: SolrCore not found:collection1_shard1_replica_p5 in [control_collection_shard1_replica_n1]
	at app//org.apache.solr.cloud.ReplicateFromLeader.startReplication(ReplicateFromLeader.java:75)
	at app//org.apache.solr.cloud.ZkController.startReplicationFromLeader(ZkController.java:1519)
	at app//org.apache.solr.cloud.RecoveryStrategy.doReplicateOnlyRecovery(RecoveryStrategy.java:431)
	at app//org.apache.solr.cloud.RecoveryStrategy.doRecovery(RecoveryStrategy.java:349)
	at app//org.apache.solr.cloud.RecoveryStrategy.run(RecoveryStrategy.java:323)
	... 7 more


FAILED:  org.apache.solr.cloud.TestDistribDocBasedVersion.testPullReplica

Error Message:
com.carrotsearch.randomizedtesting.UncaughtExceptionError: Captured an uncaught exception in thread: Thread[id=5188, name=updateExecutor-2808-thread-1, state=RUNNABLE, group=TGRP-TestDistribDocBasedVersion]

Stack Trace:
com.carrotsearch.randomizedtesting.UncaughtExceptionError: Captured an uncaught exception in thread: Thread[id=5188, name=updateExecutor-2808-thread-1, state=RUNNABLE, group=TGRP-TestDistribDocBasedVersion]
	at __randomizedtesting.SeedInfo.seed([8AA06DDF71D8FD7E:C21CFA11D40AD407]:0)
Caused by: org.apache.solr.common.SolrException: java.util.concurrent.ExecutionException: org.apache.solr.common.cloud.ZooKeeperException: 
	at __randomizedtesting.SeedInfo.seed([8AA06DDF71D8FD7E]:0)
	at app//org.apache.solr.update.DefaultSolrCoreState$2.run(DefaultSolrCoreState.java:356)
	at app//com.codahale.metrics.InstrumentedExecutorService$InstrumentedRunnable.run(InstrumentedExecutorService.java:212)
	at app//org.apache.solr.common.util.ExecutorUtil$MDCAwareThreadPoolExecutor.lambda$execute$0(ExecutorUtil.java:381)
	at java.base@22.0.2/java.util.concurrent.ThreadPoolExecutor.runWorker(ThreadPoolExecutor.java:1144)
	at java.base@22.0.2/java.util.concurrent.ThreadPoolExecutor$Worker.run(ThreadPoolExecutor.java:642)
	at java.base@22.0.2/java.lang.Thread.run(Thread.java:1570)
Caused by: java.util.concurrent.ExecutionException: org.apache.solr.common.cloud.ZooKeeperException: 
	at java.base/java.util.concurrent.FutureTask.report(FutureTask.java:122)
	at java.base/java.util.concurrent.FutureTask.get(FutureTask.java:191)
	at org.apache.solr.update.DefaultSolrCoreState$2.run(DefaultSolrCoreState.java:351)
	... 5 more
Caused by: org.apache.solr.common.cloud.ZooKeeperException: 
	at app//org.apache.solr.cloud.RecoveryStrategy.run(RecoveryStrategy.java:330)
	at app//com.codahale.metrics.InstrumentedExecutorService$InstrumentedRunnable.run(InstrumentedExecutorService.java:212)
	at java.base@22.0.2/java.util.concurrent.Executors$RunnableAdapter.call(Executors.java:572)
	at java.base@22.0.2/java.util.concurrent.FutureTask.run(FutureTask.java:317)
	... 4 more
Caused by: org.apache.solr.common.SolrException: SolrCore not found:collection1_shard1_replica_p5 in [control_collection_shard1_replica_n1]
	at app//org.apache.solr.cloud.ReplicateFromLeader.startReplication(ReplicateFromLeader.java:75)
	at app//org.apache.solr.cloud.ZkController.startReplicationFromLeader(ZkController.java:1519)
	at app//org.apache.solr.cloud.RecoveryStrategy.doReplicateOnlyRecovery(RecoveryStrategy.java:431)
	at app//org.apache.solr.cloud.RecoveryStrategy.doRecovery(RecoveryStrategy.java:349)
	at app//org.apache.solr.cloud.RecoveryStrategy.run(RecoveryStrategy.java:323)
	... 7 more

[JENKINS-EA] Solr-main-Linux (64bit/hotspot/jdk-26-ea+10) - Build # 28057 - Failure!

Posted by Policeman Jenkins Server <je...@thetaphi.de>.
Build: https://jenkins.thetaphi.de/job/Solr-main-Linux/28057/
Java: 64bit/hotspot/jdk-26-ea+10 -XX:-UseCompressedOops -XX:+UseParallelGC

1 tests failed.
FAILED:  org.apache.solr.cloud.api.collections.LocalFSCloudIncrementalBackupTest.testCustomProperties

Error Message:
org.apache.solr.common.SolrException: Could not find a healthy node to handle the request.

Stack Trace:
org.apache.solr.common.SolrException: Could not find a healthy node to handle the request.
	at __randomizedtesting.SeedInfo.seed([F0D8EA73987334FD:E283A9A299064028]:0)
	at app//org.apache.solr.client.solrj.impl.CloudSolrClient.sendRequest(CloudSolrClient.java:1144)
	at app//org.apache.solr.client.solrj.impl.CloudSolrClient.requestWithRetryOnStaleState(CloudSolrClient.java:844)
	at app//org.apache.solr.client.solrj.impl.CloudSolrClient.requestWithRetryOnStaleState(CloudSolrClient.java:980)
	at app//org.apache.solr.client.solrj.impl.CloudSolrClient.requestWithRetryOnStaleState(CloudSolrClient.java:980)
	at app//org.apache.solr.client.solrj.impl.CloudSolrClient.requestWithRetryOnStaleState(CloudSolrClient.java:980)
	at app//org.apache.solr.client.solrj.impl.CloudSolrClient.requestWithRetryOnStaleState(CloudSolrClient.java:980)
	at app//org.apache.solr.client.solrj.impl.CloudSolrClient.requestWithRetryOnStaleState(CloudSolrClient.java:980)
	at app//org.apache.solr.client.solrj.impl.CloudSolrClient.request(CloudSolrClient.java:775)
	at app//org.apache.solr.client.solrj.SolrRequest.process(SolrRequest.java:285)
	at app//org.apache.solr.client.solrj.SolrClient.query(SolrClient.java:926)
	at app//org.apache.solr.cloud.api.collections.LocalFSCloudIncrementalBackupTest.testCustomProperties(LocalFSCloudIncrementalBackupTest.java:150)
	at java.base@26-ea/jdk.internal.reflect.DirectMethodHandleAccessor.invoke(DirectMethodHandleAccessor.java:104)
	at java.base@26-ea/java.lang.reflect.Method.invoke(Method.java:565)
	at app//com.carrotsearch.randomizedtesting.RandomizedRunner.invoke(RandomizedRunner.java:1758)
	at app//com.carrotsearch.randomizedtesting.RandomizedRunner$8.evaluate(RandomizedRunner.java:946)
	at app//com.carrotsearch.randomizedtesting.RandomizedRunner$9.evaluate(RandomizedRunner.java:982)
	at app//com.carrotsearch.randomizedtesting.RandomizedRunner$10.evaluate(RandomizedRunner.java:996)
	at app//com.carrotsearch.randomizedtesting.rules.SystemPropertiesRestoreRule$1.evaluate(SystemPropertiesRestoreRule.java:80)
	at app//org.junit.rules.RunRules.evaluate(RunRules.java:20)
	at app//org.apache.lucene.tests.util.TestRuleSetupTeardownChained$1.evaluate(TestRuleSetupTeardownChained.java:48)
	at app//org.apache.lucene.tests.util.AbstractBeforeAfterRule$1.evaluate(AbstractBeforeAfterRule.java:43)
	at app//org.apache.lucene.tests.util.TestRuleThreadAndTestName$1.evaluate(TestRuleThreadAndTestName.java:45)
	at app//org.apache.lucene.tests.util.TestRuleIgnoreAfterMaxFailures$1.evaluate(TestRuleIgnoreAfterMaxFailures.java:60)
	at app//org.apache.lucene.tests.util.TestRuleMarkFailure$1.evaluate(TestRuleMarkFailure.java:44)
	at app//org.junit.rules.RunRules.evaluate(RunRules.java:20)
	at app//com.carrotsearch.randomizedtesting.rules.StatementAdapter.evaluate(StatementAdapter.java:36)
	at app//com.carrotsearch.randomizedtesting.ThreadLeakControl$StatementRunner.run(ThreadLeakControl.java:390)
	at app//com.carrotsearch.randomizedtesting.ThreadLeakControl.forkTimeoutingTask(ThreadLeakControl.java:843)
	at app//com.carrotsearch.randomizedtesting.ThreadLeakControl$3.evaluate(ThreadLeakControl.java:490)
	at app//com.carrotsearch.randomizedtesting.RandomizedRunner.runSingleTest(RandomizedRunner.java:955)
	at app//com.carrotsearch.randomizedtesting.RandomizedRunner$5.evaluate(RandomizedRunner.java:840)
	at app//com.carrotsearch.randomizedtesting.RandomizedRunner$6.evaluate(RandomizedRunner.java:891)
	at app//com.carrotsearch.randomizedtesting.RandomizedRunner$7.evaluate(RandomizedRunner.java:902)
	at app//com.carrotsearch.randomizedtesting.rules.StatementAdapter.evaluate(StatementAdapter.java:36)
	at app//com.carrotsearch.randomizedtesting.rules.StatementAdapter.evaluate(StatementAdapter.java:36)
	at app//org.apache.lucene.tests.util.AbstractBeforeAfterRule$1.evaluate(AbstractBeforeAfterRule.java:43)
	at app//com.carrotsearch.randomizedtesting.rules.SystemPropertiesRestoreRule$1.evaluate(SystemPropertiesRestoreRule.java:80)
	at app//org.junit.rules.RunRules.evaluate(RunRules.java:20)
	at app//org.apache.lucene.tests.util.AbstractBeforeAfterRule$1.evaluate(AbstractBeforeAfterRule.java:43)
	at app//com.carrotsearch.randomizedtesting.rules.StatementAdapter.evaluate(StatementAdapter.java:36)
	at app//org.apache.lucene.tests.util.TestRuleStoreClassName$1.evaluate(TestRuleStoreClassName.java:38)
	at app//com.carrotsearch.randomizedtesting.rules.NoShadowingOrOverridesOnMethodsRule$1.evaluate(NoShadowingOrOverridesOnMethodsRule.java:40)
	at app//com.carrotsearch.randomizedtesting.rules.NoShadowingOrOverridesOnMethodsRule$1.evaluate(NoShadowingOrOverridesOnMethodsRule.java:40)
	at app//com.carrotsearch.randomizedtesting.rules.StatementAdapter.evaluate(StatementAdapter.java:36)
	at app//com.carrotsearch.randomizedtesting.rules.StatementAdapter.evaluate(StatementAdapter.java:36)
	at app//org.apache.lucene.tests.util.TestRuleAssertionsRequired$1.evaluate(TestRuleAssertionsRequired.java:53)
	at app//org.apache.lucene.tests.util.AbstractBeforeAfterRule$1.evaluate(AbstractBeforeAfterRule.java:43)
	at app//org.apache.lucene.tests.util.TestRuleMarkFailure$1.evaluate(TestRuleMarkFailure.java:44)
	at app//org.apache.lucene.tests.util.TestRuleIgnoreAfterMaxFailures$1.evaluate(TestRuleIgnoreAfterMaxFailures.java:60)
	at app//org.apache.lucene.tests.util.TestRuleIgnoreTestSuites$1.evaluate(TestRuleIgnoreTestSuites.java:47)
	at app//org.junit.rules.RunRules.evaluate(RunRules.java:20)
	at app//com.carrotsearch.randomizedtesting.rules.StatementAdapter.evaluate(StatementAdapter.java:36)
	at app//com.carrotsearch.randomizedtesting.ThreadLeakControl$StatementRunner.run(ThreadLeakControl.java:390)
	at app//com.carrotsearch.randomizedtesting.ThreadLeakControl.lambda$forkTimeoutingTask$0(ThreadLeakControl.java:850)
	at java.base@26-ea/java.lang.Thread.run(Thread.java:1474)

[JENKINS] Solr-main-Linux (64bit/hotspot/jdk-23.0.2) - Build # 28056 - Still unstable!

Posted by Policeman Jenkins Server <je...@thetaphi.de>.
Build: https://jenkins.thetaphi.de/job/Solr-main-Linux/28056/
Java: 64bit/hotspot/jdk-23.0.2 -XX:+UseCompressedOops -XX:+UseG1GC

1 tests failed.
FAILED:  org.apache.solr.gcs.GCSIncrementalBackupTest.testSimple

Error Message:
org.apache.solr.common.SolrException: Could not find a healthy node to handle the request.

Stack Trace:
org.apache.solr.common.SolrException: Could not find a healthy node to handle the request.
	at __randomizedtesting.SeedInfo.seed([EC86467DE57B3C68:D4356283C288E8B9]:0)
	at app//org.apache.solr.client.solrj.impl.CloudSolrClient.sendRequest(CloudSolrClient.java:1144)
	at app//org.apache.solr.client.solrj.impl.CloudSolrClient.requestWithRetryOnStaleState(CloudSolrClient.java:844)
	at app//org.apache.solr.client.solrj.impl.CloudSolrClient.requestWithRetryOnStaleState(CloudSolrClient.java:980)
	at app//org.apache.solr.client.solrj.impl.CloudSolrClient.requestWithRetryOnStaleState(CloudSolrClient.java:980)
	at app//org.apache.solr.client.solrj.impl.CloudSolrClient.requestWithRetryOnStaleState(CloudSolrClient.java:980)
	at app//org.apache.solr.client.solrj.impl.CloudSolrClient.requestWithRetryOnStaleState(CloudSolrClient.java:980)
	at app//org.apache.solr.client.solrj.impl.CloudSolrClient.requestWithRetryOnStaleState(CloudSolrClient.java:980)
	at app//org.apache.solr.client.solrj.impl.CloudSolrClient.request(CloudSolrClient.java:775)
	at app//org.apache.solr.client.solrj.SolrRequest.process(SolrRequest.java:285)
	at app//org.apache.solr.client.solrj.SolrClient.query(SolrClient.java:926)
	at app//org.apache.solr.cloud.api.collections.AbstractIncrementalBackupTest.testSimple(AbstractIncrementalBackupTest.java:188)
	at java.base@23.0.2/jdk.internal.reflect.DirectMethodHandleAccessor.invoke(DirectMethodHandleAccessor.java:103)
	at java.base@23.0.2/java.lang.reflect.Method.invoke(Method.java:580)
	at app//com.carrotsearch.randomizedtesting.RandomizedRunner.invoke(RandomizedRunner.java:1758)
	at app//com.carrotsearch.randomizedtesting.RandomizedRunner$8.evaluate(RandomizedRunner.java:946)
	at app//com.carrotsearch.randomizedtesting.RandomizedRunner$9.evaluate(RandomizedRunner.java:982)
	at app//com.carrotsearch.randomizedtesting.RandomizedRunner$10.evaluate(RandomizedRunner.java:996)
	at app//com.carrotsearch.randomizedtesting.rules.SystemPropertiesRestoreRule$1.evaluate(SystemPropertiesRestoreRule.java:80)
	at app//org.junit.rules.RunRules.evaluate(RunRules.java:20)
	at app//org.apache.lucene.tests.util.TestRuleSetupTeardownChained$1.evaluate(TestRuleSetupTeardownChained.java:48)
	at app//org.apache.lucene.tests.util.AbstractBeforeAfterRule$1.evaluate(AbstractBeforeAfterRule.java:43)
	at app//org.apache.lucene.tests.util.TestRuleThreadAndTestName$1.evaluate(TestRuleThreadAndTestName.java:45)
	at app//org.apache.lucene.tests.util.TestRuleIgnoreAfterMaxFailures$1.evaluate(TestRuleIgnoreAfterMaxFailures.java:60)
	at app//org.apache.lucene.tests.util.TestRuleMarkFailure$1.evaluate(TestRuleMarkFailure.java:44)
	at app//org.junit.rules.RunRules.evaluate(RunRules.java:20)
	at app//com.carrotsearch.randomizedtesting.rules.StatementAdapter.evaluate(StatementAdapter.java:36)
	at app//com.carrotsearch.randomizedtesting.ThreadLeakControl$StatementRunner.run(ThreadLeakControl.java:390)
	at app//com.carrotsearch.randomizedtesting.ThreadLeakControl.forkTimeoutingTask(ThreadLeakControl.java:843)
	at app//com.carrotsearch.randomizedtesting.ThreadLeakControl$3.evaluate(ThreadLeakControl.java:490)
	at app//com.carrotsearch.randomizedtesting.RandomizedRunner.runSingleTest(RandomizedRunner.java:955)
	at app//com.carrotsearch.randomizedtesting.RandomizedRunner$5.evaluate(RandomizedRunner.java:840)
	at app//com.carrotsearch.randomizedtesting.RandomizedRunner$6.evaluate(RandomizedRunner.java:891)
	at app//com.carrotsearch.randomizedtesting.RandomizedRunner$7.evaluate(RandomizedRunner.java:902)
	at app//com.carrotsearch.randomizedtesting.rules.StatementAdapter.evaluate(StatementAdapter.java:36)
	at app//com.carrotsearch.randomizedtesting.rules.StatementAdapter.evaluate(StatementAdapter.java:36)
	at app//org.apache.lucene.tests.util.AbstractBeforeAfterRule$1.evaluate(AbstractBeforeAfterRule.java:43)
	at app//com.carrotsearch.randomizedtesting.rules.SystemPropertiesRestoreRule$1.evaluate(SystemPropertiesRestoreRule.java:80)
	at app//org.junit.rules.RunRules.evaluate(RunRules.java:20)
	at app//org.apache.lucene.tests.util.AbstractBeforeAfterRule$1.evaluate(AbstractBeforeAfterRule.java:43)
	at app//com.carrotsearch.randomizedtesting.rules.StatementAdapter.evaluate(StatementAdapter.java:36)
	at app//org.apache.lucene.tests.util.TestRuleStoreClassName$1.evaluate(TestRuleStoreClassName.java:38)
	at app//com.carrotsearch.randomizedtesting.rules.NoShadowingOrOverridesOnMethodsRule$1.evaluate(NoShadowingOrOverridesOnMethodsRule.java:40)
	at app//com.carrotsearch.randomizedtesting.rules.NoShadowingOrOverridesOnMethodsRule$1.evaluate(NoShadowingOrOverridesOnMethodsRule.java:40)
	at app//com.carrotsearch.randomizedtesting.rules.StatementAdapter.evaluate(StatementAdapter.java:36)
	at app//com.carrotsearch.randomizedtesting.rules.StatementAdapter.evaluate(StatementAdapter.java:36)
	at app//org.apache.lucene.tests.util.TestRuleAssertionsRequired$1.evaluate(TestRuleAssertionsRequired.java:53)
	at app//org.apache.lucene.tests.util.AbstractBeforeAfterRule$1.evaluate(AbstractBeforeAfterRule.java:43)
	at app//org.apache.lucene.tests.util.TestRuleMarkFailure$1.evaluate(TestRuleMarkFailure.java:44)
	at app//org.apache.lucene.tests.util.TestRuleIgnoreAfterMaxFailures$1.evaluate(TestRuleIgnoreAfterMaxFailures.java:60)
	at app//org.apache.lucene.tests.util.TestRuleIgnoreTestSuites$1.evaluate(TestRuleIgnoreTestSuites.java:47)
	at app//org.junit.rules.RunRules.evaluate(RunRules.java:20)
	at app//com.carrotsearch.randomizedtesting.rules.StatementAdapter.evaluate(StatementAdapter.java:36)
	at app//com.carrotsearch.randomizedtesting.ThreadLeakControl$StatementRunner.run(ThreadLeakControl.java:390)
	at app//com.carrotsearch.randomizedtesting.ThreadLeakControl.lambda$forkTimeoutingTask$0(ThreadLeakControl.java:850)
	at java.base@23.0.2/java.lang.Thread.run(Thread.java:1575)

[JENKINS-EA] Solr-main-Linux (64bit/hotspot/jdk-26-ea+10) - Build # 28055 - Failure!

Posted by Policeman Jenkins Server <je...@thetaphi.de>.
Build: https://jenkins.thetaphi.de/job/Solr-main-Linux/28055/
Java: 64bit/hotspot/jdk-26-ea+10 -XX:-UseCompressedOops -XX:+UseParallelGC

All tests passed

[JENKINS] Solr-main-Linux (64bit/hotspot/jdk-23.0.2) - Build # 28054 - Still Unstable!

Posted by Policeman Jenkins Server <je...@thetaphi.de>.
Build: https://jenkins.thetaphi.de/job/Solr-main-Linux/28054/
Java: 64bit/hotspot/jdk-23.0.2 -XX:+UseCompressedOops -XX:+UseG1GC

2 tests failed.
FAILED:  org.apache.solr.cloud.TestDistribDocBasedVersion.testPullReplica

Error Message:
com.carrotsearch.randomizedtesting.UncaughtExceptionError: Captured an uncaught exception in thread: Thread[id=5656, name=updateExecutor-2957-thread-1, state=RUNNABLE, group=TGRP-TestDistribDocBasedVersion]

Stack Trace:
com.carrotsearch.randomizedtesting.UncaughtExceptionError: Captured an uncaught exception in thread: Thread[id=5656, name=updateExecutor-2957-thread-1, state=RUNNABLE, group=TGRP-TestDistribDocBasedVersion]
	at __randomizedtesting.SeedInfo.seed([EF9B78970297F6CA:A727EF59A745DFB3]:0)
Caused by: org.apache.solr.common.SolrException: java.util.concurrent.ExecutionException: org.apache.solr.common.cloud.ZooKeeperException: 
	at __randomizedtesting.SeedInfo.seed([EF9B78970297F6CA]:0)
	at app//org.apache.solr.update.DefaultSolrCoreState$2.run(DefaultSolrCoreState.java:356)
	at app//com.codahale.metrics.InstrumentedExecutorService$InstrumentedRunnable.run(InstrumentedExecutorService.java:212)
	at app//org.apache.solr.common.util.ExecutorUtil$MDCAwareThreadPoolExecutor.lambda$execute$0(ExecutorUtil.java:381)
	at java.base@23.0.2/java.util.concurrent.ThreadPoolExecutor.runWorker(ThreadPoolExecutor.java:1144)
	at java.base@23.0.2/java.util.concurrent.ThreadPoolExecutor$Worker.run(ThreadPoolExecutor.java:642)
	at java.base@23.0.2/java.lang.Thread.run(Thread.java:1575)
Caused by: java.util.concurrent.ExecutionException: org.apache.solr.common.cloud.ZooKeeperException: 
	at java.base/java.util.concurrent.FutureTask.report(FutureTask.java:122)
	at java.base/java.util.concurrent.FutureTask.get(FutureTask.java:191)
	at org.apache.solr.update.DefaultSolrCoreState$2.run(DefaultSolrCoreState.java:351)
	... 5 more
Caused by: org.apache.solr.common.cloud.ZooKeeperException: 
	at app//org.apache.solr.cloud.RecoveryStrategy.run(RecoveryStrategy.java:330)
	at app//com.codahale.metrics.InstrumentedExecutorService$InstrumentedRunnable.run(InstrumentedExecutorService.java:212)
	at java.base@23.0.2/java.util.concurrent.Executors$RunnableAdapter.call(Executors.java:572)
	at java.base@23.0.2/java.util.concurrent.FutureTask.run(FutureTask.java:317)
	... 4 more
Caused by: org.apache.solr.common.SolrException: SolrCore not found:collection1_shard1_replica_p5 in [control_collection_shard1_replica_n1]
	at app//org.apache.solr.cloud.ReplicateFromLeader.startReplication(ReplicateFromLeader.java:75)
	at app//org.apache.solr.cloud.ZkController.startReplicationFromLeader(ZkController.java:1519)
	at app//org.apache.solr.cloud.RecoveryStrategy.doReplicateOnlyRecovery(RecoveryStrategy.java:431)
	at app//org.apache.solr.cloud.RecoveryStrategy.doRecovery(RecoveryStrategy.java:349)
	at app//org.apache.solr.cloud.RecoveryStrategy.run(RecoveryStrategy.java:323)
	... 7 more


FAILED:  org.apache.solr.cloud.TestDistribDocBasedVersion.testPullReplica

Error Message:
com.carrotsearch.randomizedtesting.UncaughtExceptionError: Captured an uncaught exception in thread: Thread[id=226, name=updateExecutor-19-thread-1, state=RUNNABLE, group=TGRP-TestDistribDocBasedVersion]

Stack Trace:
com.carrotsearch.randomizedtesting.UncaughtExceptionError: Captured an uncaught exception in thread: Thread[id=226, name=updateExecutor-19-thread-1, state=RUNNABLE, group=TGRP-TestDistribDocBasedVersion]
	at __randomizedtesting.SeedInfo.seed([EF9B78970297F6CA:A727EF59A745DFB3]:0)
Caused by: org.apache.solr.common.SolrException: java.util.concurrent.ExecutionException: org.apache.solr.common.cloud.ZooKeeperException: 
	at __randomizedtesting.SeedInfo.seed([EF9B78970297F6CA]:0)
	at app//org.apache.solr.update.DefaultSolrCoreState$2.run(DefaultSolrCoreState.java:356)
	at app//com.codahale.metrics.InstrumentedExecutorService$InstrumentedRunnable.run(InstrumentedExecutorService.java:212)
	at app//org.apache.solr.common.util.ExecutorUtil$MDCAwareThreadPoolExecutor.lambda$execute$0(ExecutorUtil.java:381)
	at java.base@23.0.2/java.util.concurrent.ThreadPoolExecutor.runWorker(ThreadPoolExecutor.java:1144)
	at java.base@23.0.2/java.util.concurrent.ThreadPoolExecutor$Worker.run(ThreadPoolExecutor.java:642)
	at java.base@23.0.2/java.lang.Thread.run(Thread.java:1575)
Caused by: java.util.concurrent.ExecutionException: org.apache.solr.common.cloud.ZooKeeperException: 
	at java.base/java.util.concurrent.FutureTask.report(FutureTask.java:122)
	at java.base/java.util.concurrent.FutureTask.get(FutureTask.java:191)
	at org.apache.solr.update.DefaultSolrCoreState$2.run(DefaultSolrCoreState.java:351)
	... 5 more
Caused by: org.apache.solr.common.cloud.ZooKeeperException: 
	at app//org.apache.solr.cloud.RecoveryStrategy.run(RecoveryStrategy.java:330)
	at app//com.codahale.metrics.InstrumentedExecutorService$InstrumentedRunnable.run(InstrumentedExecutorService.java:212)
	at java.base@23.0.2/java.util.concurrent.Executors$RunnableAdapter.call(Executors.java:572)
	at java.base@23.0.2/java.util.concurrent.FutureTask.run(FutureTask.java:317)
	... 4 more
Caused by: org.apache.solr.common.SolrException: SolrCore not found:collection1_shard1_replica_p5 in [control_collection_shard1_replica_n1]
	at app//org.apache.solr.cloud.ReplicateFromLeader.startReplication(ReplicateFromLeader.java:75)
	at app//org.apache.solr.cloud.ZkController.startReplicationFromLeader(ZkController.java:1519)
	at app//org.apache.solr.cloud.RecoveryStrategy.doReplicateOnlyRecovery(RecoveryStrategy.java:431)
	at app//org.apache.solr.cloud.RecoveryStrategy.doRecovery(RecoveryStrategy.java:349)
	at app//org.apache.solr.cloud.RecoveryStrategy.run(RecoveryStrategy.java:323)
	... 7 more

[JENKINS] Solr-main-Linux (64bit/hotspot/jdk-22.0.2) - Build # 28053 - Still Unstable!

Posted by Policeman Jenkins Server <je...@thetaphi.de>.
Build: https://jenkins.thetaphi.de/job/Solr-main-Linux/28053/
Java: 64bit/hotspot/jdk-22.0.2 -XX:-UseCompressedOops -XX:+UseSerialGC

2 tests failed.
FAILED:  org.apache.solr.cloud.TestDistribDocBasedVersion.testPullReplica

Error Message:
com.carrotsearch.randomizedtesting.UncaughtExceptionError: Captured an uncaught exception in thread: Thread[id=5163, name=updateExecutor-2812-thread-1, state=RUNNABLE, group=TGRP-TestDistribDocBasedVersion]

Stack Trace:
com.carrotsearch.randomizedtesting.UncaughtExceptionError: Captured an uncaught exception in thread: Thread[id=5163, name=updateExecutor-2812-thread-1, state=RUNNABLE, group=TGRP-TestDistribDocBasedVersion]
	at __randomizedtesting.SeedInfo.seed([9216769F09258494:DAAAE151ACF7ADED]:0)
Caused by: org.apache.solr.common.SolrException: java.util.concurrent.ExecutionException: org.apache.solr.common.cloud.ZooKeeperException: 
	at __randomizedtesting.SeedInfo.seed([9216769F09258494]:0)
	at app//org.apache.solr.update.DefaultSolrCoreState$2.run(DefaultSolrCoreState.java:356)
	at app//com.codahale.metrics.InstrumentedExecutorService$InstrumentedRunnable.run(InstrumentedExecutorService.java:212)
	at app//org.apache.solr.common.util.ExecutorUtil$MDCAwareThreadPoolExecutor.lambda$execute$0(ExecutorUtil.java:381)
	at java.base@22.0.2/java.util.concurrent.ThreadPoolExecutor.runWorker(ThreadPoolExecutor.java:1144)
	at java.base@22.0.2/java.util.concurrent.ThreadPoolExecutor$Worker.run(ThreadPoolExecutor.java:642)
	at java.base@22.0.2/java.lang.Thread.run(Thread.java:1570)
Caused by: java.util.concurrent.ExecutionException: org.apache.solr.common.cloud.ZooKeeperException: 
	at java.base/java.util.concurrent.FutureTask.report(FutureTask.java:122)
	at java.base/java.util.concurrent.FutureTask.get(FutureTask.java:191)
	at org.apache.solr.update.DefaultSolrCoreState$2.run(DefaultSolrCoreState.java:351)
	... 5 more
Caused by: org.apache.solr.common.cloud.ZooKeeperException: 
	at app//org.apache.solr.cloud.RecoveryStrategy.run(RecoveryStrategy.java:330)
	at app//com.codahale.metrics.InstrumentedExecutorService$InstrumentedRunnable.run(InstrumentedExecutorService.java:212)
	at java.base@22.0.2/java.util.concurrent.Executors$RunnableAdapter.call(Executors.java:572)
	at java.base@22.0.2/java.util.concurrent.FutureTask.run(FutureTask.java:317)
	... 4 more
Caused by: org.apache.solr.common.SolrException: SolrCore not found:collection1_shard1_replica_p5 in [control_collection_shard1_replica_n1]
	at app//org.apache.solr.cloud.ReplicateFromLeader.startReplication(ReplicateFromLeader.java:75)
	at app//org.apache.solr.cloud.ZkController.startReplicationFromLeader(ZkController.java:1519)
	at app//org.apache.solr.cloud.RecoveryStrategy.doReplicateOnlyRecovery(RecoveryStrategy.java:431)
	at app//org.apache.solr.cloud.RecoveryStrategy.doRecovery(RecoveryStrategy.java:349)
	at app//org.apache.solr.cloud.RecoveryStrategy.run(RecoveryStrategy.java:323)
	... 7 more


FAILED:  org.apache.solr.cloud.TestDistribDocBasedVersion.testPullReplica

Error Message:
com.carrotsearch.randomizedtesting.UncaughtExceptionError: Captured an uncaught exception in thread: Thread[id=206, name=updateExecutor-19-thread-1, state=RUNNABLE, group=TGRP-TestDistribDocBasedVersion]

Stack Trace:
com.carrotsearch.randomizedtesting.UncaughtExceptionError: Captured an uncaught exception in thread: Thread[id=206, name=updateExecutor-19-thread-1, state=RUNNABLE, group=TGRP-TestDistribDocBasedVersion]
	at __randomizedtesting.SeedInfo.seed([9216769F09258494:DAAAE151ACF7ADED]:0)
Caused by: org.apache.solr.common.SolrException: java.util.concurrent.ExecutionException: org.apache.solr.common.cloud.ZooKeeperException: 
	at __randomizedtesting.SeedInfo.seed([9216769F09258494]:0)
	at app//org.apache.solr.update.DefaultSolrCoreState$2.run(DefaultSolrCoreState.java:356)
	at app//com.codahale.metrics.InstrumentedExecutorService$InstrumentedRunnable.run(InstrumentedExecutorService.java:212)
	at app//org.apache.solr.common.util.ExecutorUtil$MDCAwareThreadPoolExecutor.lambda$execute$0(ExecutorUtil.java:381)
	at java.base@22.0.2/java.util.concurrent.ThreadPoolExecutor.runWorker(ThreadPoolExecutor.java:1144)
	at java.base@22.0.2/java.util.concurrent.ThreadPoolExecutor$Worker.run(ThreadPoolExecutor.java:642)
	at java.base@22.0.2/java.lang.Thread.run(Thread.java:1570)
Caused by: java.util.concurrent.ExecutionException: org.apache.solr.common.cloud.ZooKeeperException: 
	at java.base/java.util.concurrent.FutureTask.report(FutureTask.java:122)
	at java.base/java.util.concurrent.FutureTask.get(FutureTask.java:191)
	at org.apache.solr.update.DefaultSolrCoreState$2.run(DefaultSolrCoreState.java:351)
	... 5 more
Caused by: org.apache.solr.common.cloud.ZooKeeperException: 
	at app//org.apache.solr.cloud.RecoveryStrategy.run(RecoveryStrategy.java:330)
	at app//com.codahale.metrics.InstrumentedExecutorService$InstrumentedRunnable.run(InstrumentedExecutorService.java:212)
	at java.base@22.0.2/java.util.concurrent.Executors$RunnableAdapter.call(Executors.java:572)
	at java.base@22.0.2/java.util.concurrent.FutureTask.run(FutureTask.java:317)
	... 4 more
Caused by: org.apache.solr.common.SolrException: SolrCore not found:collection1_shard1_replica_p5 in [control_collection_shard1_replica_n1]
	at app//org.apache.solr.cloud.ReplicateFromLeader.startReplication(ReplicateFromLeader.java:75)
	at app//org.apache.solr.cloud.ZkController.startReplicationFromLeader(ZkController.java:1519)
	at app//org.apache.solr.cloud.RecoveryStrategy.doReplicateOnlyRecovery(RecoveryStrategy.java:431)
	at app//org.apache.solr.cloud.RecoveryStrategy.doRecovery(RecoveryStrategy.java:349)
	at app//org.apache.solr.cloud.RecoveryStrategy.run(RecoveryStrategy.java:323)
	... 7 more