You are viewing a plain text version of this content. The canonical link for it is here.
Posted to dev@lucene.apache.org by Policeman Jenkins Server <je...@thetaphi.de> on 2015/04/25 11:18:11 UTC
[JENKINS] Lucene-Solr-trunk-Linux (64bit/jdk1.9.0-ea-b54) - Build #
12442 - Failure!
Build: http://jenkins.thetaphi.de/job/Lucene-Solr-trunk-Linux/12442/
Java: 64bit/jdk1.9.0-ea-b54 -XX:-UseCompressedOops -XX:+UseConcMarkSweepGC
1 tests failed.
FAILED: org.apache.lucene.search.postingshighlight.TestPostingsHighlighter.testFieldSometimesMissingFromSegment
Error Message:
Stack Trace:
java.lang.AssertionError
at __randomizedtesting.SeedInfo.seed([2763EB5315F0D5DC:36C9088FF5CEEC0F]:0)
at org.junit.Assert.fail(Assert.java:92)
at org.junit.Assert.assertTrue(Assert.java:43)
at org.junit.Assert.assertNull(Assert.java:551)
at org.junit.Assert.assertNull(Assert.java:562)
at org.apache.lucene.search.postingshighlight.TestPostingsHighlighter.testFieldSometimesMissingFromSegment(TestPostingsHighlighter.java:1154)
at sun.reflect.NativeMethodAccessorImpl.invoke0(Native Method)
at sun.reflect.NativeMethodAccessorImpl.invoke(NativeMethodAccessorImpl.java:62)
at sun.reflect.DelegatingMethodAccessorImpl.invoke(DelegatingMethodAccessorImpl.java:43)
at java.lang.reflect.Method.invoke(Method.java:502)
at com.carrotsearch.randomizedtesting.RandomizedRunner.invoke(RandomizedRunner.java:1627)
at com.carrotsearch.randomizedtesting.RandomizedRunner$6.evaluate(RandomizedRunner.java:836)
at com.carrotsearch.randomizedtesting.RandomizedRunner$7.evaluate(RandomizedRunner.java:872)
at com.carrotsearch.randomizedtesting.RandomizedRunner$8.evaluate(RandomizedRunner.java:886)
at org.apache.lucene.util.TestRuleSetupTeardownChained$1.evaluate(TestRuleSetupTeardownChained.java:50)
at org.apache.lucene.util.AbstractBeforeAfterRule$1.evaluate(AbstractBeforeAfterRule.java:46)
at org.apache.lucene.util.TestRuleThreadAndTestName$1.evaluate(TestRuleThreadAndTestName.java:49)
at org.apache.lucene.util.TestRuleIgnoreAfterMaxFailures$1.evaluate(TestRuleIgnoreAfterMaxFailures.java:65)
at org.apache.lucene.util.TestRuleMarkFailure$1.evaluate(TestRuleMarkFailure.java:48)
at com.carrotsearch.randomizedtesting.rules.StatementAdapter.evaluate(StatementAdapter.java:36)
at com.carrotsearch.randomizedtesting.ThreadLeakControl$StatementRunner.run(ThreadLeakControl.java:365)
at com.carrotsearch.randomizedtesting.ThreadLeakControl.forkTimeoutingTask(ThreadLeakControl.java:798)
at com.carrotsearch.randomizedtesting.ThreadLeakControl$3.evaluate(ThreadLeakControl.java:458)
at com.carrotsearch.randomizedtesting.RandomizedRunner.runSingleTest(RandomizedRunner.java:845)
at com.carrotsearch.randomizedtesting.RandomizedRunner$3.evaluate(RandomizedRunner.java:747)
at com.carrotsearch.randomizedtesting.RandomizedRunner$4.evaluate(RandomizedRunner.java:781)
at com.carrotsearch.randomizedtesting.RandomizedRunner$5.evaluate(RandomizedRunner.java:792)
at org.apache.lucene.util.AbstractBeforeAfterRule$1.evaluate(AbstractBeforeAfterRule.java:46)
at com.carrotsearch.randomizedtesting.rules.StatementAdapter.evaluate(StatementAdapter.java:36)
at org.apache.lucene.util.TestRuleStoreClassName$1.evaluate(TestRuleStoreClassName.java:42)
at com.carrotsearch.randomizedtesting.rules.NoShadowingOrOverridesOnMethodsRule$1.evaluate(NoShadowingOrOverridesOnMethodsRule.java:39)
at com.carrotsearch.randomizedtesting.rules.NoShadowingOrOverridesOnMethodsRule$1.evaluate(NoShadowingOrOverridesOnMethodsRule.java:39)
at com.carrotsearch.randomizedtesting.rules.StatementAdapter.evaluate(StatementAdapter.java:36)
at com.carrotsearch.randomizedtesting.rules.StatementAdapter.evaluate(StatementAdapter.java:36)
at com.carrotsearch.randomizedtesting.rules.StatementAdapter.evaluate(StatementAdapter.java:36)
at org.apache.lucene.util.TestRuleAssertionsRequired$1.evaluate(TestRuleAssertionsRequired.java:54)
at org.apache.lucene.util.TestRuleMarkFailure$1.evaluate(TestRuleMarkFailure.java:48)
at org.apache.lucene.util.TestRuleIgnoreAfterMaxFailures$1.evaluate(TestRuleIgnoreAfterMaxFailures.java:65)
at org.apache.lucene.util.TestRuleIgnoreTestSuites$1.evaluate(TestRuleIgnoreTestSuites.java:55)
at com.carrotsearch.randomizedtesting.rules.StatementAdapter.evaluate(StatementAdapter.java:36)
at com.carrotsearch.randomizedtesting.ThreadLeakControl$StatementRunner.run(ThreadLeakControl.java:365)
at java.lang.Thread.run(Thread.java:745)
Build Log:
[...truncated 6846 lines...]
[junit4] Suite: org.apache.lucene.search.postingshighlight.TestPostingsHighlighter
[junit4] 2> NOTE: reproduce with: ant test -Dtestcase=TestPostingsHighlighter -Dtests.method=testFieldSometimesMissingFromSegment -Dtests.seed=2763EB5315F0D5DC -Dtests.multiplier=3 -Dtests.slow=true -Dtests.locale=zh_SG_#Hans -Dtests.timezone=Asia/Kuwait -Dtests.asserts=true -Dtests.file.encoding=UTF-8
[junit4] FAILURE 0.06s J2 | TestPostingsHighlighter.testFieldSometimesMissingFromSegment <<<
[junit4] > Throwable #1: java.lang.AssertionError
[junit4] > at __randomizedtesting.SeedInfo.seed([2763EB5315F0D5DC:36C9088FF5CEEC0F]:0)
[junit4] > at org.apache.lucene.search.postingshighlight.TestPostingsHighlighter.testFieldSometimesMissingFromSegment(TestPostingsHighlighter.java:1154)
[junit4] > at java.lang.Thread.run(Thread.java:745)
[junit4] 2> NOTE: test params are: codec=CheapBastard, sim=DefaultSimilarity, locale=zh_SG_#Hans, timezone=Asia/Kuwait
[junit4] 2> NOTE: Linux 3.13.0-49-generic amd64/Oracle Corporation 1.9.0-ea (64-bit)/cpus=12,threads=1,free=446203712,total=508887040
[junit4] 2> NOTE: All tests run in this JVM: [SimpleBoundaryScannerTest, ScoreOrderFragmentsBuilderTest, TestPostingsHighlighter]
[junit4] Completed [5/22] on J2 in 1.45s, 31 tests, 1 failure <<< FAILURES!
[...truncated 62 lines...]
BUILD FAILED
/home/jenkins/workspace/Lucene-Solr-trunk-Linux/build.xml:526: The following error occurred while executing this line:
/home/jenkins/workspace/Lucene-Solr-trunk-Linux/build.xml:474: The following error occurred while executing this line:
/home/jenkins/workspace/Lucene-Solr-trunk-Linux/build.xml:61: The following error occurred while executing this line:
/home/jenkins/workspace/Lucene-Solr-trunk-Linux/extra-targets.xml:39: The following error occurred while executing this line:
/home/jenkins/workspace/Lucene-Solr-trunk-Linux/lucene/build.xml:466: The following error occurred while executing this line:
/home/jenkins/workspace/Lucene-Solr-trunk-Linux/lucene/common-build.xml:2145: The following error occurred while executing this line:
/home/jenkins/workspace/Lucene-Solr-trunk-Linux/lucene/module-build.xml:58: The following error occurred while executing this line:
/home/jenkins/workspace/Lucene-Solr-trunk-Linux/lucene/common-build.xml:1415: The following error occurred while executing this line:
/home/jenkins/workspace/Lucene-Solr-trunk-Linux/lucene/common-build.xml:973: There were test failures: 22 suites, 251 tests, 1 failure
Total time: 14 minutes 13 seconds
Build step 'Invoke Ant' marked build as failure
Archiving artifacts
Recording test results
Email was triggered for: Failure - Any
Sending email for trigger: Failure - Any
Re: [JENKINS] Lucene-Solr-trunk-Linux (64bit/jdk1.9.0-ea-b54) - Build
# 12442 - Failure!
Posted by Michael McCandless <lu...@mikemccandless.com>.
I committed a fix.
Mike McCandless
http://blog.mikemccandless.com
On Sat, Apr 25, 2015 at 6:12 AM, Michael McCandless
<lu...@mikemccandless.com> wrote:
> New test, I'll dig ...
>
> Mike McCandless
>
> http://blog.mikemccandless.com
>
>
> On Sat, Apr 25, 2015 at 5:18 AM, Policeman Jenkins Server
> <je...@thetaphi.de> wrote:
>> Build: http://jenkins.thetaphi.de/job/Lucene-Solr-trunk-Linux/12442/
>> Java: 64bit/jdk1.9.0-ea-b54 -XX:-UseCompressedOops -XX:+UseConcMarkSweepGC
>>
>> 1 tests failed.
>> FAILED: org.apache.lucene.search.postingshighlight.TestPostingsHighlighter.testFieldSometimesMissingFromSegment
>>
>> Error Message:
>>
>>
>> Stack Trace:
>> java.lang.AssertionError
>> at __randomizedtesting.SeedInfo.seed([2763EB5315F0D5DC:36C9088FF5CEEC0F]:0)
>> at org.junit.Assert.fail(Assert.java:92)
>> at org.junit.Assert.assertTrue(Assert.java:43)
>> at org.junit.Assert.assertNull(Assert.java:551)
>> at org.junit.Assert.assertNull(Assert.java:562)
>> at org.apache.lucene.search.postingshighlight.TestPostingsHighlighter.testFieldSometimesMissingFromSegment(TestPostingsHighlighter.java:1154)
>> at sun.reflect.NativeMethodAccessorImpl.invoke0(Native Method)
>> at sun.reflect.NativeMethodAccessorImpl.invoke(NativeMethodAccessorImpl.java:62)
>> at sun.reflect.DelegatingMethodAccessorImpl.invoke(DelegatingMethodAccessorImpl.java:43)
>> at java.lang.reflect.Method.invoke(Method.java:502)
>> at com.carrotsearch.randomizedtesting.RandomizedRunner.invoke(RandomizedRunner.java:1627)
>> at com.carrotsearch.randomizedtesting.RandomizedRunner$6.evaluate(RandomizedRunner.java:836)
>> at com.carrotsearch.randomizedtesting.RandomizedRunner$7.evaluate(RandomizedRunner.java:872)
>> at com.carrotsearch.randomizedtesting.RandomizedRunner$8.evaluate(RandomizedRunner.java:886)
>> at org.apache.lucene.util.TestRuleSetupTeardownChained$1.evaluate(TestRuleSetupTeardownChained.java:50)
>> at org.apache.lucene.util.AbstractBeforeAfterRule$1.evaluate(AbstractBeforeAfterRule.java:46)
>> at org.apache.lucene.util.TestRuleThreadAndTestName$1.evaluate(TestRuleThreadAndTestName.java:49)
>> at org.apache.lucene.util.TestRuleIgnoreAfterMaxFailures$1.evaluate(TestRuleIgnoreAfterMaxFailures.java:65)
>> at org.apache.lucene.util.TestRuleMarkFailure$1.evaluate(TestRuleMarkFailure.java:48)
>> at com.carrotsearch.randomizedtesting.rules.StatementAdapter.evaluate(StatementAdapter.java:36)
>> at com.carrotsearch.randomizedtesting.ThreadLeakControl$StatementRunner.run(ThreadLeakControl.java:365)
>> at com.carrotsearch.randomizedtesting.ThreadLeakControl.forkTimeoutingTask(ThreadLeakControl.java:798)
>> at com.carrotsearch.randomizedtesting.ThreadLeakControl$3.evaluate(ThreadLeakControl.java:458)
>> at com.carrotsearch.randomizedtesting.RandomizedRunner.runSingleTest(RandomizedRunner.java:845)
>> at com.carrotsearch.randomizedtesting.RandomizedRunner$3.evaluate(RandomizedRunner.java:747)
>> at com.carrotsearch.randomizedtesting.RandomizedRunner$4.evaluate(RandomizedRunner.java:781)
>> at com.carrotsearch.randomizedtesting.RandomizedRunner$5.evaluate(RandomizedRunner.java:792)
>> at org.apache.lucene.util.AbstractBeforeAfterRule$1.evaluate(AbstractBeforeAfterRule.java:46)
>> at com.carrotsearch.randomizedtesting.rules.StatementAdapter.evaluate(StatementAdapter.java:36)
>> at org.apache.lucene.util.TestRuleStoreClassName$1.evaluate(TestRuleStoreClassName.java:42)
>> at com.carrotsearch.randomizedtesting.rules.NoShadowingOrOverridesOnMethodsRule$1.evaluate(NoShadowingOrOverridesOnMethodsRule.java:39)
>> at com.carrotsearch.randomizedtesting.rules.NoShadowingOrOverridesOnMethodsRule$1.evaluate(NoShadowingOrOverridesOnMethodsRule.java:39)
>> at com.carrotsearch.randomizedtesting.rules.StatementAdapter.evaluate(StatementAdapter.java:36)
>> at com.carrotsearch.randomizedtesting.rules.StatementAdapter.evaluate(StatementAdapter.java:36)
>> at com.carrotsearch.randomizedtesting.rules.StatementAdapter.evaluate(StatementAdapter.java:36)
>> at org.apache.lucene.util.TestRuleAssertionsRequired$1.evaluate(TestRuleAssertionsRequired.java:54)
>> at org.apache.lucene.util.TestRuleMarkFailure$1.evaluate(TestRuleMarkFailure.java:48)
>> at org.apache.lucene.util.TestRuleIgnoreAfterMaxFailures$1.evaluate(TestRuleIgnoreAfterMaxFailures.java:65)
>> at org.apache.lucene.util.TestRuleIgnoreTestSuites$1.evaluate(TestRuleIgnoreTestSuites.java:55)
>> at com.carrotsearch.randomizedtesting.rules.StatementAdapter.evaluate(StatementAdapter.java:36)
>> at com.carrotsearch.randomizedtesting.ThreadLeakControl$StatementRunner.run(ThreadLeakControl.java:365)
>> at java.lang.Thread.run(Thread.java:745)
>>
>>
>>
>>
>> Build Log:
>> [...truncated 6846 lines...]
>> [junit4] Suite: org.apache.lucene.search.postingshighlight.TestPostingsHighlighter
>> [junit4] 2> NOTE: reproduce with: ant test -Dtestcase=TestPostingsHighlighter -Dtests.method=testFieldSometimesMissingFromSegment -Dtests.seed=2763EB5315F0D5DC -Dtests.multiplier=3 -Dtests.slow=true -Dtests.locale=zh_SG_#Hans -Dtests.timezone=Asia/Kuwait -Dtests.asserts=true -Dtests.file.encoding=UTF-8
>> [junit4] FAILURE 0.06s J2 | TestPostingsHighlighter.testFieldSometimesMissingFromSegment <<<
>> [junit4] > Throwable #1: java.lang.AssertionError
>> [junit4] > at __randomizedtesting.SeedInfo.seed([2763EB5315F0D5DC:36C9088FF5CEEC0F]:0)
>> [junit4] > at org.apache.lucene.search.postingshighlight.TestPostingsHighlighter.testFieldSometimesMissingFromSegment(TestPostingsHighlighter.java:1154)
>> [junit4] > at java.lang.Thread.run(Thread.java:745)
>> [junit4] 2> NOTE: test params are: codec=CheapBastard, sim=DefaultSimilarity, locale=zh_SG_#Hans, timezone=Asia/Kuwait
>> [junit4] 2> NOTE: Linux 3.13.0-49-generic amd64/Oracle Corporation 1.9.0-ea (64-bit)/cpus=12,threads=1,free=446203712,total=508887040
>> [junit4] 2> NOTE: All tests run in this JVM: [SimpleBoundaryScannerTest, ScoreOrderFragmentsBuilderTest, TestPostingsHighlighter]
>> [junit4] Completed [5/22] on J2 in 1.45s, 31 tests, 1 failure <<< FAILURES!
>>
>> [...truncated 62 lines...]
>> BUILD FAILED
>> /home/jenkins/workspace/Lucene-Solr-trunk-Linux/build.xml:526: The following error occurred while executing this line:
>> /home/jenkins/workspace/Lucene-Solr-trunk-Linux/build.xml:474: The following error occurred while executing this line:
>> /home/jenkins/workspace/Lucene-Solr-trunk-Linux/build.xml:61: The following error occurred while executing this line:
>> /home/jenkins/workspace/Lucene-Solr-trunk-Linux/extra-targets.xml:39: The following error occurred while executing this line:
>> /home/jenkins/workspace/Lucene-Solr-trunk-Linux/lucene/build.xml:466: The following error occurred while executing this line:
>> /home/jenkins/workspace/Lucene-Solr-trunk-Linux/lucene/common-build.xml:2145: The following error occurred while executing this line:
>> /home/jenkins/workspace/Lucene-Solr-trunk-Linux/lucene/module-build.xml:58: The following error occurred while executing this line:
>> /home/jenkins/workspace/Lucene-Solr-trunk-Linux/lucene/common-build.xml:1415: The following error occurred while executing this line:
>> /home/jenkins/workspace/Lucene-Solr-trunk-Linux/lucene/common-build.xml:973: There were test failures: 22 suites, 251 tests, 1 failure
>>
>> Total time: 14 minutes 13 seconds
>> Build step 'Invoke Ant' marked build as failure
>> Archiving artifacts
>> Recording test results
>> Email was triggered for: Failure - Any
>> Sending email for trigger: Failure - Any
>>
>>
>>
>>
>> ---------------------------------------------------------------------
>> To unsubscribe, e-mail: dev-unsubscribe@lucene.apache.org
>> For additional commands, e-mail: dev-help@lucene.apache.org
---------------------------------------------------------------------
To unsubscribe, e-mail: dev-unsubscribe@lucene.apache.org
For additional commands, e-mail: dev-help@lucene.apache.org
Re: [JENKINS] Lucene-Solr-trunk-Linux (64bit/jdk1.9.0-ea-b54) - Build
# 12442 - Failure!
Posted by Michael McCandless <lu...@mikemccandless.com>.
New test, I'll dig ...
Mike McCandless
http://blog.mikemccandless.com
On Sat, Apr 25, 2015 at 5:18 AM, Policeman Jenkins Server
<je...@thetaphi.de> wrote:
> Build: http://jenkins.thetaphi.de/job/Lucene-Solr-trunk-Linux/12442/
> Java: 64bit/jdk1.9.0-ea-b54 -XX:-UseCompressedOops -XX:+UseConcMarkSweepGC
>
> 1 tests failed.
> FAILED: org.apache.lucene.search.postingshighlight.TestPostingsHighlighter.testFieldSometimesMissingFromSegment
>
> Error Message:
>
>
> Stack Trace:
> java.lang.AssertionError
> at __randomizedtesting.SeedInfo.seed([2763EB5315F0D5DC:36C9088FF5CEEC0F]:0)
> at org.junit.Assert.fail(Assert.java:92)
> at org.junit.Assert.assertTrue(Assert.java:43)
> at org.junit.Assert.assertNull(Assert.java:551)
> at org.junit.Assert.assertNull(Assert.java:562)
> at org.apache.lucene.search.postingshighlight.TestPostingsHighlighter.testFieldSometimesMissingFromSegment(TestPostingsHighlighter.java:1154)
> at sun.reflect.NativeMethodAccessorImpl.invoke0(Native Method)
> at sun.reflect.NativeMethodAccessorImpl.invoke(NativeMethodAccessorImpl.java:62)
> at sun.reflect.DelegatingMethodAccessorImpl.invoke(DelegatingMethodAccessorImpl.java:43)
> at java.lang.reflect.Method.invoke(Method.java:502)
> at com.carrotsearch.randomizedtesting.RandomizedRunner.invoke(RandomizedRunner.java:1627)
> at com.carrotsearch.randomizedtesting.RandomizedRunner$6.evaluate(RandomizedRunner.java:836)
> at com.carrotsearch.randomizedtesting.RandomizedRunner$7.evaluate(RandomizedRunner.java:872)
> at com.carrotsearch.randomizedtesting.RandomizedRunner$8.evaluate(RandomizedRunner.java:886)
> at org.apache.lucene.util.TestRuleSetupTeardownChained$1.evaluate(TestRuleSetupTeardownChained.java:50)
> at org.apache.lucene.util.AbstractBeforeAfterRule$1.evaluate(AbstractBeforeAfterRule.java:46)
> at org.apache.lucene.util.TestRuleThreadAndTestName$1.evaluate(TestRuleThreadAndTestName.java:49)
> at org.apache.lucene.util.TestRuleIgnoreAfterMaxFailures$1.evaluate(TestRuleIgnoreAfterMaxFailures.java:65)
> at org.apache.lucene.util.TestRuleMarkFailure$1.evaluate(TestRuleMarkFailure.java:48)
> at com.carrotsearch.randomizedtesting.rules.StatementAdapter.evaluate(StatementAdapter.java:36)
> at com.carrotsearch.randomizedtesting.ThreadLeakControl$StatementRunner.run(ThreadLeakControl.java:365)
> at com.carrotsearch.randomizedtesting.ThreadLeakControl.forkTimeoutingTask(ThreadLeakControl.java:798)
> at com.carrotsearch.randomizedtesting.ThreadLeakControl$3.evaluate(ThreadLeakControl.java:458)
> at com.carrotsearch.randomizedtesting.RandomizedRunner.runSingleTest(RandomizedRunner.java:845)
> at com.carrotsearch.randomizedtesting.RandomizedRunner$3.evaluate(RandomizedRunner.java:747)
> at com.carrotsearch.randomizedtesting.RandomizedRunner$4.evaluate(RandomizedRunner.java:781)
> at com.carrotsearch.randomizedtesting.RandomizedRunner$5.evaluate(RandomizedRunner.java:792)
> at org.apache.lucene.util.AbstractBeforeAfterRule$1.evaluate(AbstractBeforeAfterRule.java:46)
> at com.carrotsearch.randomizedtesting.rules.StatementAdapter.evaluate(StatementAdapter.java:36)
> at org.apache.lucene.util.TestRuleStoreClassName$1.evaluate(TestRuleStoreClassName.java:42)
> at com.carrotsearch.randomizedtesting.rules.NoShadowingOrOverridesOnMethodsRule$1.evaluate(NoShadowingOrOverridesOnMethodsRule.java:39)
> at com.carrotsearch.randomizedtesting.rules.NoShadowingOrOverridesOnMethodsRule$1.evaluate(NoShadowingOrOverridesOnMethodsRule.java:39)
> at com.carrotsearch.randomizedtesting.rules.StatementAdapter.evaluate(StatementAdapter.java:36)
> at com.carrotsearch.randomizedtesting.rules.StatementAdapter.evaluate(StatementAdapter.java:36)
> at com.carrotsearch.randomizedtesting.rules.StatementAdapter.evaluate(StatementAdapter.java:36)
> at org.apache.lucene.util.TestRuleAssertionsRequired$1.evaluate(TestRuleAssertionsRequired.java:54)
> at org.apache.lucene.util.TestRuleMarkFailure$1.evaluate(TestRuleMarkFailure.java:48)
> at org.apache.lucene.util.TestRuleIgnoreAfterMaxFailures$1.evaluate(TestRuleIgnoreAfterMaxFailures.java:65)
> at org.apache.lucene.util.TestRuleIgnoreTestSuites$1.evaluate(TestRuleIgnoreTestSuites.java:55)
> at com.carrotsearch.randomizedtesting.rules.StatementAdapter.evaluate(StatementAdapter.java:36)
> at com.carrotsearch.randomizedtesting.ThreadLeakControl$StatementRunner.run(ThreadLeakControl.java:365)
> at java.lang.Thread.run(Thread.java:745)
>
>
>
>
> Build Log:
> [...truncated 6846 lines...]
> [junit4] Suite: org.apache.lucene.search.postingshighlight.TestPostingsHighlighter
> [junit4] 2> NOTE: reproduce with: ant test -Dtestcase=TestPostingsHighlighter -Dtests.method=testFieldSometimesMissingFromSegment -Dtests.seed=2763EB5315F0D5DC -Dtests.multiplier=3 -Dtests.slow=true -Dtests.locale=zh_SG_#Hans -Dtests.timezone=Asia/Kuwait -Dtests.asserts=true -Dtests.file.encoding=UTF-8
> [junit4] FAILURE 0.06s J2 | TestPostingsHighlighter.testFieldSometimesMissingFromSegment <<<
> [junit4] > Throwable #1: java.lang.AssertionError
> [junit4] > at __randomizedtesting.SeedInfo.seed([2763EB5315F0D5DC:36C9088FF5CEEC0F]:0)
> [junit4] > at org.apache.lucene.search.postingshighlight.TestPostingsHighlighter.testFieldSometimesMissingFromSegment(TestPostingsHighlighter.java:1154)
> [junit4] > at java.lang.Thread.run(Thread.java:745)
> [junit4] 2> NOTE: test params are: codec=CheapBastard, sim=DefaultSimilarity, locale=zh_SG_#Hans, timezone=Asia/Kuwait
> [junit4] 2> NOTE: Linux 3.13.0-49-generic amd64/Oracle Corporation 1.9.0-ea (64-bit)/cpus=12,threads=1,free=446203712,total=508887040
> [junit4] 2> NOTE: All tests run in this JVM: [SimpleBoundaryScannerTest, ScoreOrderFragmentsBuilderTest, TestPostingsHighlighter]
> [junit4] Completed [5/22] on J2 in 1.45s, 31 tests, 1 failure <<< FAILURES!
>
> [...truncated 62 lines...]
> BUILD FAILED
> /home/jenkins/workspace/Lucene-Solr-trunk-Linux/build.xml:526: The following error occurred while executing this line:
> /home/jenkins/workspace/Lucene-Solr-trunk-Linux/build.xml:474: The following error occurred while executing this line:
> /home/jenkins/workspace/Lucene-Solr-trunk-Linux/build.xml:61: The following error occurred while executing this line:
> /home/jenkins/workspace/Lucene-Solr-trunk-Linux/extra-targets.xml:39: The following error occurred while executing this line:
> /home/jenkins/workspace/Lucene-Solr-trunk-Linux/lucene/build.xml:466: The following error occurred while executing this line:
> /home/jenkins/workspace/Lucene-Solr-trunk-Linux/lucene/common-build.xml:2145: The following error occurred while executing this line:
> /home/jenkins/workspace/Lucene-Solr-trunk-Linux/lucene/module-build.xml:58: The following error occurred while executing this line:
> /home/jenkins/workspace/Lucene-Solr-trunk-Linux/lucene/common-build.xml:1415: The following error occurred while executing this line:
> /home/jenkins/workspace/Lucene-Solr-trunk-Linux/lucene/common-build.xml:973: There were test failures: 22 suites, 251 tests, 1 failure
>
> Total time: 14 minutes 13 seconds
> Build step 'Invoke Ant' marked build as failure
> Archiving artifacts
> Recording test results
> Email was triggered for: Failure - Any
> Sending email for trigger: Failure - Any
>
>
>
>
> ---------------------------------------------------------------------
> To unsubscribe, e-mail: dev-unsubscribe@lucene.apache.org
> For additional commands, e-mail: dev-help@lucene.apache.org
---------------------------------------------------------------------
To unsubscribe, e-mail: dev-unsubscribe@lucene.apache.org
For additional commands, e-mail: dev-help@lucene.apache.org