You are viewing a plain text version of this content. The canonical link for it is here.
Posted to issues@tez.apache.org by Apache Jenkins Server <je...@builds.apache.org> on 2015/06/04 00:52:07 UTC
Failed: TEZ-2489 PreCommit Build #788
Jira: https://issues.apache.org/jira/browse/TEZ-2489
Build: https://builds.apache.org/job/PreCommit-TEZ-Build/788/
###################################################################################
########################## LAST 60 LINES OF THE CONSOLE ###########################
[...truncated 3018 lines...]
{color:red}-1 overall{color}. Here are the results of testing the latest attachment
http://issues.apache.org/jira/secure/attachment/12737379/TEZ-2489.patch
against master revision d2b2749.
{color:green}+1 @author{color}. The patch does not contain any @author tags.
{color:red}-1 tests included{color}. The patch doesn't appear to include any new or modified tests.
Please justify why no new tests are needed for this patch.
Also please list what manual steps were performed to verify this patch.
{color:green}+1 javac{color}. The applied patch does not increase the total number of javac compiler warnings.
{color:green}+1 javadoc{color}. There were no new javadoc warning messages.
{color:green}+1 findbugs{color}. The patch does not introduce any new Findbugs (version 3.0.1) warnings.
{color:green}+1 release audit{color}. The applied patch does not increase the total number of release audit warnings.
{color:green}+1 core tests{color}. The patch passed unit tests in .
Test results: https://builds.apache.org/job/PreCommit-TEZ-Build/788//testReport/
Console output: https://builds.apache.org/job/PreCommit-TEZ-Build/788//console
This message is automatically generated.
======================================================================
======================================================================
Adding comment to Jira.
======================================================================
======================================================================
Comment added.
63a880e8cda4238c03fb2254e122b7158213e2f1 logged out
======================================================================
======================================================================
Finished build.
======================================================================
======================================================================
Build step 'Execute shell' marked build as failure
Archiving artifacts
Sending artifact delta relative to PreCommit-TEZ-Build #787
Archived 47 artifacts
Archive block size is 32768
Received 10 blocks and 2599028 bytes
Compression is 11.2%
Took 1.6 sec
[description-setter] Could not determine description.
Recording test results
Email was triggered for: Failure
Sending email for trigger: Failure
###################################################################################
############################## FAILED TESTS (if any) ##############################
All tests passed
Success: TEZ-2538 PreCommit Build #790
Posted by Apache Jenkins Server <je...@builds.apache.org>.
Jira: https://issues.apache.org/jira/browse/TEZ-2538
Build: https://builds.apache.org/job/PreCommit-TEZ-Build/790/
###################################################################################
########################## LAST 60 LINES OF THE CONSOLE ###########################
[...truncated 3017 lines...]
[INFO] Final Memory: 77M/1009M
[INFO] ------------------------------------------------------------------------
{color:green}+1 overall{color}. Here are the results of testing the latest attachment
http://issues.apache.org/jira/secure/attachment/12737465/TEZ-2538.1.patch
against master revision d2b2749.
{color:green}+1 @author{color}. The patch does not contain any @author tags.
{color:green}+1 tests included{color}. The patch appears to include 2 new or modified test files.
{color:green}+1 javac{color}. The applied patch does not increase the total number of javac compiler warnings.
{color:green}+1 javadoc{color}. There were no new javadoc warning messages.
{color:green}+1 findbugs{color}. The patch does not introduce any new Findbugs (version 3.0.1) warnings.
{color:green}+1 release audit{color}. The applied patch does not increase the total number of release audit warnings.
{color:green}+1 core tests{color}. The patch passed unit tests in .
Test results: https://builds.apache.org/job/PreCommit-TEZ-Build/790//testReport/
Console output: https://builds.apache.org/job/PreCommit-TEZ-Build/790//console
This message is automatically generated.
======================================================================
======================================================================
Adding comment to Jira.
======================================================================
======================================================================
Comment added.
2590110e96e9ebb174a0e8bd1c236912d05c7c6e logged out
======================================================================
======================================================================
Finished build.
======================================================================
======================================================================
Archiving artifacts
Sending artifact delta relative to PreCommit-TEZ-Build #787
Archived 47 artifacts
Archive block size is 32768
Received 8 blocks and 2665283 bytes
Compression is 9.0%
Took 1.4 sec
Description set: TEZ-2538
Recording test results
Email was triggered for: Success
Sending email for trigger: Success
###################################################################################
############################## FAILED TESTS (if any) ##############################
All tests passed
Failed: TEZ-2537 PreCommit Build #789
Posted by Apache Jenkins Server <je...@builds.apache.org>.
Jira: https://issues.apache.org/jira/browse/TEZ-2537
Build: https://builds.apache.org/job/PreCommit-TEZ-Build/789/
###################################################################################
########################## LAST 60 LINES OF THE CONSOLE ###########################
[...truncated 3018 lines...]
{color:red}-1 overall{color}. Here are the results of testing the latest attachment
http://issues.apache.org/jira/secure/attachment/12737392/TEZ-2537.1.patch
against master revision d2b2749.
{color:green}+1 @author{color}. The patch does not contain any @author tags.
{color:red}-1 tests included{color}. The patch doesn't appear to include any new or modified tests.
Please justify why no new tests are needed for this patch.
Also please list what manual steps were performed to verify this patch.
{color:green}+1 javac{color}. The applied patch does not increase the total number of javac compiler warnings.
{color:green}+1 javadoc{color}. There were no new javadoc warning messages.
{color:green}+1 findbugs{color}. The patch does not introduce any new Findbugs (version 3.0.1) warnings.
{color:green}+1 release audit{color}. The applied patch does not increase the total number of release audit warnings.
{color:green}+1 core tests{color}. The patch passed unit tests in .
Test results: https://builds.apache.org/job/PreCommit-TEZ-Build/789//testReport/
Console output: https://builds.apache.org/job/PreCommit-TEZ-Build/789//console
This message is automatically generated.
======================================================================
======================================================================
Adding comment to Jira.
======================================================================
======================================================================
Comment added.
192381762a1d940ed398ea1b96a6603b9019e28b logged out
======================================================================
======================================================================
Finished build.
======================================================================
======================================================================
Build step 'Execute shell' marked build as failure
Archiving artifacts
Sending artifact delta relative to PreCommit-TEZ-Build #787
Archived 47 artifacts
Archive block size is 32768
Received 10 blocks and 2596079 bytes
Compression is 11.2%
Took 0.81 sec
[description-setter] Could not determine description.
Recording test results
Email was triggered for: Failure
Sending email for trigger: Failure
###################################################################################
############################## FAILED TESTS (if any) ##############################
All tests passed