You are viewing a plain text version of this content. The canonical link for it is here.
Posted to dev@jmeter.apache.org by Apache Jenkins Server <je...@builds.apache.org> on 2025/10/08 12:49:29 UTC
Build failed in Jenkins: JMeter » JMeter-trunk #833
See <https://ci-builds.apache.org/job/JMeter/job/JMeter-trunk/833/display/redirect?page=changes>
Changes:
[Vladimir Sitnikov] chore(config): migrate config renovate.json
------------------------------------------
Started by GitHub push by vlsi
Started by GitHub push by vlsi
Running as SYSTEM
[EnvInject] - Loading node environment variables.
Building remotely on builds57 (ubuntu ubuntu-avx) in workspace <https://ci-builds.apache.org/job/JMeter/job/JMeter-trunk/ws/>
[WS-CLEANUP] Deleting project workspace...
[WS-CLEANUP] Done
The recommended git tool is: NONE
No credentials specified
> git rev-parse --resolve-git-dir <https://ci-builds.apache.org/job/JMeter/job/JMeter-trunk/ws/.git> # timeout=10
Fetching changes from the remote Git repository
> git config remote.origin.url https://github.com/apache/jmeter.git # timeout=10
Fetching upstream changes from https://github.com/apache/jmeter.git
> git --version # timeout=10
> git --version # 'git version 2.34.1'
> git fetch --tags --force --progress -- https://github.com/apache/jmeter.git +refs/heads/*:refs/remotes/origin/* # timeout=10
> git rev-parse refs/remotes/origin/master^{commit} # timeout=10
Checking out Revision 71559972dca5c7f23dafe884eb9fd386028c54f8 (refs/remotes/origin/master)
> git config core.sparsecheckout # timeout=10
> git checkout -f 71559972dca5c7f23dafe884eb9fd386028c54f8 # timeout=10
Commit message: "chore(config): migrate config renovate.json"
> git rev-list --no-walk cc9ba1f2406ad3883a7a60717a43bacd65196a98 # timeout=10
Xvfb starting$ /usr/bin/Xvfb :1 -fbdir <https://ci-builds.apache.org/job/JMeter/job/JMeter-trunk/ws/.xvfb-833-..fbdir311450202341749529>
[EnvInject] - Executing scripts and injecting environment variables after the SCM step.
[EnvInject] - Injecting as environment variables the properties content
SONAR_HOST_URL=https://sonarcloud.io
[EnvInject] - Variables injected successfully.
[EnvInject] - Mask passwords that will be passed as build parameters.
[Gradle] - Launching build.
[JMeter-trunk] $ <https://ci-builds.apache.org/job/JMeter/job/JMeter-trunk/ws/gradlew> "-Dorg.gradle.jvmargs=-Xmx2g -XX:MaxMetaspaceSize=1g" -Pcoverage=true -PignoreSpotBugsFailures=true -Pasf=true -PCI=true -Pspotbugs=true --profile --no-daemon publish cleanTest check assemble
To honour the JVM settings for this build a single-use Daemon process will be forked. For more on this, please refer to https://docs.gradle.org/8.14.3/userguide/gradle_daemon.html#sec:disabling_the_daemon in the Gradle documentation.
Daemon will be stopped at the end of the build
Using the build cache is enabled, but no build caches are configured or enabled.
Type-safe project accessors is an incubating feature.
Invalid Java installation found at '/usr/local/asfpackages/java/oraclejdk-j2sdk1.4.2-19' (Maven Toolchains) auto-detected. It will be re-checked in the next build. This might have performance impact if it keeps failing. Run the 'javaToolchains' task for more details.
> Task :build-logic-commons:gradle-plugin:checkKotlinGradlePluginConfigurationErrors SKIPPED
> Task :build-logic-commons:gradle-plugin:generateExternalPluginSpecBuilders UP-TO-DATE
> Task :build-logic-commons:gradle-plugin:extractPrecompiledScriptPluginPlugins UP-TO-DATE
> Task :build-logic-commons:gradle-plugin:compilePluginsBlocks UP-TO-DATE
> Task :build-logic-commons:gradle-plugin:generatePrecompiledScriptPluginAccessors UP-TO-DATE
> Task :build-logic-commons:gradle-plugin:generateScriptPluginAdapters UP-TO-DATE
> Task :build-logic-commons:gradle-plugin:compileKotlin UP-TO-DATE
> Task :build-logic-commons:gradle-plugin:compileJava NO-SOURCE
> Task :build-logic-commons:gradle-plugin:pluginDescriptors UP-TO-DATE
> Task :build-logic-commons:gradle-plugin:processResources UP-TO-DATE
> Task :build-logic-commons:gradle-plugin:classes UP-TO-DATE
> Task :build-logic-commons:gradle-plugin:jar UP-TO-DATE
> Task :build-logic:build-parameters:checkKotlinGradlePluginConfigurationErrors SKIPPED
> Task :build-logic:basics:checkKotlinGradlePluginConfigurationErrors SKIPPED
> Task :build-logic:root-build:checkKotlinGradlePluginConfigurationErrors SKIPPED
> Task :build-logic:verification:checkKotlinGradlePluginConfigurationErrors SKIPPED
> Task :build-logic:basics:extractPrecompiledScriptPluginPlugins UP-TO-DATE
> Task :build-logic:root-build:extractPrecompiledScriptPluginPlugins UP-TO-DATE
> Task :build-logic:basics:generateScriptPluginAdapters UP-TO-DATE
> Task :build-logic:build-parameters:generatePluginCode UP-TO-DATE
> Task :build-logic:root-build:generateScriptPluginAdapters UP-TO-DATE
> Task :build-logic:verification:extractPrecompiledScriptPluginPlugins UP-TO-DATE
> Task :build-logic:root-build:pluginDescriptors UP-TO-DATE
> Task :build-logic:basics:pluginDescriptors UP-TO-DATE
> Task :build-logic:verification:generateScriptPluginAdapters UP-TO-DATE
> Task :build-logic:build-parameters:compileKotlin NO-SOURCE
> Task :build-logic:verification:pluginDescriptors UP-TO-DATE
> Task :build-logic:root-build:processResources UP-TO-DATE
> Task :build-logic:basics:processResources UP-TO-DATE
> Task :build-logic:verification:processResources UP-TO-DATE
> Task :build-logic:build-parameters:compileJava UP-TO-DATE
> Task :build-logic:build-parameters:pluginDescriptors UP-TO-DATE
> Task :build-logic:basics:generateExternalPluginSpecBuilders UP-TO-DATE
> Task :build-logic:build-parameters:processResources UP-TO-DATE
> Task :build-logic:build-parameters:classes UP-TO-DATE
> Task :build-logic:build-parameters:jar UP-TO-DATE
> Task :build-logic:basics:compilePluginsBlocks UP-TO-DATE
> Task :build-logic:basics:generatePrecompiledScriptPluginAccessors UP-TO-DATE
> Task :build-logic:basics:compileKotlin UP-TO-DATE
> Task :build-logic:basics:compileJava NO-SOURCE
> Task :build-logic:basics:classes UP-TO-DATE
> Task :build-logic:basics:jar UP-TO-DATE
> Task :build-logic:verification:generateExternalPluginSpecBuilders UP-TO-DATE
> Task :build-logic:verification:compilePluginsBlocks UP-TO-DATE
> Task :build-logic:verification:generatePrecompiledScriptPluginAccessors UP-TO-DATE
> Task :build-logic:verification:compileKotlin UP-TO-DATE
> Task :build-logic:verification:compileJava NO-SOURCE
> Task :build-logic:verification:classes UP-TO-DATE
> Task :build-logic:verification:jar UP-TO-DATE
> Task :build-logic:root-build:generateExternalPluginSpecBuilders UP-TO-DATE
> Task :build-logic:root-build:compilePluginsBlocks UP-TO-DATE
> Task :build-logic:root-build:generatePrecompiledScriptPluginAccessors FAILED
FAILURE: Build failed with an exception.
* What went wrong:
Execution failed for task ':build-logic:root-build:generatePrecompiledScriptPluginAccessors'.
> Failed to generate type-safe Gradle model accessors for the following precompiled script plugins:
- src/main/kotlin/build-logic.root-build.gradle.kts
> A build operation failed.
Could not read workspace metadata from /home/jenkins/.gradle/caches/8.14.3/transforms/4cbff65bbf11dc0acd8f08784d36d6c0/metadata.bin
> Could not read workspace metadata from /home/jenkins/.gradle/caches/8.14.3/transforms/4cbff65bbf11dc0acd8f08784d36d6c0/metadata.bin
* Try:
> Run with --stacktrace option to get the stack trace.
> Run with --info or --debug option to get more log output.
> Get more help at https://help.gradle.org.
BUILD FAILED in 13s
39 actionable tasks: 1 executed, 38 up-to-date
FAILURE: Build failed with an exception.
* What went wrong:
Execution failed for task ':build-logic:root-build:generatePrecompiledScriptPluginAccessors'.
> Failed to generate type-safe Gradle model accessors for the following precompiled script plugins:
- src/main/kotlin/build-logic.root-build.gradle.kts
> A build operation failed.
Could not read workspace metadata from /home/jenkins/.gradle/caches/8.14.3/transforms/4cbff65bbf11dc0acd8f08784d36d6c0/metadata.bin
> Could not read workspace metadata from /home/jenkins/.gradle/caches/8.14.3/transforms/4cbff65bbf11dc0acd8f08784d36d6c0/metadata.bin
* Try:
> Run with --stacktrace option to get the stack trace.
> Run with --info or --debug option to get more log output.
> Run with --scan to get full insights.
> Get more help at https://help.gradle.org.
BUILD FAILED in 13s
FAILURE: Build failed with an exception.
* What went wrong:
Could not receive a message from the daemon.
* Try:
> Run with --stacktrace option to get the stack trace.
> Run with --info or --debug option to get more log output.
> Run with --scan to get full insights.
> Get more help at https://help.gradle.org.
Build step 'Invoke Gradle script' changed build result to FAILURE
Build step 'Invoke Gradle script' marked build as failure
Xvfb stopping
Archiving artifacts
Recording test results
ERROR: Step ‘Publish JUnit test result report’ failed: No test report files were found. Configuration error?