You are viewing a plain text version of this content. The canonical link for it is here.
Posted to notifications@maven.apache.org by Apache Jenkins Server <je...@builds.apache.org> on 2017/12/11 11:34:17 UTC
Maven Jenkinsfile finished with null
See https://builds.apache.org/job/maven-wip/job/maven/job/pre-reset-master/2/
Build unstable in Jenkins: Maven TLP (wip) » maven » pre-reset-master #3
Posted by Apache Jenkins Server <je...@builds.apache.org>.
See https://builds.apache.org/job/maven-wip/job/maven/job/pre-reset-master/3/
Changes:
* Noting INFRA-15651
* Typowq
* Update Jenkinsfile
* upgraded parent pom
* MNG-2199 contribution from Christian
* o Updated to run the ITs using the POSIX locale.
* [MNG-2199] Support version ranges in parent elements
* o Updated to set LC_ALL=C in addition to LANG=C to run the ITs using the
* [MNG-2199] Support version ranges in parent elements
* [MNG-5359] Declared execution in PluginMgmt gets bound to lifecycle
* [MNG-5359] Declared execution in PluginMgmt gets bound to lifecycle
* [MNG-5359] Declared execution in PluginMgmt gets bound to lifecycle
* [MNG-5581] Provide a way to customize lifecycle mapping logic
* [MNG-5581] Provide a way to customize lifecycle mapping logic
* [MNG-5359] Declared execution in PluginMgmt gets bound to lifecycle
* [MNG-5581] Provide a way to customize lifecycle mapping logic
* Use the proper term for char U+002D (-) hyphen(-minus) instead of dash
* fixed little mistake in c09aaa35
* [MNG-5359] Declared execution in PluginMgmt gets bound to lifecycle
* [MNG-5581] Provide a way to customize lifecycle mapping logic
* [MNG-5359] Declared execution in PluginMgmt gets bound to lifecycle
* [MNG-5359] updated Jira issue url
* [MNG-5968] Default plugin version updates.
* [MNG-5968] Default plugin version updates.
* o Updated the URL of the central repository. o Updated to run ITs with a
* [MNG-5227] The 'optional' flag of a dependency should be manageable.
* [MNG-4600] [regression] Optional flag from dependency management applied
* [MNG-5940] Change the maven-source-plugin jar goal into jar-no-fork in
* [MNG-4463] Version ranges cannot be used for artifacts with 'import'
* [MNG-4463] Version ranges cannot be used for artifacts with 'import'
* o Updated to correct regular expression.
* [MNG-3259] Regression: Maven drops dependencies in multi-module build
* [MNG-5783] cobertura-maven-plugin:instrument failing
* [MNG-5958] restore binary compatibility of Lifecycle.setPhases
* [MNG-5971] Imported dependencies should be available to inheritance
* [MNG-5971] Imported dependencies should be available to inheritance
* [MNG-2199] Support version ranges in parent elements
* [MNG-5971] Imported dependencies should be available to inheritance
* [MNG-2478] add filtered resource directories to super POM
* [MNG-5799] Incorrect execution order of plugins in the same phase
* SQUASH
* [MNG-2478] add filtered resource directories to super POM
* Revert "SQUASH"
* added color to ITs run tracking
* use MSHARED-547 to support Maven colorized output in ITs
* [MNG-5971] Imported dependencies should be available to inheritance
* [MNG-5227] Make 'optional' flag of a dependency manageable.
* improved explanation about embedded mode
* [MNG-5600] Dependency management import should support exclusions.
* [MNG-5527] Dependency management import should support relocations.
* [MNG-6049] Add behavior to filter resolved version ranges of an artifact
* [MNG-5527] Dependency management import should support relocations.
* [MNG-6049] Add behavior to filter resolved version ranges of an artifact
* o Updated to show the version the tests will be run with as early as
* [MNG-4645] Move central repo definition out of Maven's core so it can be
* [MNG-6055] Move the release profile out of Maven's core so it can be
* [MNG-6055] Move the release profile out of Maven's core so it can be
* [MNG-6075] Increase the model validation level to the next minor level
* [MNG-6075] Increase the model validation level to the next minor level
* [MNG-6079] 3.4 regression: cannot override version of a
* [MNG-6079] 3.4 regression: cannot override version of a
* [MNG-6079] 3.4 regression: cannot override version of a
* [MNG-6079] 3.4 regression: cannot override version of a
* [MNG-6082] Introduction of model version 4.1.0.
* [MNG-2478] add filtered resource directories to super POM
* print one space after padding
* o [MNG-6082] Introduction of model version 4.1.0.
* [MNG-4645] Move central repo definition out of Maven's core so it can be
* [MNG-2478] add filtered resource directories to super POM
* MNG-5889 added IT
* MNG-5889 moved IT to its own test suite to run it only with 3.4.0
* added missing license headers
* MNG-5889 force JVM fork to use the mvn script
* MNG-5889 check both short -f and long --file options
* [MNG-6084] Add test for JSR250 support
* [MNG-6127] Add plugin execution configuration interference test
* [MNG-6127] add integration test to suite
* [MNG-597] Imported dependencies should be available to inheritance
* [MNG-4721] Create an integration test to check handling of optional
* [MNG-5227] Make 'optional' flag of a dependency manageable.
* [MNG-5761] Dependency management is not transitive.
* o Updated to manage plugin dependencies to versions installed by the
* [MNG-4721] Create an integration test to check handling of optional
* [MNG-6135] Maven plugins and core extensions are not dependencies, they
* [MNG-6135] Maven plugins and core extensions are not dependencies, they
* [MNG-6139] Addition of command line option
* [MNG-3599] webdav does not set http-proxy correctly
* [MNG-6139] Addition of command line option
* upgraded parent pom
* MNG-2199 contribution from Christian
* o Updated to run the ITs using the POSIX locale.
* [MNG-2199] Support version ranges in parent elements
* o Updated to set LC_ALL=C in addition to LANG=C to run the ITs using the
* [MNG-2199] Support version ranges in parent elements
* [MNG-5359] Declared execution in PluginMgmt gets bound to lifecycle
* [MNG-5359] Declared execution in PluginMgmt gets bound to lifecycle
* [MNG-5359] Declared execution in PluginMgmt gets bound to lifecycle
* [MNG-5581] Provide a way to customize lifecycle mapping logic
* [MNG-5581] Provide a way to customize lifecycle mapping logic
* [MNG-5359] Declared execution in PluginMgmt gets bound to lifecycle
* [MNG-5581] Provide a way to customize lifecycle mapping logic
* Use the proper term for char U+002D (-) hyphen(-minus) instead of dash
* fixed little mistake in c09aaa35
* [MNG-5359] Declared execution in PluginMgmt gets bound to lifecycle
* [MNG-5581] Provide a way to customize lifecycle mapping logic
* [MNG-5359] Declared execution in PluginMgmt gets bound to lifecycle
* [MNG-5359] updated Jira issue url
* [MNG-5968] Default plugin version updates.
* [MNG-5968] Default plugin version updates.
* o Updated the URL of the central repository. o Updated to run ITs with a
* [MNG-5227] The 'optional' flag of a dependency should be manageable.
* [MNG-4600] [regression] Optional flag from dependency management applied
* [MNG-5940] Change the maven-source-plugin jar goal into jar-no-fork in
* [MNG-4463] Version ranges cannot be used for artifacts with 'import'
* [MNG-4463] Version ranges cannot be used for artifacts with 'import'
* o Updated to correct regular expression.
* [MNG-3259] Regression: Maven drops dependencies in multi-module build
* [MNG-5783] cobertura-maven-plugin:instrument failing
* [MNG-5958] restore binary compatibility of Lifecycle.setPhases
* [MNG-5971] Imported dependencies should be available to inheritance
* [MNG-5971] Imported dependencies should be available to inheritance
* [MNG-2199] Support version ranges in parent elements
* [MNG-5971] Imported dependencies should be available to inheritance
* [MNG-2478] add filtered resource directories to super POM
* [MNG-5799] Incorrect execution order of plugins in the same phase
* SQUASH
* [MNG-2478] add filtered resource directories to super POM
* Revert "SQUASH"
* added color to ITs run tracking
* use MSHARED-547 to support Maven colorized output in ITs
* [MNG-5971] Imported dependencies should be available to inheritance
* [MNG-5227] Make 'optional' flag of a dependency manageable.
* improved explanation about embedded mode
* [MNG-5600] Dependency management import should support exclusions.
* [MNG-5527] Dependency management import should support relocations.
* [MNG-6049] Add behavior to filter resolved version ranges of an artifact
* [MNG-5527] Dependency management import should support relocations.
* [MNG-6049] Add behavior to filter resolved version ranges of an artifact
* o Updated to show the version the tests will be run with as early as
* [MNG-4645] Move central repo definition out of Maven's core so it can be
* [MNG-6055] Move the release profile out of Maven's core so it can be
* [MNG-6055] Move the release profile out of Maven's core so it can be
* [MNG-6075] Increase the model validation level to the next minor level
* [MNG-6075] Increase the model validation level to the next minor level
* [MNG-6079] 3.4 regression: cannot override version of a
* [MNG-6079] 3.4 regression: cannot override version of a
* [MNG-6079] 3.4 regression: cannot override version of a
* [MNG-6079] 3.4 regression: cannot override version of a
* [MNG-6082] Introduction of model version 4.1.0.
* [MNG-2478] add filtered resource directories to super POM
* print one space after padding
* o [MNG-6082] Introduction of model version 4.1.0.
* [MNG-4645] Move central repo definition out of Maven's core so it can be
* [MNG-2478] add filtered resource directories to super POM
* MNG-5889 added IT
* MNG-5889 moved IT to its own test suite to run it only with 3.4.0
* added missing license headers
* MNG-5889 force JVM fork to use the mvn script
* MNG-5889 check both short -f and long --file options
* [MNG-6084] Add test for JSR250 support
* [MNG-6127] Add plugin execution configuration interference test
* [MNG-6127] add integration test to suite
* [MNG-597] Imported dependencies should be available to inheritance
* [MNG-4721] Create an integration test to check handling of optional
* [MNG-5227] Make 'optional' flag of a dependency manageable.
* [MNG-5761] Dependency management is not transitive.
* o Updated to manage plugin dependencies to versions installed by the
* [MNG-4721] Create an integration test to check handling of optional
* [MNG-6135] Maven plugins and core extensions are not dependencies, they
* [MNG-6135] Maven plugins and core extensions are not dependencies, they
* [MNG-6139] Addition of command line option
* [MNG-3599] webdav does not set http-proxy correctly
* [MNG-6139] Addition of command line option
4 tests failed.
FAILED: org.apache.maven.it.MavenITmng4387QuietLoggingTest.testit
Error Message:
expected:<[]> but was:<[[jenkins-maven-event-spy] INFO generate /home/jenkins/jenkins-slave/workspace/-wip_maven_pre-reset-master-6F43WYYKZSENTEDMICMVMUQLJANWKULYDFZGPHG3R2PE5UWK5BTQ/test@tmp/withMaven197c096f/maven-spy-20171211-140905-1084671087147585807940.log.tmp ..., [jenkins-maven-event-spy] INFO generated /home/jenkins/jenkins-slave/workspace/-wip_maven_pre-reset-master-6F43WYYKZSENTEDMICMVMUQLJANWKULYDFZGPHG3R2PE5UWK5BTQ/test@tmp/withMaven197c096f/maven-spy-20171211-140905-1084671087147585807940.log]>
Stack Trace:
junit.framework.AssertionFailedError: expected:<[]> but was:<[[jenkins-maven-event-spy] INFO generate /home/jenkins/jenkins-slave/workspace/-wip_maven_pre-reset-master-6F43WYYKZSENTEDMICMVMUQLJANWKULYDFZGPHG3R2PE5UWK5BTQ/test@tmp/withMaven197c096f/maven-spy-20171211-140905-1084671087147585807940.log.tmp ..., [jenkins-maven-event-spy] INFO generated /home/jenkins/jenkins-slave/workspace/-wip_maven_pre-reset-master-6F43WYYKZSENTEDMICMVMUQLJANWKULYDFZGPHG3R2PE5UWK5BTQ/test@tmp/withMaven197c096f/maven-spy-20171211-140905-1084671087147585807940.log]>
at junit.framework.Assert.fail(Assert.java:47)
at junit.framework.Assert.failNotEquals(Assert.java:283)
at junit.framework.Assert.assertEquals(Assert.java:64)
at junit.framework.Assert.assertEquals(Assert.java:71)
at org.apache.maven.it.MavenITmng4387QuietLoggingTest.testit(MavenITmng4387QuietLoggingTest.java:71)
FAILED: org.apache.maven.it.MavenITmng4387QuietLoggingTest.testit
Error Message:
expected:<[]> but was:<[[jenkins-maven-event-spy] INFO generate /home/jenkins/jenkins-slave/workspace/-wip_maven_pre-reset-master-6F43WYYKZSENTEDMICMVMUQLJANWKULYDFZGPHG3R2PE5UWK5BTQ/test@tmp/withMaven4634a05c/maven-spy-20171211-140930-6536799308783922993571.log.tmp ..., [jenkins-maven-event-spy] INFO generated /home/jenkins/jenkins-slave/workspace/-wip_maven_pre-reset-master-6F43WYYKZSENTEDMICMVMUQLJANWKULYDFZGPHG3R2PE5UWK5BTQ/test@tmp/withMaven4634a05c/maven-spy-20171211-140930-6536799308783922993571.log]>
Stack Trace:
junit.framework.AssertionFailedError: expected:<[]> but was:<[[jenkins-maven-event-spy] INFO generate /home/jenkins/jenkins-slave/workspace/-wip_maven_pre-reset-master-6F43WYYKZSENTEDMICMVMUQLJANWKULYDFZGPHG3R2PE5UWK5BTQ/test@tmp/withMaven4634a05c/maven-spy-20171211-140930-6536799308783922993571.log.tmp ..., [jenkins-maven-event-spy] INFO generated /home/jenkins/jenkins-slave/workspace/-wip_maven_pre-reset-master-6F43WYYKZSENTEDMICMVMUQLJANWKULYDFZGPHG3R2PE5UWK5BTQ/test@tmp/withMaven4634a05c/maven-spy-20171211-140930-6536799308783922993571.log]>
at junit.framework.Assert.fail(Assert.java:47)
at junit.framework.Assert.failNotEquals(Assert.java:283)
at junit.framework.Assert.assertEquals(Assert.java:64)
at junit.framework.Assert.assertEquals(Assert.java:71)
at org.apache.maven.it.MavenITmng4387QuietLoggingTest.testit(MavenITmng4387QuietLoggingTest.java:71)
FAILED: org.apache.maven.its.mng5640.FailingTest.testApp
Error Message:
null
Stack Trace:
junit.framework.AssertionFailedError
at junit.framework.Assert.fail(Assert.java:47)
at junit.framework.Assert.assertTrue(Assert.java:20)
at junit.framework.Assert.assertTrue(Assert.java:27)
at org.apache.maven.its.mng5640.FailingTest.testApp(FailingTest.java:16)
FAILED: org.apache.maven.its.mng5640.FailingTest.testApp
Error Message:
null
Stack Trace:
junit.framework.AssertionFailedError
at junit.framework.Assert.fail(Assert.java:47)
at junit.framework.Assert.assertTrue(Assert.java:20)
at junit.framework.Assert.assertTrue(Assert.java:27)
at org.apache.maven.its.mng5640.FailingTest.testApp(FailingTest.java:16)
Build log:
[...truncated 27.30 MB...]
[winJava7] at com.cloudbees.groovy.cps.Continuable$1.call(Continuable.java:166)
[winJava7] at com.cloudbees.groovy.cps.Continuable$1.call(Continuable.java:163)
[winJava7] at org.codehaus.groovy.runtime.GroovyCategorySupport$ThreadCategoryInfo.use(GroovyCategorySupport.java:122)
[winJava7] at org.codehaus.groovy.runtime.GroovyCategorySupport.use(GroovyCategorySupport.java:261)
[winJava7] at com.cloudbees.groovy.cps.Continuable.run0(Continuable.java:163)
[winJava7] at org.jenkinsci.plugins.workflow.cps.SandboxContinuable.access$001(SandboxContinuable.java:19)
[winJava7] at org.jenkinsci.plugins.workflow.cps.SandboxContinuable$1.call(SandboxContinuable.java:35)
[winJava7] at org.jenkinsci.plugins.workflow.cps.SandboxContinuable$1.call(SandboxContinuable.java:32)
[winJava7] at org.jenkinsci.plugins.scriptsecurity.sandbox.groovy.GroovySandbox.runInSandbox(GroovySandbox.java:108)
[winJava7] at org.jenkinsci.plugins.workflow.cps.SandboxContinuable.run0(SandboxContinuable.java:32)
[winJava7] at org.jenkinsci.plugins.workflow.cps.CpsThread.runNextChunk(CpsThread.java:174)
[winJava7] at org.jenkinsci.plugins.workflow.cps.CpsThreadGroup.run(CpsThreadGroup.java:330)
[winJava7] at org.jenkinsci.plugins.workflow.cps.CpsThreadGroup.access$100(CpsThreadGroup.java:82)
[winJava7] at org.jenkinsci.plugins.workflow.cps.CpsThreadGroup$2.call(CpsThreadGroup.java:242)
[winJava7] at org.jenkinsci.plugins.workflow.cps.CpsThreadGroup$2.call(CpsThreadGroup.java:230)
[winJava7] at org.jenkinsci.plugins.workflow.cps.CpsVmExecutorService$2.call(CpsVmExecutorService.java:64)
[winJava7] at java.util.concurrent.FutureTask.run(FutureTask.java:266)
[winJava7] at hudson.remoting.SingleLaneExecutorService$1.run(SingleLaneExecutorService.java:112)
[winJava7] at jenkins.util.ContextResettingExecutorService$1.run(ContextResettingExecutorService.java:28)
[winJava7] at java.util.concurrent.Executors$RunnableAdapter.call(Executors.java:511)
[winJava7] at java.util.concurrent.FutureTask.run(FutureTask.java:266)
[winJava7] at java.util.concurrent.ThreadPoolExecutor.runWorker(ThreadPoolExecutor.java:1149)
[winJava7] at java.util.concurrent.ThreadPoolExecutor$Worker.run(ThreadPoolExecutor.java:624)
[winJava7] at java.lang.Thread.run(Thread.java:748)
[winJava7] [Fast Archiver] No prior successful build to compare, so performing full copy of artifacts
[winJava7] ERROR: [withMaven] WARNING Exception executing Maven reporter 'Open Task Scanner Publisher' / org.jenkinsci.plugins.pipeline.maven.publishers.TasksScannerPublisher. Please report a bug associated for the component 'pipeline-maven-plugin' at https://issues.jenkins-ci.org
[winJava7] java.lang.IllegalArgumentException: Cannot relativize 'C:\mvn-it-1.tmp\core-it-suite\target\test-classes\it0010\src\main\java' relatively to '/mvn-it-1.tmp'
[winJava7] at org.jenkinsci.plugins.pipeline.maven.util.XmlUtils.getPathInWorkspace(XmlUtils.java:319)
[winJava7] at org.jenkinsci.plugins.pipeline.maven.publishers.TasksScannerPublisher.process(TasksScannerPublisher.java:128)
[winJava7] at org.jenkinsci.plugins.pipeline.maven.MavenSpyLogProcessor.processMavenSpyLogs(MavenSpyLogProcessor.java:109)
[winJava7] at org.jenkinsci.plugins.pipeline.maven.WithMavenStepExecution$WorkspaceCleanupCallback.finished(WithMavenStepExecution.java:913)
[winJava7] at org.jenkinsci.plugins.workflow.steps.BodyExecutionCallback$TailCall.onSuccess(BodyExecutionCallback.java:114)
[winJava7] at org.jenkinsci.plugins.workflow.cps.CpsBodyExecution$SuccessAdapter.receive(CpsBodyExecution.java:362)
[winJava7] at com.cloudbees.groovy.cps.Outcome.resumeFrom(Outcome.java:73)
[winJava7] at com.cloudbees.groovy.cps.Continuable$1.call(Continuable.java:166)
[winJava7] at com.cloudbees.groovy.cps.Continuable$1.call(Continuable.java:163)
[winJava7] at org.codehaus.groovy.runtime.GroovyCategorySupport$ThreadCategoryInfo.use(GroovyCategorySupport.java:122)
[winJava7] at org.codehaus.groovy.runtime.GroovyCategorySupport.use(GroovyCategorySupport.java:261)
[winJava7] at com.cloudbees.groovy.cps.Continuable.run0(Continuable.java:163)
[winJava7] at org.jenkinsci.plugins.workflow.cps.SandboxContinuable.access$001(SandboxContinuable.java:19)
[winJava7] at org.jenkinsci.plugins.workflow.cps.SandboxContinuable$1.call(SandboxContinuable.java:35)
[winJava7] at org.jenkinsci.plugins.workflow.cps.SandboxContinuable$1.call(SandboxContinuable.java:32)
[winJava7] at org.jenkinsci.plugins.scriptsecurity.sandbox.groovy.GroovySandbox.runInSandbox(GroovySandbox.java:108)
[winJava7] at org.jenkinsci.plugins.workflow.cps.SandboxContinuable.run0(SandboxContinuable.java:32)
[winJava7] at org.jenkinsci.plugins.workflow.cps.CpsThread.runNextChunk(CpsThread.java:174)
[winJava7] at org.jenkinsci.plugins.workflow.cps.CpsThreadGroup.run(CpsThreadGroup.java:330)
[winJava7] at org.jenkinsci.plugins.workflow.cps.CpsThreadGroup.access$100(CpsThreadGroup.java:82)
[winJava7] at org.jenkinsci.plugins.workflow.cps.CpsThreadGroup$2.call(CpsThreadGroup.java:242)
[winJava7] at org.jenkinsci.plugins.workflow.cps.CpsThreadGroup$2.call(CpsThreadGroup.java:230)
[winJava7] at org.jenkinsci.plugins.workflow.cps.CpsVmExecutorService$2.call(CpsVmExecutorService.java:64)
[winJava7] at java.util.concurrent.FutureTask.run(FutureTask.java:266)
[winJava7] at hudson.remoting.SingleLaneExecutorService$1.run(SingleLaneExecutorService.java:112)
[winJava7] at jenkins.util.ContextResettingExecutorService$1.run(ContextResettingExecutorService.java:28)
[winJava7] at java.util.concurrent.Executors$RunnableAdapter.call(Executors.java:511)
[winJava7] at java.util.concurrent.FutureTask.run(FutureTask.java:266)
[winJava7] at java.util.concurrent.ThreadPoolExecutor.runWorker(ThreadPoolExecutor.java:1149)
[winJava7] at java.util.concurrent.ThreadPoolExecutor$Worker.run(ThreadPoolExecutor.java:624)
[winJava7] at java.lang.Thread.run(Thread.java:748)
[winJava7] ERROR: [withMaven] artifactsPublisher - WARNING: Exception archiving and fingerprinting MavenArtifact{org.apache.maven.its.it0009:test:pom:1.0(version: 1.0, snapshot:false) C:\mvn-it-1.tmp\core-it-suite\target\test-classes\it0009\pom.xml}, skip archiving of the artifacts
[winJava7] java.lang.IllegalArgumentException: Cannot relativize 'C:\mvn-it-1.tmp\core-it-suite\target\test-classes\it0009\pom.xml' relatively to '/mvn-it-1.tmp'
[winJava7] at org.jenkinsci.plugins.pipeline.maven.util.XmlUtils.getPathInWorkspace(XmlUtils.java:319)
[winJava7] at org.jenkinsci.plugins.pipeline.maven.publishers.GeneratedArtifactsPublisher.process(GeneratedArtifactsPublisher.java:80)
[winJava7] at org.jenkinsci.plugins.pipeline.maven.MavenSpyLogProcessor.processMavenSpyLogs(MavenSpyLogProcessor.java:109)
[winJava7] at org.jenkinsci.plugins.pipeline.maven.WithMavenStepExecution$WorkspaceCleanupCallback.finished(WithMavenStepExecution.java:913)
[winJava7] at org.jenkinsci.plugins.workflow.steps.BodyExecutionCallback$TailCall.onSuccess(BodyExecutionCallback.java:114)
[winJava7] at org.jenkinsci.plugins.workflow.cps.CpsBodyExecution$SuccessAdapter.receive(CpsBodyExecution.java:362)
[winJava7] at com.cloudbees.groovy.cps.Outcome.resumeFrom(Outcome.java:73)
[winJava7] at com.cloudbees.groovy.cps.Continuable$1.call(Continuable.java:166)
[winJava7] at com.cloudbees.groovy.cps.Continuable$1.call(Continuable.java:163)
[winJava7] at org.codehaus.groovy.runtime.GroovyCategorySupport$ThreadCategoryInfo.use(GroovyCategorySupport.java:122)
[winJava7] at org.codehaus.groovy.runtime.GroovyCategorySupport.use(GroovyCategorySupport.java:261)
[winJava7] at com.cloudbees.groovy.cps.Continuable.run0(Continuable.java:163)
[winJava7] at org.jenkinsci.plugins.workflow.cps.SandboxContinuable.access$001(SandboxContinuable.java:19)
[winJava7] at org.jenkinsci.plugins.workflow.cps.SandboxContinuable$1.call(SandboxContinuable.java:35)
[winJava7] at org.jenkinsci.plugins.workflow.cps.SandboxContinuable$1.call(SandboxContinuable.java:32)
[winJava7] at org.jenkinsci.plugins.scriptsecurity.sandbox.groovy.GroovySandbox.runInSandbox(GroovySandbox.java:108)
[winJava7] at org.jenkinsci.plugins.workflow.cps.SandboxContinuable.run0(SandboxContinuable.java:32)
[winJava7] at org.jenkinsci.plugins.workflow.cps.CpsThread.runNextChunk(CpsThread.java:174)
[winJava7] at org.jenkinsci.plugins.workflow.cps.CpsThreadGroup.run(CpsThreadGroup.java:330)
[winJava7] at org.jenkinsci.plugins.workflow.cps.CpsThreadGroup.access$100(CpsThreadGroup.java:82)
[winJava7] at org.jenkinsci.plugins.workflow.cps.CpsThreadGroup$2.call(CpsThreadGroup.java:242)
[winJava7] at org.jenkinsci.plugins.workflow.cps.CpsThreadGroup$2.call(CpsThreadGroup.java:230)
[winJava7] at org.jenkinsci.plugins.workflow.cps.CpsVmExecutorService$2.call(CpsVmExecutorService.java:64)
[winJava7] at java.util.concurrent.FutureTask.run(FutureTask.java:266)
[winJava7] at hudson.remoting.SingleLaneExecutorService$1.run(SingleLaneExecutorService.java:112)
[winJava7] at jenkins.util.ContextResettingExecutorService$1.run(ContextResettingExecutorService.java:28)
[winJava7] at java.util.concurrent.Executors$RunnableAdapter.call(Executors.java:511)
[winJava7] at java.util.concurrent.FutureTask.run(FutureTask.java:266)
[winJava7] at java.util.concurrent.ThreadPoolExecutor.runWorker(ThreadPoolExecutor.java:1149)
[winJava7] at java.util.concurrent.ThreadPoolExecutor$Worker.run(ThreadPoolExecutor.java:624)
[winJava7] at java.lang.Thread.run(Thread.java:748)
[winJava7] [Fast Archiver] No prior successful build to compare, so performing full copy of artifacts
[winJava7] ERROR: [withMaven] WARNING Exception executing Maven reporter 'Open Task Scanner Publisher' / org.jenkinsci.plugins.pipeline.maven.publishers.TasksScannerPublisher. Please report a bug associated for the component 'pipeline-maven-plugin' at https://issues.jenkins-ci.org
[winJava7] java.lang.IllegalArgumentException: Cannot relativize 'C:\mvn-it-1.tmp\core-it-suite\target\test-classes\it0009\src\main\java' relatively to '/mvn-it-1.tmp'
[winJava7] at org.jenkinsci.plugins.pipeline.maven.util.XmlUtils.getPathInWorkspace(XmlUtils.java:319)
[winJava7] at org.jenkinsci.plugins.pipeline.maven.publishers.TasksScannerPublisher.process(TasksScannerPublisher.java:128)
[winJava7] at org.jenkinsci.plugins.pipeline.maven.MavenSpyLogProcessor.processMavenSpyLogs(MavenSpyLogProcessor.java:109)
[winJava7] at org.jenkinsci.plugins.pipeline.maven.WithMavenStepExecution$WorkspaceCleanupCallback.finished(WithMavenStepExecution.java:913)
[winJava7] at org.jenkinsci.plugins.workflow.steps.BodyExecutionCallback$TailCall.onSuccess(BodyExecutionCallback.java:114)
[winJava7] at org.jenkinsci.plugins.workflow.cps.CpsBodyExecution$SuccessAdapter.receive(CpsBodyExecution.java:362)
[winJava7] at com.cloudbees.groovy.cps.Outcome.resumeFrom(Outcome.java:73)
[winJava7] at com.cloudbees.groovy.cps.Continuable$1.call(Continuable.java:166)
[winJava7] at com.cloudbees.groovy.cps.Continuable$1.call(Continuable.java:163)
[winJava7] at org.codehaus.groovy.runtime.GroovyCategorySupport$ThreadCategoryInfo.use(GroovyCategorySupport.java:122)
[winJava7] at org.codehaus.groovy.runtime.GroovyCategorySupport.use(GroovyCategorySupport.java:261)
[winJava7] at com.cloudbees.groovy.cps.Continuable.run0(Continuable.java:163)
[winJava7] at org.jenkinsci.plugins.workflow.cps.SandboxContinuable.access$001(SandboxContinuable.java:19)
[winJava7] at org.jenkinsci.plugins.workflow.cps.SandboxContinuable$1.call(SandboxContinuable.java:35)
[winJava7] at org.jenkinsci.plugins.workflow.cps.SandboxContinuable$1.call(SandboxContinuable.java:32)
[winJava7] at org.jenkinsci.plugins.scriptsecurity.sandbox.groovy.GroovySandbox.runInSandbox(GroovySandbox.java:108)
[winJava7] at org.jenkinsci.plugins.workflow.cps.SandboxContinuable.run0(SandboxContinuable.java:32)
[winJava7] at org.jenkinsci.plugins.workflow.cps.CpsThread.runNextChunk(CpsThread.java:174)
[winJava7] at org.jenkinsci.plugins.workflow.cps.CpsThreadGroup.run(CpsThreadGroup.java:330)
[winJava7] at org.jenkinsci.plugins.workflow.cps.CpsThreadGroup.access$100(CpsThreadGroup.java:82)
[winJava7] at org.jenkinsci.plugins.workflow.cps.CpsThreadGroup$2.call(CpsThreadGroup.java:242)
[winJava7] at org.jenkinsci.plugins.workflow.cps.CpsThreadGroup$2.call(CpsThreadGroup.java:230)
[winJava7] at org.jenkinsci.plugins.workflow.cps.CpsVmExecutorService$2.call(CpsVmExecutorService.java:64)
[winJava7] at java.util.concurrent.FutureTask.run(FutureTask.java:266)
[winJava7] at hudson.remoting.SingleLaneExecutorService$1.run(SingleLaneExecutorService.java:112)
[winJava7] at jenkins.util.ContextResettingExecutorService$1.run(ContextResettingExecutorService.java:28)
[winJava7] at java.util.concurrent.Executors$RunnableAdapter.call(Executors.java:511)
[winJava7] at java.util.concurrent.FutureTask.run(FutureTask.java:266)
[winJava7] at java.util.concurrent.ThreadPoolExecutor.runWorker(ThreadPoolExecutor.java:1149)
[winJava7] at java.util.concurrent.ThreadPoolExecutor$Worker.run(ThreadPoolExecutor.java:624)
[winJava7] at java.lang.Thread.run(Thread.java:748)
[winJava7] ERROR: [withMaven] artifactsPublisher - WARNING: Exception archiving and fingerprinting MavenArtifact{org.apache.maven.its.it0008:test:pom:1.0(version: 1.0, snapshot:false) C:\mvn-it-1.tmp\core-it-suite\target\test-classes\it0008\pom.xml}, skip archiving of the artifacts
[winJava7] java.lang.IllegalArgumentException: Cannot relativize 'C:\mvn-it-1.tmp\core-it-suite\target\test-classes\it0008\pom.xml' relatively to '/mvn-it-1.tmp'
[winJava7] at org.jenkinsci.plugins.pipeline.maven.util.XmlUtils.getPathInWorkspace(XmlUtils.java:319)
[winJava7] at org.jenkinsci.plugins.pipeline.maven.publishers.GeneratedArtifactsPublisher.process(GeneratedArtifactsPublisher.java:80)
[winJava7] at org.jenkinsci.plugins.pipeline.maven.MavenSpyLogProcessor.processMavenSpyLogs(MavenSpyLogProcessor.java:109)
[winJava7] at org.jenkinsci.plugins.pipeline.maven.WithMavenStepExecution$WorkspaceCleanupCallback.finished(WithMavenStepExecution.java:913)
[winJava7] at org.jenkinsci.plugins.workflow.steps.BodyExecutionCallback$TailCall.onSuccess(BodyExecutionCallback.java:114)
[winJava7] at org.jenkinsci.plugins.workflow.cps.CpsBodyExecution$SuccessAdapter.receive(CpsBodyExecution.java:362)
[winJava7] at com.cloudbees.groovy.cps.Outcome.resumeFrom(Outcome.java:73)
[winJava7] at com.cloudbees.groovy.cps.Continuable$1.call(Continuable.java:166)
[winJava7] at com.cloudbees.groovy.cps.Continuable$1.call(Continuable.java:163)
[winJava7] at org.codehaus.groovy.runtime.GroovyCategorySupport$ThreadCategoryInfo.use(GroovyCategorySupport.java:122)
[winJava7] at org.codehaus.groovy.runtime.GroovyCategorySupport.use(GroovyCategorySupport.java:261)
[winJava7] at com.cloudbees.groovy.cps.Continuable.run0(Continuable.java:163)
[winJava7] at org.jenkinsci.plugins.workflow.cps.SandboxContinuable.access$001(SandboxContinuable.java:19)
[winJava7] at org.jenkinsci.plugins.workflow.cps.SandboxContinuable$1.call(SandboxContinuable.java:35)
[winJava7] at org.jenkinsci.plugins.workflow.cps.SandboxContinuable$1.call(SandboxContinuable.java:32)
[winJava7] at org.jenkinsci.plugins.scriptsecurity.sandbox.groovy.GroovySandbox.runInSandbox(GroovySandbox.java:108)
[winJava7] at org.jenkinsci.plugins.workflow.cps.SandboxContinuable.run0(SandboxContinuable.java:32)
[winJava7] at org.jenkinsci.plugins.workflow.cps.CpsThread.runNextChunk(CpsThread.java:174)
[winJava7] at org.jenkinsci.plugins.workflow.cps.CpsThreadGroup.run(CpsThreadGroup.java:330)
[winJava7] at org.jenkinsci.plugins.workflow.cps.CpsThreadGroup.access$100(CpsThreadGroup.java:82)
[winJava7] at org.jenkinsci.plugins.workflow.cps.CpsThreadGroup$2.call(CpsThreadGroup.java:242)
[winJava7] at org.jenkinsci.plugins.workflow.cps.CpsThreadGroup$2.call(CpsThreadGroup.java:230)
[winJava7] at org.jenkinsci.plugins.workflow.cps.CpsVmExecutorService$2.call(CpsVmExecutorService.java:64)
[winJava7] at java.util.concurrent.FutureTask.run(FutureTask.java:266)
[winJava7] at hudson.remoting.SingleLaneExecutorService$1.run(SingleLaneExecutorService.java:112)
[winJava7] at jenkins.util.ContextResettingExecutorService$1.run(ContextResettingExecutorService.java:28)
[winJava7] at java.util.concurrent.Executors$RunnableAdapter.call(Executors.java:511)
[winJava7] at java.util.concurrent.FutureTask.run(FutureTask.java:266)
[winJava7] at java.util.concurrent.ThreadPoolExecutor.runWorker(ThreadPoolExecutor.java:1149)
[winJava7] at java.util.concurrent.ThreadPoolExecutor$Worker.run(ThreadPoolExecutor.java:624)
[winJava7] at java.lang.Thread.run(Thread.java:748)
[winJava7] [Fast Archiver] No prior successful build to compare, so performing full copy of artifacts
[winJava7] ERROR: [withMaven] WARNING Exception executing Maven reporter 'Open Task Scanner Publisher' / org.jenkinsci.plugins.pipeline.maven.publishers.TasksScannerPublisher. Please report a bug associated for the component 'pipeline-maven-plugin' at https://issues.jenkins-ci.org
[winJava7] java.lang.IllegalArgumentException: Cannot relativize 'C:\mvn-it-1.tmp\core-it-suite\target\test-classes\it0008\src\main\java' relatively to '/mvn-it-1.tmp'
[winJava7] at org.jenkinsci.plugins.pipeline.maven.util.XmlUtils.getPathInWorkspace(XmlUtils.java:319)
[winJava7] at org.jenkinsci.plugins.pipeline.maven.publishers.TasksScannerPublisher.process(TasksScannerPublisher.java:128)
[winJava7] at org.jenkinsci.plugins.pipeline.maven.MavenSpyLogProcessor.processMavenSpyLogs(MavenSpyLogProcessor.java:109)
[winJava7] at org.jenkinsci.plugins.pipeline.maven.WithMavenStepExecution$WorkspaceCleanupCallback.finished(WithMavenStepExecution.java:913)
[winJava7] at org.jenkinsci.plugins.workflow.steps.BodyExecutionCallback$TailCall.onSuccess(BodyExecutionCallback.java:114)
[winJava7] at org.jenkinsci.plugins.workflow.cps.CpsBodyExecution$SuccessAdapter.receive(CpsBodyExecution.java:362)
[winJava7] at com.cloudbees.groovy.cps.Outcome.resumeFrom(Outcome.java:73)
[winJava7] at com.cloudbees.groovy.cps.Continuable$1.call(Continuable.java:166)
[winJava7] at com.cloudbees.groovy.cps.Continuable$1.call(Continuable.java:163)
[winJava7] at org.codehaus.groovy.runtime.GroovyCategorySupport$ThreadCategoryInfo.use(GroovyCategorySupport.java:122)
[winJava7] at org.codehaus.groovy.runtime.GroovyCategorySupport.use(GroovyCategorySupport.java:261)
[winJava7] at com.cloudbees.groovy.cps.Continuable.run0(Continuable.java:163)
[winJava7] at org.jenkinsci.plugins.workflow.cps.SandboxContinuable.access$001(SandboxContinuable.java:19)
[winJava7] at org.jenkinsci.plugins.workflow.cps.SandboxContinuable$1.call(SandboxContinuable.java:35)
[winJava7] at org.jenkinsci.plugins.workflow.cps.SandboxContinuable$1.call(SandboxContinuable.java:32)
[winJava7] at org.jenkinsci.plugins.scriptsecurity.sandbox.groovy.GroovySandbox.runInSandbox(GroovySandbox.java:108)
[winJava7] at org.jenkinsci.plugins.workflow.cps.SandboxContinuable.run0(SandboxContinuable.java:32)
[winJava7] at org.jenkinsci.plugins.workflow.cps.CpsThread.runNextChunk(CpsThread.java:174)
[winJava7] at org.jenkinsci.plugins.workflow.cps.CpsThreadGroup.run(CpsThreadGroup.java:330)
[winJava7] at org.jenkinsci.plugins.workflow.cps.CpsThreadGroup.access$100(CpsThreadGroup.java:82)
[winJava7] at org.jenkinsci.plugins.workflow.cps.CpsThreadGroup$2.call(CpsThreadGroup.java:242)
[winJava7] at org.jenkinsci.plugins.workflow.cps.CpsThreadGroup$2.call(CpsThreadGroup.java:230)
[winJava7] at org.jenkinsci.plugins.workflow.cps.CpsVmExecutorService$2.call(CpsVmExecutorService.java:64)
[winJava7] at java.util.concurrent.FutureTask.run(FutureTask.java:266)
[winJava7] at hudson.remoting.SingleLaneExecutorService$1.run(SingleLaneExecutorService.java:112)
[winJava7] at jenkins.util.ContextResettingExecutorService$1.run(ContextResettingExecutorService.java:28)
[winJava7] at java.util.concurrent.Executors$RunnableAdapter.call(Executors.java:511)
[winJava7] at java.util.concurrent.FutureTask.run(FutureTask.java:266)
[winJava7] at java.util.concurrent.ThreadPoolExecutor.runWorker(ThreadPoolExecutor.java:1149)
[winJava7] at java.util.concurrent.ThreadPoolExecutor$Worker.run(ThreadPoolExecutor.java:624)
[winJava7] at java.lang.Thread.run(Thread.java:748)
[winJava7] [withMaven] One or multiple Maven executions have been ignored by the Jenkins Pipeline Maven Plugin because they have been interrupted before completion (4). See Pipeline Maven Plugin FAQ for more details.
[Pipeline] [winJava7] // withMaven
[Pipeline] [winJava7] deleteDir
[Pipeline] [winJava8] }
[Pipeline] [winJava8] // dir
[Pipeline] [winJava8] }
[Pipeline] [winJava8] // stage
[Pipeline] [winJava8] }
[Pipeline] [winJava8] // node
[Pipeline] [winJava8] }
[Pipeline] [winJava7] }
[Pipeline] [winJava7] // dir
[Pipeline] [winJava7] }
[Pipeline] [winJava7] // stage
[Pipeline] [winJava7] }
[Pipeline] [winJava7] // node
[Pipeline] [winJava7] }
[Pipeline] // parallel
[Pipeline] stage
[Pipeline] { (Notifications)
[Pipeline] echo
Build result: UNSTABLE
[Pipeline] jiraIssueSelector
[Pipeline] jiraComment
[Pipeline] jiraComment
[Pipeline] jiraComment
[Pipeline] jiraComment
[Pipeline] jiraComment
[Pipeline] jiraComment
[Pipeline] jiraComment
[Pipeline] jiraComment
[Pipeline] jiraComment
[Pipeline] jiraComment
[Pipeline] jiraComment
[Pipeline] jiraComment
[Pipeline] jiraComment
[Pipeline] jiraComment
[Pipeline] jiraComment
[Pipeline] jiraComment
[Pipeline] jiraComment
[Pipeline] jiraComment
[Pipeline] jiraComment
[Pipeline] jiraComment
[Pipeline] jiraComment
[Pipeline] jiraComment
[Pipeline] jiraComment
[Pipeline] jiraComment
[Pipeline] jiraComment
[Pipeline] jiraComment
[Pipeline] jiraComment
[Pipeline] jiraComment
[Pipeline] jiraComment
[Pipeline] jiraComment
[Pipeline] jiraComment
[Pipeline] jiraComment
[Pipeline] jiraComment
[Pipeline] emailext