You are viewing a plain text version of this content. The canonical link for it is here.
Posted to dev@lucene.apache.org by Apache Jenkins Server <je...@builds.apache.org> on 2014/11/01 11:01:36 UTC
[JENKINS] Lucene-Solr-NightlyTests-5.x - Build # 664 - Still
Failing
Build: https://builds.apache.org/job/Lucene-Solr-NightlyTests-5.x/664/
1 tests failed.
REGRESSION: org.apache.solr.TestDistributedSearch.testDistribSearch
Error Message:
Captured an uncaught exception in thread: Thread[id=7230, name=Thread-1821, state=RUNNABLE, group=TGRP-TestDistributedSearch]
Stack Trace:
com.carrotsearch.randomizedtesting.UncaughtExceptionError: Captured an uncaught exception in thread: Thread[id=7230, name=Thread-1821, state=RUNNABLE, group=TGRP-TestDistributedSearch]
at __randomizedtesting.SeedInfo.seed([C5D8A97CC23B7905:443E2764B5641939]:0)
Caused by: java.lang.RuntimeException: org.apache.solr.client.solrj.SolrServerException: Timeout occured while waiting response from server at: https://127.0.0.1:21043
at __randomizedtesting.SeedInfo.seed([C5D8A97CC23B7905]:0)
at org.apache.solr.BaseDistributedSearchTestCase$5.run(BaseDistributedSearchTestCase.java:580)
Caused by: org.apache.solr.client.solrj.SolrServerException: Timeout occured while waiting response from server at: https://127.0.0.1:21043
at org.apache.solr.client.solrj.impl.HttpSolrServer.executeMethod(HttpSolrServer.java:579)
at org.apache.solr.client.solrj.impl.HttpSolrServer.request(HttpSolrServer.java:215)
at org.apache.solr.client.solrj.impl.HttpSolrServer.request(HttpSolrServer.java:211)
at org.apache.solr.client.solrj.request.QueryRequest.process(QueryRequest.java:91)
at org.apache.solr.client.solrj.SolrServer.query(SolrServer.java:301)
at org.apache.solr.BaseDistributedSearchTestCase$5.run(BaseDistributedSearchTestCase.java:575)
Caused by: java.net.SocketTimeoutException: Read timed out
at java.net.SocketInputStream.socketRead0(Native Method)
at java.net.SocketInputStream.read(SocketInputStream.java:152)
at java.net.SocketInputStream.read(SocketInputStream.java:122)
at sun.security.ssl.InputRecord.readFully(InputRecord.java:442)
at sun.security.ssl.InputRecord.read(InputRecord.java:480)
at sun.security.ssl.SSLSocketImpl.readRecord(SSLSocketImpl.java:927)
at sun.security.ssl.SSLSocketImpl.readDataRecord(SSLSocketImpl.java:884)
at sun.security.ssl.AppInputStream.read(AppInputStream.java:102)
at org.apache.http.impl.io.AbstractSessionInputBuffer.fillBuffer(AbstractSessionInputBuffer.java:160)
at org.apache.http.impl.io.SocketInputBuffer.fillBuffer(SocketInputBuffer.java:84)
at org.apache.http.impl.io.AbstractSessionInputBuffer.readLine(AbstractSessionInputBuffer.java:273)
at org.apache.http.impl.conn.DefaultHttpResponseParser.parseHead(DefaultHttpResponseParser.java:140)
at org.apache.http.impl.conn.DefaultHttpResponseParser.parseHead(DefaultHttpResponseParser.java:57)
at org.apache.http.impl.io.AbstractMessageParser.parse(AbstractMessageParser.java:260)
at org.apache.http.impl.AbstractHttpClientConnection.receiveResponseHeader(AbstractHttpClientConnection.java:283)
at org.apache.http.impl.conn.DefaultClientConnection.receiveResponseHeader(DefaultClientConnection.java:251)
at org.apache.http.impl.conn.ManagedClientConnectionImpl.receiveResponseHeader(ManagedClientConnectionImpl.java:197)
at org.apache.http.protocol.HttpRequestExecutor.doReceiveResponse(HttpRequestExecutor.java:271)
at org.apache.http.protocol.HttpRequestExecutor.execute(HttpRequestExecutor.java:123)
at org.apache.http.impl.client.DefaultRequestDirector.tryExecute(DefaultRequestDirector.java:682)
at org.apache.http.impl.client.DefaultRequestDirector.execute(DefaultRequestDirector.java:486)
at org.apache.http.impl.client.AbstractHttpClient.doExecute(AbstractHttpClient.java:863)
at org.apache.http.impl.client.CloseableHttpClient.execute(CloseableHttpClient.java:82)
at org.apache.http.impl.client.CloseableHttpClient.execute(CloseableHttpClient.java:106)
at org.apache.http.impl.client.CloseableHttpClient.execute(CloseableHttpClient.java:57)
at org.apache.solr.client.solrj.impl.HttpSolrServer.executeMethod(HttpSolrServer.java:465)
... 5 more
Build Log:
[...truncated 12821 lines...]
[junit4] Suite: org.apache.solr.TestDistributedSearch
[junit4] 2> Creating dataDir: /usr/home/jenkins/jenkins-slave/workspace/Lucene-Solr-NightlyTests-5.x/solr/build/solr-core/test/J1/temp/solr.TestDistributedSearch-C5D8A97CC23B7905-001/init-core-data-001
[junit4] 2> 1995751 T3934 oas.SolrTestCaseJ4.buildSSLConfig Randomized ssl (true) and clientAuth (true)
[junit4] 2> 1995751 T3934 oas.BaseDistributedSearchTestCase.initHostContext Setting hostContext system property: /
[junit4] 2> 1995754 T3934 oas.SolrTestCaseJ4.setUp ###Starting testDistribSearch
[junit4] 2> 1995756 T3934 oejs.Server.doStart jetty-8.1.10.v20130312
[junit4] 2> 1995761 T3934 oejus.SslContextFactory.doStart Enabled Protocols [SSLv2Hello, SSLv3, TLSv1, TLSv1.1, TLSv1.2] of [SSLv2Hello, SSLv3, TLSv1, TLSv1.1, TLSv1.2]
[junit4] 2> 1995764 T3934 oejs.AbstractConnector.doStart Started SslSocketConnector@127.0.0.1:18741
[junit4] 2> 1995766 T3934 oass.SolrDispatchFilter.init SolrDispatchFilter.init()
[junit4] 2> 1995767 T3934 oasc.SolrResourceLoader.locateSolrHome JNDI not configured for solr (NoInitialContextEx)
[junit4] 2> 1995767 T3934 oasc.SolrResourceLoader.locateSolrHome using system property solr.solr.home: /usr/home/jenkins/jenkins-slave/workspace/Lucene-Solr-NightlyTests-5.x/solr/core/src/test-files/solr
[junit4] 2> 1995767 T3934 oasc.SolrResourceLoader.<init> new SolrResourceLoader for directory: '/usr/home/jenkins/jenkins-slave/workspace/Lucene-Solr-NightlyTests-5.x/solr/core/src/test-files/solr/'
[junit4] 2> 1995798 T3934 oasc.ConfigSolr.fromFile Loading container configuration from /usr/home/jenkins/jenkins-slave/workspace/Lucene-Solr-NightlyTests-5.x/solr/core/src/test-files/solr/solr.xml
[junit4] 2> 1995848 T3934 oasc.CoreContainer.<init> New CoreContainer 1333070699
[junit4] 2> 1995848 T3934 oasc.CoreContainer.load Loading cores into CoreContainer [instanceDir=/usr/home/jenkins/jenkins-slave/workspace/Lucene-Solr-NightlyTests-5.x/solr/core/src/test-files/solr/]
[junit4] 2> 1995849 T3934 oashc.HttpShardHandlerFactory.getParameter Setting socketTimeout to: 90000
[junit4] 2> 1995849 T3934 oashc.HttpShardHandlerFactory.getParameter Setting urlScheme to: https
[junit4] 2> 1995850 T3934 oashc.HttpShardHandlerFactory.getParameter Setting connTimeout to: 15000
[junit4] 2> 1995850 T3934 oashc.HttpShardHandlerFactory.getParameter Setting maxConnectionsPerHost to: 20
[junit4] 2> 1995850 T3934 oashc.HttpShardHandlerFactory.getParameter Setting maxConnections to: 10000
[junit4] 2> 1995850 T3934 oashc.HttpShardHandlerFactory.getParameter Setting corePoolSize to: 0
[junit4] 2> 1995850 T3934 oashc.HttpShardHandlerFactory.getParameter Setting maximumPoolSize to: 2147483647
[junit4] 2> 1995851 T3934 oashc.HttpShardHandlerFactory.getParameter Setting maxThreadIdleTime to: 5
[junit4] 2> 1995851 T3934 oashc.HttpShardHandlerFactory.getParameter Setting sizeOfQueue to: -1
[junit4] 2> 1995851 T3934 oashc.HttpShardHandlerFactory.getParameter Setting fairnessPolicy to: false
[junit4] 2> 1995853 T3934 oasu.UpdateShardHandler.<init> Creating UpdateShardHandler HTTP client with params: socketTimeout=340000&connTimeout=45000&retry=false
[junit4] 2> 1995855 T3934 oasl.LogWatcher.createWatcher SLF4J impl is org.slf4j.impl.Log4jLoggerFactory
[junit4] 2> 1995856 T3934 oasl.LogWatcher.newRegisteredLogWatcher Registering Log Listener [Log4j (org.slf4j.impl.Log4jLoggerFactory)]
[junit4] 2> 1995856 T3934 oasc.CoreContainer.load Host Name: 127.0.0.1
[junit4] 2> 1995859 T3944 oasc.SolrResourceLoader.<init> new SolrResourceLoader for directory: '/usr/home/jenkins/jenkins-slave/workspace/Lucene-Solr-NightlyTests-5.x/solr/core/src/test-files/solr/collection1/'
[junit4] 2> 1995861 T3944 oasc.SolrResourceLoader.replaceClassLoader Adding 'file:/usr/home/jenkins/jenkins-slave/workspace/Lucene-Solr-NightlyTests-5.x/solr/core/src/test-files/solr/collection1/lib/classes/' to classloader
[junit4] 2> 1995861 T3944 oasc.SolrResourceLoader.replaceClassLoader Adding 'file:/usr/home/jenkins/jenkins-slave/workspace/Lucene-Solr-NightlyTests-5.x/solr/core/src/test-files/solr/collection1/lib/.svn/' to classloader
[junit4] 2> 1995862 T3944 oasc.SolrResourceLoader.replaceClassLoader Adding 'file:/usr/home/jenkins/jenkins-slave/workspace/Lucene-Solr-NightlyTests-5.x/solr/core/src/test-files/solr/collection1/lib/README' to classloader
[junit4] 2> 1995913 T3944 oasc.SolrConfig.<init> Using Lucene MatchVersion: 5.0.0
[junit4] 2> 1995957 T3944 oasc.SolrConfig.<init> Loaded SolrConfig: solrconfig.xml
[junit4] 2> 1995958 T3944 oass.IndexSchema.readSchema Reading Solr Schema from /usr/home/jenkins/jenkins-slave/workspace/Lucene-Solr-NightlyTests-5.x/solr/core/src/test-files/solr/collection1/conf/schema.xml
[junit4] 2> 1995965 T3944 oass.IndexSchema.readSchema [collection1] Schema name=test
[junit4] 2> 1996212 T3944 oass.OpenExchangeRatesOrgProvider.init Initialized with rates=open-exchange-rates.json, refreshInterval=1440.
[junit4] 2> 1996220 T3944 oass.IndexSchema.readSchema default search field in schema is text
[junit4] 2> 1996222 T3944 oass.IndexSchema.readSchema unique key field: id
[junit4] 2> 1996229 T3944 oass.FileExchangeRateProvider.reload Reloading exchange rates from file currency.xml
[junit4] 2> 1996232 T3944 oass.FileExchangeRateProvider.reload Reloading exchange rates from file currency.xml
[junit4] 2> 1996234 T3944 oass.OpenExchangeRatesOrgProvider.reload Reloading exchange rates from open-exchange-rates.json
[junit4] 2> 1996235 T3944 oass.OpenExchangeRatesOrgProvider$OpenExchangeRates.<init> WARN Unknown key IMPORTANT NOTE
[junit4] 2> 1996236 T3944 oass.OpenExchangeRatesOrgProvider$OpenExchangeRates.<init> WARN Expected key, got STRING
[junit4] 2> 1996236 T3944 oass.OpenExchangeRatesOrgProvider.reload Reloading exchange rates from open-exchange-rates.json
[junit4] 2> 1996236 T3944 oass.OpenExchangeRatesOrgProvider$OpenExchangeRates.<init> WARN Unknown key IMPORTANT NOTE
[junit4] 2> 1996236 T3944 oass.OpenExchangeRatesOrgProvider$OpenExchangeRates.<init> WARN Expected key, got STRING
[junit4] 2> 1996237 T3944 oasc.CoreContainer.create Creating SolrCore 'collection1' using configuration from instancedir /usr/home/jenkins/jenkins-slave/workspace/Lucene-Solr-NightlyTests-5.x/solr/core/src/test-files/solr/collection1/
[junit4] 2> 1996237 T3944 oasc.SolrCore.initDirectoryFactory org.apache.solr.core.MockDirectoryFactory
[junit4] 2> 1996237 T3944 oasc.SolrCore.<init> [collection1] Opening new SolrCore at /usr/home/jenkins/jenkins-slave/workspace/Lucene-Solr-NightlyTests-5.x/solr/core/src/test-files/solr/collection1/, dataDir=/usr/home/jenkins/jenkins-slave/workspace/Lucene-Solr-NightlyTests-5.x/solr/build/solr-core/test/J1/temp/solr.TestDistributedSearch-C5D8A97CC23B7905-001/tempDir-001/control/data/
[junit4] 2> 1996237 T3944 oasc.JmxMonitoredMap.<init> JMX monitoring is enabled. Adding Solr mbeans to JMX Server: com.sun.jmx.mbeanserver.JmxMBeanServer@1995e0a5
[junit4] 2> 1996238 T3944 oasc.CachingDirectoryFactory.get return new directory for /usr/home/jenkins/jenkins-slave/workspace/Lucene-Solr-NightlyTests-5.x/solr/build/solr-core/test/J1/temp/solr.TestDistributedSearch-C5D8A97CC23B7905-001/tempDir-001/control/data
[junit4] 2> 1996238 T3944 oasc.SolrCore.getNewIndexDir New index directory detected: old=null new=/usr/home/jenkins/jenkins-slave/workspace/Lucene-Solr-NightlyTests-5.x/solr/build/solr-core/test/J1/temp/solr.TestDistributedSearch-C5D8A97CC23B7905-001/tempDir-001/control/data/index/
[junit4] 2> 1996238 T3944 oasc.SolrCore.initIndex WARN [collection1] Solr index directory '/usr/home/jenkins/jenkins-slave/workspace/Lucene-Solr-NightlyTests-5.x/solr/build/solr-core/test/J1/temp/solr.TestDistributedSearch-C5D8A97CC23B7905-001/tempDir-001/control/data/index' doesn't exist. Creating new index...
[junit4] 2> 1996239 T3944 oasc.CachingDirectoryFactory.get return new directory for /usr/home/jenkins/jenkins-slave/workspace/Lucene-Solr-NightlyTests-5.x/solr/build/solr-core/test/J1/temp/solr.TestDistributedSearch-C5D8A97CC23B7905-001/tempDir-001/control/data/index
[junit4] 2> 1996239 T3944 oasu.RandomMergePolicy.<init> RandomMergePolicy wrapping class org.apache.lucene.index.LogDocMergePolicy: [LogDocMergePolicy: minMergeSize=1000, mergeFactor=32, maxMergeSize=9223372036854775807, maxMergeSizeForForcedMerge=9223372036854775807, calibrateSizeByDeletes=true, maxMergeDocs=2147483647, maxCFSSegmentSizeMB=8.796093022207999E12, noCFSRatio=0.518196452583875]
[junit4] 2> 1996239 T3944 oasc.SolrDeletionPolicy.onCommit SolrDeletionPolicy.onCommit: commits: num=1
[junit4] 2> commit{dir=RateLimitedDirectoryWrapper(MockDirectoryWrapper(RateLimitedDirectoryWrapper(RAMDirectory(id=lucene-3592b6b)))),segFN=segments_1,generation=1}
[junit4] 2> 1996240 T3944 oasc.SolrDeletionPolicy.updateCommits newest commit generation = 1
[junit4] 2> 1996240 T3944 oasc.SolrCore.initWriters created xml: solr.XMLResponseWriter
[junit4] 2> 1996242 T3944 oasup.UpdateRequestProcessorChain.init creating updateRequestProcessorChain "dedupe"
[junit4] 2> 1996242 T3944 oasup.UpdateRequestProcessorChain.init inserting DistributedUpdateProcessorFactory into updateRequestProcessorChain "dedupe"
[junit4] 2> 1996242 T3944 oasup.UpdateRequestProcessorChain.init creating updateRequestProcessorChain "dedupe-allfields"
[junit4] 2> 1996242 T3944 oasup.UpdateRequestProcessorChain.init inserting DistributedUpdateProcessorFactory into updateRequestProcessorChain "dedupe-allfields"
[junit4] 2> 1996242 T3944 oasup.UpdateRequestProcessorChain.init creating updateRequestProcessorChain "stored_sig"
[junit4] 2> 1996243 T3944 oasup.UpdateRequestProcessorChain.init inserting DistributedUpdateProcessorFactory into updateRequestProcessorChain "stored_sig"
[junit4] 2> 1996243 T3944 oasup.UpdateRequestProcessorChain.init creating updateRequestProcessorChain "uniq-fields"
[junit4] 2> 1996243 T3944 oasup.UpdateRequestProcessorChain.init inserting DistributedUpdateProcessorFactory into updateRequestProcessorChain "uniq-fields"
[junit4] 2> 1996243 T3944 oasup.UpdateRequestProcessorChain.init creating updateRequestProcessorChain "distrib-dup-test-chain-explicit"
[junit4] 2> 1996243 T3944 oasup.UpdateRequestProcessorChain.init creating updateRequestProcessorChain "distrib-dup-test-chain-implicit"
[junit4] 2> 1996244 T3944 oasup.UpdateRequestProcessorChain.init inserting DistributedUpdateProcessorFactory into updateRequestProcessorChain "distrib-dup-test-chain-implicit"
[junit4] 2> 1996244 T3944 oasc.SolrCore.loadUpdateProcessorChains no updateRequestProcessorChain defined as default, creating implicit default
[junit4] 2> 1996244 T3944 oasc.RequestHandlers.initHandlersFromConfig created /update/json: org.apache.solr.handler.UpdateRequestHandler
[junit4] 2> 1996244 T3944 oasc.RequestHandlers.initHandlersFromConfig created /update/json/docs: org.apache.solr.handler.UpdateRequestHandler
[junit4] 2> 1996245 T3944 oasc.RequestHandlers.initHandlersFromConfig created /update/csv: org.apache.solr.handler.UpdateRequestHandler
[junit4] 2> 1996245 T3944 oasc.RequestHandlers.initHandlersFromConfig adding lazy requestHandler: solr.ReplicationHandler
[junit4] 2> 1996245 T3944 oasc.RequestHandlers.initHandlersFromConfig created /replication: solr.ReplicationHandler
[junit4] 2> 1996245 T3944 oasc.RequestHandlers.initHandlersFromConfig created standard: solr.StandardRequestHandler
[junit4] 2> 1996246 T3944 oasc.RequestHandlers.initHandlersFromConfig created /get: solr.RealTimeGetHandler
[junit4] 2> 1996246 T3944 oasc.RequestHandlers.initHandlersFromConfig created dismax: solr.SearchHandler
[junit4] 2> 1996246 T3944 oasc.RequestHandlers.initHandlersFromConfig created mock: org.apache.solr.core.MockQuerySenderListenerReqHandler
[junit4] 2> 1996246 T3944 oasc.RequestHandlers.initHandlersFromConfig created /admin/: org.apache.solr.handler.admin.AdminHandlers
[junit4] 2> 1996247 T3944 oasc.RequestHandlers.initHandlersFromConfig created /admin/file: solr.admin.ShowFileRequestHandler
[junit4] 2> 1996247 T3944 oasc.RequestHandlers.initHandlersFromConfig created /admin/fileedit: solr.admin.EditFileRequestHandler
[junit4] 2> 1996247 T3944 oasc.RequestHandlers.initHandlersFromConfig created defaults: solr.StandardRequestHandler
[junit4] 2> 1996247 T3944 oasc.RequestHandlers.initHandlersFromConfig adding lazy requestHandler: solr.StandardRequestHandler
[junit4] 2> 1996247 T3944 oasc.RequestHandlers.initHandlersFromConfig created lazy: solr.StandardRequestHandler
[junit4] 2> 1996248 T3944 oasc.RequestHandlers.initHandlersFromConfig created /update: solr.UpdateRequestHandler
[junit4] 2> 1996248 T3944 oasc.RequestHandlers.initHandlersFromConfig created /terms: org.apache.solr.handler.component.SearchHandler
[junit4] 2> 1996248 T3944 oasc.RequestHandlers.initHandlersFromConfig created spellCheckCompRH: org.apache.solr.handler.component.SearchHandler
[junit4] 2> 1996248 T3944 oasc.RequestHandlers.initHandlersFromConfig created spellCheckCompRH_Direct: org.apache.solr.handler.component.SearchHandler
[junit4] 2> 1996249 T3944 oasc.RequestHandlers.initHandlersFromConfig created spellCheckWithWordbreak: org.apache.solr.handler.component.SearchHandler
[junit4] 2> 1996249 T3944 oasc.RequestHandlers.initHandlersFromConfig created spellCheckWithWordbreak_Direct: org.apache.solr.handler.component.SearchHandler
[junit4] 2> 1996249 T3944 oasc.RequestHandlers.initHandlersFromConfig created spellCheckCompRH1: org.apache.solr.handler.component.SearchHandler
[junit4] 2> 1996249 T3944 oasc.RequestHandlers.initHandlersFromConfig created mltrh: org.apache.solr.handler.component.SearchHandler
[junit4] 2> 1996250 T3944 oasc.RequestHandlers.initHandlersFromConfig created tvrh: org.apache.solr.handler.component.SearchHandler
[junit4] 2> 1996250 T3944 oasc.RequestHandlers.initHandlersFromConfig created /mlt: solr.MoreLikeThisHandler
[junit4] 2> 1996250 T3944 oasc.RequestHandlers.initHandlersFromConfig created /debug/dump: solr.DumpRequestHandler
[junit4] 2> 1996268 T3944 oashl.XMLLoader.init xsltCacheLifetimeSeconds=60
[junit4] 2> 1996269 T3944 oashl.XMLLoader.init xsltCacheLifetimeSeconds=60
[junit4] 2> 1996271 T3944 oashl.XMLLoader.init xsltCacheLifetimeSeconds=60
[junit4] 2> 1996272 T3944 oashl.XMLLoader.init xsltCacheLifetimeSeconds=60
[junit4] 2> 1996273 T3944 oasc.SolrCore.initDeprecatedSupport WARN solrconfig.xml uses deprecated <admin/gettableFiles>, Please update your config to use the ShowFileRequestHandler.
[junit4] 2> 1996275 T3944 oasu.CommitTracker.<init> Hard AutoCommit: disabled
[junit4] 2> 1996276 T3944 oasu.CommitTracker.<init> Soft AutoCommit: disabled
[junit4] 2> 1996276 T3944 oasu.RandomMergePolicy.<init> RandomMergePolicy wrapping class org.apache.lucene.index.TieredMergePolicy: [TieredMergePolicy: maxMergeAtOnce=29, maxMergeAtOnceExplicit=24, maxMergedSegmentMB=0.9609375, floorSegmentMB=1.658203125, forceMergeDeletesPctAllowed=12.887728335549877, segmentsPerTier=25.0, maxCFSSegmentSizeMB=8.796093022207999E12, noCFSRatio=1.0
[junit4] 2> 1996276 T3944 oasc.SolrDeletionPolicy.onInit SolrDeletionPolicy.onInit: commits: num=1
[junit4] 2> commit{dir=RateLimitedDirectoryWrapper(MockDirectoryWrapper(RateLimitedDirectoryWrapper(RAMDirectory(id=lucene-3592b6b)))),segFN=segments_1,generation=1}
[junit4] 2> 1996277 T3944 oasc.SolrDeletionPolicy.updateCommits newest commit generation = 1
[junit4] 2> 1996277 T3944 oass.SolrIndexSearcher.<init> Opening Searcher@35a01866[collection1] main
[junit4] 2> 1996277 T3944 oasr.RestManager.init Initializing RestManager with initArgs: {storageIO=org.apache.solr.rest.ManagedResourceStorage$InMemoryStorageIO}
[junit4] 2> 1996277 T3944 oasr.ManagedResourceStorage.load Reading _rest_managed.json using InMemoryStorage
[junit4] 2> 1996278 T3944 oasr.ManagedResource.reloadFromStorage WARN No stored data found for /rest/managed
[junit4] 2> 1996278 T3944 oasr.ManagedResourceStorage$JsonStorage.store Saved JSON object to path _rest_managed.json using InMemoryStorage
[junit4] 2> 1996278 T3944 oasr.RestManager.init Initializing 0 registered ManagedResources
[junit4] 2> 1996278 T3944 oashc.SpellCheckComponent.inform Initializing spell checkers
[junit4] 2> 1996289 T3944 oass.DirectSolrSpellChecker.init init: {name=direct,classname=DirectSolrSpellChecker,field=lowerfilt,minQueryLength=3}
[junit4] 2> 1996384 T3945 oasc.SolrCore.registerSearcher [collection1] Registered new searcher Searcher@35a01866[collection1] main{ExitableDirectoryReader(UninvertingDirectoryReader())}
[junit4] 2> 1996387 T3944 oasc.CoreContainer.registerCore registering core: collection1
[junit4] 2> 1996388 T3934 oass.SolrDispatchFilter.init user.dir=/usr/home/jenkins/jenkins-slave/workspace/Lucene-Solr-NightlyTests-5.x/solr/build/solr-core/test/J1
[junit4] 2> 1996388 T3934 oass.SolrDispatchFilter.init SolrDispatchFilter.init() done
[junit4] 2> 1996392 T3934 oejs.Server.doStart jetty-8.1.10.v20130312
[junit4] 2> 1996397 T3934 oejus.SslContextFactory.doStart Enabled Protocols [SSLv2Hello, SSLv3, TLSv1, TLSv1.1, TLSv1.2] of [SSLv2Hello, SSLv3, TLSv1, TLSv1.1, TLSv1.2]
[junit4] 2> 1996399 T3934 oejs.AbstractConnector.doStart Started SslSocketConnector@127.0.0.1:18744
[junit4] 2> 1996402 T3934 oass.SolrDispatchFilter.init SolrDispatchFilter.init()
[junit4] 2> 1996402 T3934 oasc.SolrResourceLoader.locateSolrHome JNDI not configured for solr (NoInitialContextEx)
[junit4] 2> 1996403 T3934 oasc.SolrResourceLoader.locateSolrHome using system property solr.solr.home: /usr/home/jenkins/jenkins-slave/workspace/Lucene-Solr-NightlyTests-5.x/solr/core/src/test-files/solr
[junit4] 2> 1996403 T3934 oasc.SolrResourceLoader.<init> new SolrResourceLoader for directory: '/usr/home/jenkins/jenkins-slave/workspace/Lucene-Solr-NightlyTests-5.x/solr/core/src/test-files/solr/'
[junit4] 2> 1996452 T3934 oasc.ConfigSolr.fromFile Loading container configuration from /usr/home/jenkins/jenkins-slave/workspace/Lucene-Solr-NightlyTests-5.x/solr/core/src/test-files/solr/solr.xml
[junit4] 2> 1996561 T3934 oasc.CoreContainer.<init> New CoreContainer 69113591
[junit4] 2> 1996561 T3934 oasc.CoreContainer.load Loading cores into CoreContainer [instanceDir=/usr/home/jenkins/jenkins-slave/workspace/Lucene-Solr-NightlyTests-5.x/solr/core/src/test-files/solr/]
[junit4] 2> 1996564 T3934 oashc.HttpShardHandlerFactory.getParameter Setting socketTimeout to: 90000
[junit4] 2> 1996565 T3934 oashc.HttpShardHandlerFactory.getParameter Setting urlScheme to: https
[junit4] 2> 1996565 T3934 oashc.HttpShardHandlerFactory.getParameter Setting connTimeout to: 15000
[junit4] 2> 1996566 T3934 oashc.HttpShardHandlerFactory.getParameter Setting maxConnectionsPerHost to: 20
[junit4] 2> 1996566 T3934 oashc.HttpShardHandlerFactory.getParameter Setting maxConnections to: 10000
[junit4] 2> 1996567 T3934 oashc.HttpShardHandlerFactory.getParameter Setting corePoolSize to: 0
[junit4] 2> 1996567 T3934 oashc.HttpShardHandlerFactory.getParameter Setting maximumPoolSize to: 2147483647
[junit4] 2> 1996568 T3934 oashc.HttpShardHandlerFactory.getParameter Setting maxThreadIdleTime to: 5
[junit4] 2> 1996568 T3934 oashc.HttpShardHandlerFactory.getParameter Setting sizeOfQueue to: -1
[junit4] 2> 1996569 T3934 oashc.HttpShardHandlerFactory.getParameter Setting fairnessPolicy to: false
[junit4] 2> 1996574 T3934 oasu.UpdateShardHandler.<init> Creating UpdateShardHandler HTTP client with params: socketTimeout=340000&connTimeout=45000&retry=false
[junit4] 2> 1996578 T3934 oasl.LogWatcher.createWatcher SLF4J impl is org.slf4j.impl.Log4jLoggerFactory
[junit4] 2> 1996578 T3934 oasl.LogWatcher.newRegisteredLogWatcher Registering Log Listener [Log4j (org.slf4j.impl.Log4jLoggerFactory)]
[junit4] 2> 1996579 T3934 oasc.CoreContainer.load Host Name: 127.0.0.1
[junit4] 2> 1996585 T3956 oasc.SolrResourceLoader.<init> new SolrResourceLoader for directory: '/usr/home/jenkins/jenkins-slave/workspace/Lucene-Solr-NightlyTests-5.x/solr/core/src/test-files/solr/collection1/'
[junit4] 2> 1996587 T3956 oasc.SolrResourceLoader.replaceClassLoader Adding 'file:/usr/home/jenkins/jenkins-slave/workspace/Lucene-Solr-NightlyTests-5.x/solr/core/src/test-files/solr/collection1/lib/classes/' to classloader
[junit4] 2> 1996587 T3956 oasc.SolrResourceLoader.replaceClassLoader Adding 'file:/usr/home/jenkins/jenkins-slave/workspace/Lucene-Solr-NightlyTests-5.x/solr/core/src/test-files/solr/collection1/lib/.svn/' to classloader
[junit4] 2> 1996588 T3956 oasc.SolrResourceLoader.replaceClassLoader Adding 'file:/usr/home/jenkins/jenkins-slave/workspace/Lucene-Solr-NightlyTests-5.x/solr/core/src/test-files/solr/collection1/lib/README' to classloader
[junit4] 2> 1996667 T3956 oasc.SolrConfig.<init> Using Lucene MatchVersion: 5.0.0
[junit4] 2> 1996733 T3956 oasc.SolrConfig.<init> Loaded SolrConfig: solrconfig.xml
[junit4] 2> 1996734 T3956 oass.IndexSchema.readSchema Reading Solr Schema from /usr/home/jenkins/jenkins-slave/workspace/Lucene-Solr-NightlyTests-5.x/solr/core/src/test-files/solr/collection1/conf/schema.xml
[junit4] 2> 1996743 T3956 oass.IndexSchema.readSchema [collection1] Schema name=test
[junit4] 2> 1997141 T3956 oass.OpenExchangeRatesOrgProvider.init Initialized with rates=open-exchange-rates.json, refreshInterval=1440.
[junit4] 2> 1997155 T3956 oass.IndexSchema.readSchema default search field in schema is text
[junit4] 2> 1997158 T3956 oass.IndexSchema.readSchema unique key field: id
[junit4] 2> 1997169 T3956 oass.FileExchangeRateProvider.reload Reloading exchange rates from file currency.xml
[junit4] 2> 1997174 T3956 oass.FileExchangeRateProvider.reload Reloading exchange rates from file currency.xml
[junit4] 2> 1997178 T3956 oass.OpenExchangeRatesOrgProvider.reload Reloading exchange rates from open-exchange-rates.json
[junit4] 2> 1997179 T3956 oass.OpenExchangeRatesOrgProvider$OpenExchangeRates.<init> WARN Unknown key IMPORTANT NOTE
[junit4] 2> 1997180 T3956 oass.OpenExchangeRatesOrgProvider$OpenExchangeRates.<init> WARN Expected key, got STRING
[junit4] 2> 1997180 T3956 oass.OpenExchangeRatesOrgProvider.reload Reloading exchange rates from open-exchange-rates.json
[junit4] 2> 1997181 T3956 oass.OpenExchangeRatesOrgProvider$OpenExchangeRates.<init> WARN Unknown key IMPORTANT NOTE
[junit4] 2> 1997181 T3956 oass.OpenExchangeRatesOrgProvider$OpenExchangeRates.<init> WARN Expected key, got STRING
[junit4] 2> 1997182 T3956 oasc.CoreContainer.create Creating SolrCore 'collection1' using configuration from instancedir /usr/home/jenkins/jenkins-slave/workspace/Lucene-Solr-NightlyTests-5.x/solr/core/src/test-files/solr/collection1/
[junit4] 2> 1997182 T3956 oasc.SolrCore.initDirectoryFactory org.apache.solr.core.MockDirectoryFactory
[junit4] 2> 1997182 T3956 oasc.SolrCore.<init> [collection1] Opening new SolrCore at /usr/home/jenkins/jenkins-slave/workspace/Lucene-Solr-NightlyTests-5.x/solr/core/src/test-files/solr/collection1/, dataDir=/usr/home/jenkins/jenkins-slave/workspace/Lucene-Solr-NightlyTests-5.x/solr/build/solr-core/test/J1/temp/solr.TestDistributedSearch-C5D8A97CC23B7905-001/tempDir-001/shard0/data/
[junit4] 2> 1997182 T3956 oasc.JmxMonitoredMap.<init> JMX monitoring is enabled. Adding Solr mbeans to JMX Server: com.sun.jmx.mbeanserver.JmxMBeanServer@1995e0a5
[junit4] 2> 1997183 T3956 oasc.CachingDirectoryFactory.get return new directory for /usr/home/jenkins/jenkins-slave/workspace/Lucene-Solr-NightlyTests-5.x/solr/build/solr-core/test/J1/temp/solr.TestDistributedSearch-C5D8A97CC23B7905-001/tempDir-001/shard0/data
[junit4] 2> 1997184 T3956 oasc.SolrCore.getNewIndexDir New index directory detected: old=null new=/usr/home/jenkins/jenkins-slave/workspace/Lucene-Solr-NightlyTests-5.x/solr/build/solr-core/test/J1/temp/solr.TestDistributedSearch-C5D8A97CC23B7905-001/tempDir-001/shard0/data/index/
[junit4] 2> 1997184 T3956 oasc.SolrCore.initIndex WARN [collection1] Solr index directory '/usr/home/jenkins/jenkins-slave/workspace/Lucene-Solr-NightlyTests-5.x/solr/build/solr-core/test/J1/temp/solr.TestDistributedSearch-C5D8A97CC23B7905-001/tempDir-001/shard0/data/index' doesn't exist. Creating new index...
[junit4] 2> 1997184 T3956 oasc.CachingDirectoryFactory.get return new directory for /usr/home/jenkins/jenkins-slave/workspace/Lucene-Solr-NightlyTests-5.x/solr/build/solr-core/test/J1/temp/solr.TestDistributedSearch-C5D8A97CC23B7905-001/tempDir-001/shard0/data/index
[junit4] 2> 1997185 T3956 oasu.RandomMergePolicy.<init> RandomMergePolicy wrapping class org.apache.lucene.index.LogDocMergePolicy: [LogDocMergePolicy: minMergeSize=1000, mergeFactor=32, maxMergeSize=9223372036854775807, maxMergeSizeForForcedMerge=9223372036854775807, calibrateSizeByDeletes=true, maxMergeDocs=2147483647, maxCFSSegmentSizeMB=8.796093022207999E12, noCFSRatio=0.518196452583875]
[junit4] 2> 1997185 T3956 oasc.SolrDeletionPolicy.onCommit SolrDeletionPolicy.onCommit: commits: num=1
[junit4] 2> commit{dir=RateLimitedDirectoryWrapper(MockDirectoryWrapper(RateLimitedDirectoryWrapper(RAMDirectory(id=lucene-5582c258)))),segFN=segments_1,generation=1}
[junit4] 2> 1997186 T3956 oasc.SolrDeletionPolicy.updateCommits newest commit generation = 1
[junit4] 2> 1997186 T3956 oasc.SolrCore.initWriters created xml: solr.XMLResponseWriter
[junit4] 2> 1997190 T3956 oasup.UpdateRequestProcessorChain.init creating updateRequestProcessorChain "dedupe"
[junit4] 2> 1997191 T3956 oasup.UpdateRequestProcessorChain.init inserting DistributedUpdateProcessorFactory into updateRequestProcessorChain "dedupe"
[junit4] 2> 1997191 T3956 oasup.UpdateRequestProcessorChain.init creating updateRequestProcessorChain "dedupe-allfields"
[junit4] 2> 1997191 T3956 oasup.UpdateRequestProcessorChain.init inserting DistributedUpdateProcessorFactory into updateRequestProcessorChain "dedupe-allfields"
[junit4] 2> 1997192 T3956 oasup.UpdateRequestProcessorChain.init creating updateRequestProcessorChain "stored_sig"
[junit4] 2> 1997192 T3956 oasup.UpdateRequestProcessorChain.init inserting DistributedUpdateProcessorFactory into updateRequestProcessorChain "stored_sig"
[junit4] 2> 1997192 T3956 oasup.UpdateRequestProcessorChain.init creating updateRequestProcessorChain "uniq-fields"
[junit4] 2> 1997193 T3956 oasup.UpdateRequestProcessorChain.init inserting DistributedUpdateProcessorFactory into updateRequestProcessorChain "uniq-fields"
[junit4] 2> 1997193 T3956 oasup.UpdateRequestProcessorChain.init creating updateRequestProcessorChain "distrib-dup-test-chain-explicit"
[junit4] 2> 1997194 T3956 oasup.UpdateRequestProcessorChain.init creating updateRequestProcessorChain "distrib-dup-test-chain-implicit"
[junit4] 2> 1997194 T3956 oasup.UpdateRequestProcessorChain.init inserting DistributedUpdateProcessorFactory into updateRequestProcessorChain "distrib-dup-test-chain-implicit"
[junit4] 2> 1997194 T3956 oasc.SolrCore.loadUpdateProcessorChains no updateRequestProcessorChain defined as default, creating implicit default
[junit4] 2> 1997195 T3956 oasc.RequestHandlers.initHandlersFromConfig created /update/json: org.apache.solr.handler.UpdateRequestHandler
[junit4] 2> 1997196 T3956 oasc.RequestHandlers.initHandlersFromConfig created /update/json/docs: org.apache.solr.handler.UpdateRequestHandler
[junit4] 2> 1997196 T3956 oasc.RequestHandlers.initHandlersFromConfig created /update/csv: org.apache.solr.handler.UpdateRequestHandler
[junit4] 2> 1997197 T3956 oasc.RequestHandlers.initHandlersFromConfig adding lazy requestHandler: solr.ReplicationHandler
[junit4] 2> 1997197 T3956 oasc.RequestHandlers.initHandlersFromConfig created /replication: solr.ReplicationHandler
[junit4] 2> 1997198 T3956 oasc.RequestHandlers.initHandlersFromConfig created standard: solr.StandardRequestHandler
[junit4] 2> 1997198 T3956 oasc.RequestHandlers.initHandlersFromConfig created /get: solr.RealTimeGetHandler
[junit4] 2> 1997199 T3956 oasc.RequestHandlers.initHandlersFromConfig created dismax: solr.SearchHandler
[junit4] 2> 1997200 T3956 oasc.RequestHandlers.initHandlersFromConfig created mock: org.apache.solr.core.MockQuerySenderListenerReqHandler
[junit4] 2> 1997200 T3956 oasc.RequestHandlers.initHandlersFromConfig created /admin/: org.apache.solr.handler.admin.AdminHandlers
[junit4] 2> 1997201 T3956 oasc.RequestHandlers.initHandlersFromConfig created /admin/file: solr.admin.ShowFileRequestHandler
[junit4] 2> 1997201 T3956 oasc.RequestHandlers.initHandlersFromConfig created /admin/fileedit: solr.admin.EditFileRequestHandler
[junit4] 2> 1997202 T3956 oasc.RequestHandlers.initHandlersFromConfig created defaults: solr.StandardRequestHandler
[junit4] 2> 1997202 T3956 oasc.RequestHandlers.initHandlersFromConfig adding lazy requestHandler: solr.StandardRequestHandler
[junit4] 2> 1997202 T3956 oasc.RequestHandlers.initHandlersFromConfig created lazy: solr.StandardRequestHandler
[junit4] 2> 1997203 T3956 oasc.RequestHandlers.initHandlersFromConfig created /update: solr.UpdateRequestHandler
[junit4] 2> 1997203 T3956 oasc.RequestHandlers.initHandlersFromConfig created /terms: org.apache.solr.handler.component.SearchHandler
[junit4] 2> 1997204 T3956 oasc.RequestHandlers.initHandlersFromConfig created spellCheckCompRH: org.apache.solr.handler.component.SearchHandler
[junit4] 2> 1997204 T3956 oasc.RequestHandlers.initHandlersFromConfig created spellCheckCompRH_Direct: org.apache.solr.handler.component.SearchHandler
[junit4] 2> 1997205 T3956 oasc.RequestHandlers.initHandlersFromConfig created spellCheckWithWordbreak: org.apache.solr.handler.component.SearchHandler
[junit4] 2> 1997205 T3956 oasc.RequestHandlers.initHandlersFromConfig created spellCheckWithWordbreak_Direct: org.apache.solr.handler.component.SearchHandler
[junit4] 2> 1997206 T3956 oasc.RequestHandlers.initHandlersFromConfig created spellCheckCompRH1: org.apache.solr.handler.component.SearchHandler
[junit4] 2> 1997206 T3956 oasc.RequestHandlers.initHandlersFromConfig created mltrh: org.apache.solr.handler.component.SearchHandler
[junit4] 2> 1997207 T3956 oasc.RequestHandlers.initHandlersFromConfig created tvrh: org.apache.solr.handler.component.SearchHandler
[junit4] 2> 1997207 T3956 oasc.RequestHandlers.initHandlersFromConfig created /mlt: solr.MoreLikeThisHandler
[junit4] 2> 1997208 T3956 oasc.RequestHandlers.initHandlersFromConfig created /debug/dump: solr.DumpRequestHandler
[junit4] 2> 1997231 T3956 oashl.XMLLoader.init xsltCacheLifetimeSeconds=60
[junit4] 2> 1997234 T3956 oashl.XMLLoader.init xsltCacheLifetimeSeconds=60
[junit4] 2> 1997236 T3956 oashl.XMLLoader.init xsltCacheLifetimeSeconds=60
[junit4] 2> 1997238 T3956 oashl.XMLLoader.init xsltCacheLifetimeSeconds=60
[junit4] 2> 1997240 T3956 oasc.SolrCore.initDeprecatedSupport WARN solrconfig.xml uses deprecated <admin/gettableFiles>, Please update your config to use the ShowFileRequestHandler.
[junit4] 2> 1997241 T3956 oasu.CommitTracker.<init> Hard AutoCommit: disabled
[junit4] 2> 1997242 T3956 oasu.CommitTracker.<init> Soft AutoCommit: disabled
[junit4] 2> 1997242 T3956 oasu.RandomMergePolicy.<init> RandomMergePolicy wrapping class org.apache.lucene.index.TieredMergePolicy: [TieredMergePolicy: maxMergeAtOnce=29, maxMergeAtOnceExplicit=24, maxMergedSegmentMB=0.9609375, floorSegmentMB=1.658203125, forceMergeDeletesPctAllowed=12.887728335549877, segmentsPerTier=25.0, maxCFSSegmentSizeMB=8.796093022207999E12, noCFSRatio=1.0
[junit4] 2> 1997243 T3956 oasc.SolrDeletionPolicy.onInit SolrDeletionPolicy.onInit: commits: num=1
[junit4] 2> commit{dir=RateLimitedDirectoryWrapper(MockDirectoryWrapper(RateLimitedDirectoryWrapper(RAMDirectory(id=lucene-5582c258)))),segFN=segments_1,generation=1}
[junit4] 2> 1997243 T3956 oasc.SolrDeletionPolicy.updateCommits newest commit generation = 1
[junit4] 2> 1997243 T3956 oass.SolrIndexSearcher.<init> Opening Searcher@18c88187[collection1] main
[junit4] 2> 1997244 T3956 oasr.RestManager.init Initializing RestManager with initArgs: {storageIO=org.apache.solr.rest.ManagedResourceStorage$InMemoryStorageIO}
[junit4] 2> 1997244 T3956 oasr.ManagedResourceStorage.load Reading _rest_managed.json using InMemoryStorage
[junit4] 2> 1997244 T3956 oasr.ManagedResource.reloadFromStorage WARN No stored data found for /rest/managed
[junit4] 2> 1997245 T3956 oasr.ManagedResourceStorage$JsonStorage.store Saved JSON object to path _rest_managed.json using InMemoryStorage
[junit4] 2> 1997245 T3956 oasr.RestManager.init Initializing 0 registered ManagedResources
[junit4] 2> 1997245 T3956 oashc.SpellCheckComponent.inform Initializing spell checkers
[junit4] 2> 1997277 T3956 oass.DirectSolrSpellChecker.init init: {name=direct,classname=DirectSolrSpellChecker,field=lowerfilt,minQueryLength=3}
[junit4] 2> 1997430 T3957 oasc.SolrCore.registerSearcher [collection1] Registered new searcher Searcher@18c88187[collection1] main{ExitableDirectoryReader(UninvertingDirectoryReader())}
[junit4] 2> 1997437 T3956 oasc.CoreContainer.registerCore registering core: collection1
[junit4] 2> 1997438 T3934 oass.SolrDispatchFilter.init user.dir=/usr/home/jenkins/jenkins-slave/workspace/Lucene-Solr-NightlyTests-5.x/solr/build/solr-core/test/J1
[junit4] 2> 1997438 T3934 oass.SolrDispatchFilter.init SolrDispatchFilter.init() done
[junit4] 2> ASYNC NEW_CORE C1176 name=collection1 org.apache.solr.core.SolrCore@7bd2cc2b
[junit4] 2> 1997582 T3937 C1176 oasu.DirectUpdateHandler2.deleteAll [collection1] REMOVING ALL DOCUMENTS FROM INDEX
[junit4] 2> 1997584 T3937 C1176 oasup.LogUpdateProcessor.finish [collection1] webapp= path=/update params={wt=javabin&version=2} {deleteByQuery=*:*} 0 2
[junit4] 2> ASYNC NEW_CORE C1177 name=collection1 org.apache.solr.core.SolrCore@1bfce2b3
[junit4] 2> 1997713 T3949 C1177 oasu.DirectUpdateHandler2.deleteAll [collection1] REMOVING ALL DOCUMENTS FROM INDEX
[junit4] 2> 1997714 T3949 C1177 oasup.LogUpdateProcessor.finish [collection1] webapp= path=/update params={wt=javabin&version=2} {deleteByQuery=*:*} 0 1
[junit4] 2> 1997722 T3938 C1176 oasup.LogUpdateProcessor.finish [collection1] webapp= path=/update params={wt=javabin&version=2} {add=[1]} 0 2
[junit4] 2> 1997730 T3950 C1177 oasup.LogUpdateProcessor.finish [collection1] webapp= path=/update params={wt=javabin&version=2} {add=[1]} 0 2
[junit4] 2> 1997737 T3939 C1176 oasup.LogUpdateProcessor.finish [collection1] webapp= path=/update params={wt=javabin&version=2} {add=[2]} 0 1
[junit4] 2> 1997743 T3951 C1177 oasup.LogUpdateProcessor.finish [collection1] webapp= path=/update params={wt=javabin&version=2} {add=[2]} 0 1
[junit4] 2> 1997749 T3940 C1176 oasup.LogUpdateProcessor.finish [collection1] webapp= path=/update params={wt=javabin&version=2} {add=[3]} 0 1
[junit4] 2> 1997755 T3952 C1177 oasup.LogUpdateProcessor.finish [collection1] webapp= path=/update params={wt=javabin&version=2} {add=[3]} 0 1
[junit4] 2> 1997761 T3941 C1176 oasup.LogUpdateProcessor.finish [collection1] webapp= path=/update params={wt=javabin&version=2} {add=[4]} 0 1
[junit4] 2> 1997768 T3953 C1177 oasup.LogUpdateProcessor.finish [collection1] webapp= path=/update params={wt=javabin&version=2} {add=[4]} 0 1
[junit4] 2> 1997775 T3942 C1176 oasup.LogUpdateProcessor.finish [collection1] webapp= path=/update params={wt=javabin&version=2} {add=[5]} 0 1
[junit4] 2> 1997781 T3954 C1177 oasup.LogUpdateProcessor.finish [collection1] webapp= path=/update params={wt=javabin&version=2} {add=[5]} 0 1
[junit4] 2> 1997788 T3943 C1176 oasup.LogUpdateProcessor.finish [collection1] webapp= path=/update params={wt=javabin&version=2} {add=[6]} 0 1
[junit4] 2> 1997794 T3955 C1177 oasup.LogUpdateProcessor.finish [collection1] webapp= path=/update params={wt=javabin&version=2} {add=[6]} 0 1
[junit4] 2> 1997801 T3973 C1176 oasup.LogUpdateProcessor.finish [collection1] webapp= path=/update params={wt=javabin&version=2} {add=[7]} 0 1
[junit4] 2> 1997807 T3975 C1177 oasup.LogUpdateProcessor.finish [collection1] webapp= path=/update params={wt=javabin&version=2} {add=[7]} 0 1
[junit4] 2> 1997815 T3977 C1176 oasup.LogUpdateProcessor.finish [collection1] webapp= path=/update params={wt=javabin&version=2} {add=[8]} 0 1
[junit4] 2> 1997823 T3979 C1177 oasup.LogUpdateProcessor.finish [collection1] webapp= path=/update params={wt=javabin&version=2} {add=[8]} 0 1
[junit4] 2> 1997830 T3981 C1176 oasup.LogUpdateProcessor.finish [collection1] webapp= path=/update params={wt=javabin&version=2} {add=[9]} 0 1
[junit4] 2> 1997836 T3983 C1177 oasup.LogUpdateProcessor.finish [collection1] webapp= path=/update params={wt=javabin&version=2} {add=[9]} 0 1
[junit4] 2> 1997842 T3985 C1176 oasu.DirectUpdateHandler2.commit start commit{,optimize=false,openSearcher=true,waitSearcher=true,expungeDeletes=false,softCommit=false,prepareCommit=false}
[junit4] 2> 1997852 T3985 C1176 oasc.SolrDeletionPolicy.onCommit SolrDeletionPolicy.onCommit: commits: num=2
[junit4] 2> commit{dir=RateLimitedDirectoryWrapper(MockDirectoryWrapper(RateLimitedDirectoryWrapper(RAMDirectory(id=lucene-3592b6b)))),segFN=segments_1,generation=1}
[junit4] 2> commit{dir=RateLimitedDirectoryWrapper(MockDirectoryWrapper(RateLimitedDirectoryWrapper(RAMDirectory(id=lucene-3592b6b)))),segFN=segments_2,generation=2}
[junit4] 2> 1997852 T3985 C1176 oasc.SolrDeletionPolicy.updateCommits newest commit generation = 2
[junit4] 2> 1997854 T3985 C1176 oass.SolrIndexSearcher.<init> Opening Searcher@3f2e4b4d[collection1] main
[junit4] 2> 1997855 T3985 C1176 oasu.DirectUpdateHandler2.commit end_commit_flush
[junit4] 2> 1997856 T3945 oasc.SolrCore.registerSearcher [collection1] Registered new searcher Searcher@3f2e4b4d[collection1] main{ExitableDirectoryReader(UninvertingDirectoryReader(Uninverting(_0(5.0.0):c9)))}
[junit4] 2> 1997857 T3985 C1176 oasup.LogUpdateProcessor.finish [collection1] webapp= path=/update params={wt=javabin&commit=true&version=2&softCommit=false&waitSearcher=true} {commit=} 0 15
[junit4] 2> 1997863 T3987 C1177 oasu.DirectUpdateHandler2.commit start commit{,optimize=false,openSearcher=true,waitSearcher=true,expungeDeletes=false,softCommit=false,prepareCommit=false}
[junit4] 2> 1997872 T3987 C1177 oasc.SolrDeletionPolicy.onCommit SolrDeletionPolicy.onCommit: commits: num=2
[junit4] 2> commit{dir=RateLimitedDirectoryWrapper(MockDirectoryWrapper(RateLimitedDirectoryWrapper(RAMDirectory(id=lucene-5582c258)))),segFN=segments_1,generation=1}
[junit4] 2> commit{dir=RateLimitedDirectoryWrapper(MockDirectoryWrapper(RateLimitedDirectoryWrapper(RAMDirectory(id=lucene-5582c258)))),segFN=segments_2,generation=2}
[junit4] 2> 1997872 T3987 C1177 oasc.SolrDeletionPolicy.updateCommits newest commit generation = 2
[junit4] 2> 1997874 T3987 C1177 oass.SolrIndexSearcher.<init> Opening Searcher@58213df[collection1] main
[junit4] 2> 1997875 T3987 C1177 oasu.DirectUpdateHandler2.commit end_commit_flush
[junit4] 2> 1997876 T3957 oasc.SolrCore.registerSearcher [collection1] Registered new searcher Searcher@58213df[collection1] main{ExitableDirectoryReader(UninvertingDirectoryReader(Uninverting(_0(5.0.0):c9)))}
[junit4] 2> 1997877 T3987 C1177 oasup.LogUpdateProcessor.finish [collection1] webapp= path=/update params={wt=javabin&commit=true&version=2&softCommit=false&waitSearcher=true} {commit=} 0 14
[junit4] 2> 1997885 T3989 C1176 oasup.LogUpdateProcessor.finish [collection1] webapp= path=/update params={wt=javabin&version=2} {add=[10]} 0 2
[junit4] 2> 1997892 T3991 C1177 oasup.LogUpdateProcessor.finish [collection1] webapp= path=/update params={wt=javabin&version=2} {add=[10]} 0 1
[junit4] 2> ASYNC NEW_CORE C1178 name=collection1 org.apache.solr.core.SolrCore@7bd2cc2b
[junit4] 2> 1997925 T3993 C1178 oasup.LogUpdateProcessor.finish [collection1] webapp= path=/update params={wt=javabin&version=2} {add=[11]} 0 1
[junit4] 2> ASYNC NEW_CORE C1179 name=collection1 org.apache.solr.core.SolrCore@1bfce2b3
[junit4] 2> 1997933 T3995 C1179 oasup.LogUpdateProcessor.finish [collection1] webapp= path=/update params={wt=javabin&version=2} {add=[11]} 0 1
[junit4] 2> 1997941 T3997 C1178 oasup.LogUpdateProcessor.finish [collection1] webapp= path=/update params={wt=javabin&version=2} {add=[12]} 0 1
[junit4] 2> 1997954 T3999 C1179 oasup.LogUpdateProcessor.finish [collection1] webapp= path=/update params={wt=javabin&version=2} {add=[12]} 0 1
[junit4] 2> 1997962 T4001 C1178 oasup.LogUpdateProcessor.finish [collection1] webapp= path=/update params={wt=javabin&version=2} {add=[13]} 0 1
[junit4] 2> 1997970 T4003 C1179 oasup.LogUpdateProcessor.finish [collection1] webapp= path=/update params={wt=javabin&version=2} {add=[13]} 0 1
[junit4] 2> 1997978 T4005 C1178 oasup.LogUpdateProcessor.finish [collection1] webapp= path=/update params={wt=javabin&version=2} {add=[1001]} 0 1
[junit4] 2> 1997985 T4007 C1179 oasup.LogUpdateProcessor.finish [collection1] webapp= path=/update params={wt=javabin&version=2} {add=[1001]} 0 1
[junit4] 2> 1997993 T4009 C1178 oasup.LogUpdateProcessor.finish [collection1] webapp= path=/update params={wt=javabin&version=2} {add=[14]} 0 1
[junit4] 2> 1997999 T4011 C1179 oasup.LogUpdateProcessor.finish [collection1] webapp= path=/update params={wt=javabin&version=2} {add=[14]} 0 1
[junit4] 2> 1998006 T4013 C1178 oasup.LogUpdateProcessor.finish [collection1] webapp= path=/update params={wt=javabin&version=2} {add=[15]} 0 1
[junit4] 2> 1998013 T4015 C1179 oasup.LogUpdateProcessor.finish [collection1] webapp= path=/update params={wt=javabin&version=2} {add=[15]} 0 1
[junit4] 2> 1998021 T4017 C1178 oasup.LogUpdateProcessor.finish [collection1] webapp= path=/update params={wt=javabin&version=2} {add=[16]} 0 1
[junit4] 2> 1998028 T4019 C1179 oasup.LogUpdateProcessor.finish [collection1] webapp= path=/update params={wt=javabin&version=2} {add=[16]} 0 1
[junit4] 2> 1998036 T4021 C1178 oasup.LogUpdateProcessor.finish [collection1] webapp= path=/update params={wt=javabin&version=2} {add=[17]} 0 1
[junit4] 2> 1998043 T4023 C1179 oasup.LogUpdateProcessor.finish [collection1] webapp= path=/update params={wt=javabin&version=2} {add=[17]} 0 1
[junit4] 2> 1998049 T4025 C1178 oasup.LogUpdateProcessor.finish [collection1] webapp= path=/update params={wt=javabin&version=2} {add=[100]} 0 0
[junit4] 2> 1998055 T4027 C1179 oasup.LogUpdateProcessor.finish [collection1] webapp= path=/update params={wt=javabin&version=2} {add=[100]} 0 1
[junit4] 2> 1998061 T4029 C1178 oasup.LogUpdateProcessor.finish [collection1] webapp= path=/update params={wt=javabin&version=2} {add=[101]} 0 1
[junit4] 2> 1998067 T4031 C1179 oasup.LogUpdateProcessor.finish [collection1] webapp= path=/update params={wt=javabin&version=2} {add=[101]} 0 1
[junit4] 2> 1998072 T4033 C1178 oasup.LogUpdateProcessor.finish [collection1] webapp= path=/update params={wt=javabin&version=2} {add=[102]} 0 0
[junit4] 2> 1998078 T4035 C1179 oasup.LogUpdateProcessor.finish [collection1] webapp= path=/update params={wt=javabin&version=2} {add=[102]} 0 1
[junit4] 2> 1998083 T4037 C1178 oasup.LogUpdateProcessor.finish [collection1] webapp= path=/update params={wt=javabin&version=2} {add=[103]} 0 1
[junit4] 2> 1998087 T4039 C1179 oasup.LogUpdateProcessor.finish [collection1] webapp= path=/update params={wt=javabin&version=2} {add=[103]} 0 0
[junit4] 2> 1998093 T4041 C1178 oasup.LogUpdateProcessor.finish [collection1] webapp= path=/update params={wt=javabin&version=2} {add=[104]} 0 0
[junit4] 2> 1998098 T4043 C1179 oasup.LogUpdateProcessor.finish [collection1] webapp= path=/update params={wt=javabin&version=2} {add=[104]} 0 0
[junit4] 2> 1998103 T4045 C1178 oasup.LogUpdateProcessor.finish [collection1] webapp= path=/update params={wt=javabin&version=2} {add=[105]} 0 1
[junit4] 2> 1998108 T4047 C1179 oasup.LogUpdateProcessor.finish [collection1] webapp= path=/update params={wt=javabin&version=2} {add=[105]} 0 1
[junit4] 2> 1998112 T4049 C1178 oasup.LogUpdateProcessor.finish [collection1] webapp= path=/update params={wt=javabin&version=2} {add=[106]} 0 0
[junit4] 2> 1998117 T4051 C1179 oasup.LogUpdateProcessor.finish [collection1] webapp= path=/update params={wt=javabin&version=2} {add=[106]} 0 1
[junit4] 2> 1998122 T4053 C1178 oasup.LogUpdateProcessor.finish [collection1] webapp= path=/update params={wt=javabin&version=2} {add=[107]} 0 1
[junit4] 2> 1998126 T4055 C1179 oasup.LogUpdateProcessor.finish [collection1] webapp= path=/update params={wt=javabin&version=2} {add=[107]} 0 0
[junit4] 2> 1998131 T4057 C1178 oasup.LogUpdateProcessor.finish [collection1] webapp= path=/update params={wt=javabin&version=2} {add=[108]} 0 1
[junit4] 2> 1998136 T4059 C1179 oasup.LogUpdateProcessor.finish [collection1] webapp= path=/update params={wt=javabin&version=2} {add=[108]} 0 1
[junit4] 2> 1998141 T4061 C1178 oasup.LogUpdateProcessor.finish [collection1] webapp= path=/update params={wt=javabin&version=2} {add=[109]} 0 1
[junit4] 2> 1998145 T4063 C1179 oasup.LogUpdateProcessor.finish [collection1] webapp= path=/update params={wt=javabin&version=2} {add=[109]} 0 0
[junit4] 2> 1998150 T4065 C1178 oasup.LogUpdateProcessor.finish [collection1] webapp= path=/update params={wt=javabin&version=2} {add=[110]} 0 1
[junit4] 2> 1998154 T4067 C1179 oasup.LogUpdateProcessor.finish [collection1] webapp= path=/update params={wt=javabin&version=2} {add=[110]} 0 0
[junit4] 2> 1998159 T4069 C1178 oasup.LogUpdateProcessor.finish [collection1] webapp= path=/update params={wt=javabin&version=2} {add=[111]} 0 1
[junit4] 2> 1998163 T4071 C1179 oasup.LogUpdateProcessor.finish [collection1] webapp= path=/update params={wt=javabin&version=2} {add=[111]} 0 0
[junit4] 2> 1998168 T4073 C1178 oasup.LogUpdateProcessor.finish [collection1] webapp= path=/update params={wt=javabin&version=2} {add=[112]} 0 1
[junit4] 2> 1998174 T4075 C1179 oasup.LogUpdateProcessor.finish [collection1] webapp= path=/update params={wt=javabin&version=2} {add=[112]} 0 0
[junit4] 2> 1998181 T4077 C1178 oasup.LogUpdateProcessor.finish [collection1] webapp= path=/update params={wt=javabin&version=2} {add=[113]} 0 1
[junit4] 2> 1998188 T4079 C1179 oasup.LogUpdateProcessor.finish [collection1] webapp= path=/update params={wt=javabin&version=2} {add=[113]} 0 1
[junit4] 2> 1998194 T4081 C1178 oasup.LogUpdateProcessor.finish [collection1] webapp= path=/update params={wt=javabin&version=2} {add=[114]} 0 0
[junit4] 2> 1998199 T4083 C1179 oasup.LogUpdateProcessor.finish [collection1] webapp= path=/update params={wt=javabin&version=2} {add=[114]} 0 0
[junit4] 2> 1998204 T4085 C1178 oasup.LogUpdateProcessor.finish [collection1] webapp= path=/update params={wt=javabin&version=2} {add=[115]} 0 1
[junit4] 2> 1998208 T4087 C1179 oasup.LogUpdateProcessor.finish [collection1] webapp= path=/update params={wt=javabin&version=2} {add=[115]} 0 0
[junit4] 2> 1998213 T4089 C1178 oasup.LogUpdateProcessor.finish [collection1] webapp= path=/update params={wt=javabin&version=2} {add=[116]} 0 1
[junit4] 2> 1998217 T4091 C1179 oasup.LogUpdateProcessor.finish [collection1] webapp= path=/update params={wt=javabin&version=2} {add=[116]} 0 1
[junit4] 2> 1998221 T4093 C1178 oasup.LogUpdateProcessor.finish [collection1] webapp= path=/update params={wt=javabin&version=2} {add=[117]} 0 1
[junit4] 2> 1998225 T4095 C1179 oasup.LogUpdateProcessor.finish [collection1] webapp= path=/update params={wt=javabin&version=2} {add=[117]} 0 1
[junit4] 2> 1998229 T4097 C1178 oasup.LogUpdateProcessor.finish [collection1] webapp= path=/update params={wt=javabin&version=2} {add=[118]} 0 0
[junit4] 2> 1998233 T4099 C1179 oasup.LogUpdateProcessor.finish [collection1] webapp= path=/update params={wt=javabin&version=2} {add=[118]} 0 0
[junit4] 2> 1998237 T4101 C1178 oasup.LogUpdateProcessor.finish [collection1] webapp= path=/update params={wt=javabin&version=2} {add=[119]} 0 0
[junit4] 2> 1998241 T4103 C1179 oasup.LogUpdateProcessor.finish [collection1] webapp= path=/update params={wt=javabin&version=2} {add=[119]} 0 0
[junit4] 2> 1998246 T4105 C1178 oasup.LogUpdateProcessor.finish [collection1] webapp= path=/update params={wt=javabin&version=2} {add=[120]} 0 1
[junit4] 2> 1998250 T4107 C1179 oasup.LogUpdateProcessor.finish [collection1] webapp= path=/update params={wt=javabin&version=2} {add=[120]} 0 1
[junit4] 2> 1998254 T4109 C1178 oasup.LogUpdateProcessor.finish [collection1] webapp= path=/update params={wt=javabin&version=2} {add=[121]} 0 0
[junit4] 2> 1998259 T4111 C1179 oasup.LogUpdateProcessor.finish [collection1] webapp= path=/update params={wt=javabin&version=2} {add=[121]} 0 1
[junit4] 2> 1998263 T4113 C1178 oasup.LogUpdateProcessor.finish [collection1] webapp= path=/update params={wt=javabin&version=2} {add=[122]} 0 0
[junit4] 2> 1998268 T4115 C1179 oasup.LogUpdateProcessor.finish [collection1] webapp= path=/update params={wt=javabin&version=2} {add=[122]} 0 1
[junit4] 2> 1998273 T4117 C1178 oasup.LogUpdateProcessor.finish [collection1] webapp= path=/update params={wt=javabin&version=2} {add=[123]} 0 1
[junit4] 2> 1998278 T4119 C1179 oasup.LogUpdateProcessor.finish [collection1] webapp= path=/update params={wt=javabin&version=2} {add=[123]} 0 1
[junit4] 2> 1998283 T4121 C1178 oasup.LogUpdateProcessor.finish [collection1] webapp= path=/update params={wt=javabin&version=2} {add=[124]} 0 0
[junit4] 2> 1998288 T4123 C1179 oasup.LogUpdateProcessor.finish [collection1] webapp= path=/update params={wt=javabin&version=2} {add=[124]} 0 1
[junit4] 2> 1998293 T4125 C1178 oasup.LogUpdateProcessor.finish [collection1] webapp= path=/update params={wt=javabin&version=2} {add=[125]} 0 1
[junit4] 2> 1998298 T4127 C1179 oasup.LogUpdateProcessor.finish [collection1] webapp= path=/update params={wt=javabin&version=2} {add=[125]} 0 1
[junit4] 2> 1998303 T4129 C1178 oasup.LogUpdateProcessor.finish [collection1] webapp= path=/update params={wt=javabin&version=2} {add=[126]} 0 1
[junit4] 2> 1998308 T4131 C1179 oasup.LogUpdateProcessor.finish [collection1] webapp= path=/update params={wt=javabin&version=2} {add=[126]} 0 1
[junit4] 2> 1998313 T4133 C1178 oasup.LogUpdateProcessor.finish [collection1] webapp= path=/update params={wt=javabin&version=2} {add=[127]} 0 1
[junit4] 2> 1998318 T4135 C1179 oasup.LogUpdateProcessor.finish [collection1] webapp= path=/update params={wt=javabin&version=2} {add=[127]} 0 1
[junit4] 2> 1998323 T4137 C1178 oasup.LogUpdateProcessor.finish [collection1] webapp= path=/update params={wt=javabin&version=2} {add=[128]} 0 1
[junit4] 2> 1998329 T4139 C1179 oasup.LogUpdateProcessor.finish [collection1] webapp= path=/update params={wt=javabin&version=2} {add=[128]} 0 1
[junit4] 2> 1998337 T4141 C1178 oasup.LogUpdateProcessor.finish [collection1] webapp= path=/update params={wt=javabin&version=2} {add=[129]} 0 1
[junit4] 2> 1998402 T4143 C1179 oasup.LogUpdateProcessor.finish [collection1] webapp= path=/update params={wt=javabin&version=2} {add=[129]} 0 1
[junit4] 2> 1998407 T4145 C1178 oasup.LogUpdateProcessor.finish [collection1] webapp= path=/update params={wt=javabin&version=2} {add=[130]} 0 0
[junit4] 2> 1998412 T4147 C1179 oasup.LogUpdateProcessor.finish [collection1] webapp= path=/update params={wt=javabin&version=2} {add=[130]} 0 0
[junit4] 2> 1998417 T4149 C1178 oasup.LogUpdateProcessor.finish [collection1] webapp= path=/update params={wt=javabin&version=2} {add=[131]} 0 0
[junit4] 2> 1998422 T4151 C1179 oasup.LogUpdateProcessor.finish [collection1] webapp= path=/update params={wt=javabin&version=2} {add=[131]} 0 0
[junit4] 2> 1998428 T4153 C1178 oasup.LogUpdateProcessor.finish [collection1] webapp= path=/update params={wt=javabin&version=2} {add=[132]} 0 1
[junit4] 2> 1998432 T4155 C1179 oasup.LogUpdateProcessor.finish [collection1] webapp= path=/update params={wt=javabin&version=2} {add=[132]} 0 0
[junit4] 2> 1998438 T4157 C1178 oasup.LogUpdateProcessor.finish [collection1] webapp= path=/update params={wt=javabin&version=2} {add=[133]} 0 0
[junit4] 2> 1998445 T4159 C1179 oasup.LogUpdateProcessor.finish [collection1] webapp= path=/update params={wt=javabin&version=2} {add=[133]} 0 1
[junit4] 2> 1998451 T4161 C1178 oasup.LogUpdateProcessor.finish [collection1] webapp= path=/update params={wt=javabin&version=2} {add=[134]} 0 1
[junit4] 2> 1998457 T4163 C1179 oasup.LogUpdateProcessor.finish [collection1] webapp= path=/update params={wt=javabin&version=2} {add=[134]} 0 1
[junit4] 2> 1998463 T4165 C1178 oasup.LogUpdateProcessor.finish [collection1] webapp= path=/update params={wt=javabin&version=2} {add=[135]} 0 1
[junit4] 2> 1998468 T4167 C1179 oasup.LogUpdateProcessor.finish [collection1] webapp= path=/update params={wt=javabin&version=2} {add=[135]} 0 1
[junit4] 2> 1998474 T4169 C1178 oasup.LogUpdateProcessor.finish [collection1] webapp= path=/update params={wt=javabin&version=2} {add=[136]} 0 1
[junit4] 2> 1998479 T4171 C1179 oasup.LogUpdateProcessor.finish [collection1] webapp= path=/update params={wt=javabin&version=2} {add=[136]} 0 0
[junit4] 2> 1998485 T4173 C1178 oasup.LogUpdateProcessor.finish [collection1] webapp= path=/update params={wt=javabin&version=2} {add=[137]} 0 1
[junit4] 2> 1998492 T4175 C1179 oasup.LogUpdateProcessor.finish [collection1] webapp= path=/update params={wt=javabin&version=2} {add=[137]} 0 1
[junit4] 2> 1998501 T4177 C1178 oasup.LogUpdateProcessor.finish [collection1] webapp= path=/update params={wt=javabin&version=2} {add=[138]} 0 1
[junit4] 2> 1998507 T4179 C1179 oasup.LogUpdateProcessor.finish [collection1] webapp= path=/update params={wt=javabin&version=2} {add=[138]} 0 1
[junit4] 2> 1998514 T4181 C1178 oasup.LogUpdateProcessor.finish [collection1] webapp= path=/update params={wt=javabin&version=2} {add=[139]} 0 1
[junit4] 2> 1998520 T4183 C1179 oasup.LogUpdateProcessor.finish [collection1] webapp= path=/update params={wt=javabin&version=2} {add=[139]} 0 1
[junit4] 2> 1998526 T4185 C1178 oasup.LogUpdateProcessor.finish [collection1] webapp= path=/update params={wt=javabin&version=2} {add=[140]} 0 1
[junit4] 2> 1998531 T4187 C1179 oasup.LogUpdateProcessor.finish [collection1] webapp= path=/update params={wt=javabin&version=2} {add=[140]} 0 0
[junit4] 2> 1998537 T4189 C1178 oasup.LogUpdateProcessor.finish [collection1] webapp= path=/update params={wt=javabin&version=2} {add=[141]} 0 1
[junit4] 2> 1998542 T4191 C1179 oasup.LogUpdateProcessor.finish [collection1] webapp= path=/update params={wt=javabin&version=2} {add=[141]} 0 1
[junit4] 2> 1998546 T4193 C1178 oasup.LogUpdateProcessor.finish [collection1] webapp= path=/update params={wt=javabin&version=2} {add=[142]} 0 1
[junit4] 2> 1998550 T4195 C1179 oasup.LogUpdateProcessor.finish [collection1] webapp= path=/update params={wt=javabin&version=2} {add=[142]} 0 0
[junit4] 2> 1998554 T4197 C1178 oasup.LogUpdateProcessor.finish [collection1] webapp= path=/update params={wt=javabin&version=2} {add=[143]} 0 0
[junit4] 2> 1998559 T4199 C1179 oasup.LogUpdateProcessor.finish [collection1] webapp= path=/update params={wt=javabin&version=2} {add=[143]} 0 1
[junit4] 2> 1998563 T4201 C1178 oasup.LogUpdateProcessor.finish [collection1] webapp= path=/update params={wt=javabin&version=2} {add=[144]} 0 0
[junit4] 2> 1998568 T4203 C1179 oasup.LogUpdateProcessor.finish [collection1] webapp= path=/update params={wt=javabin&version=2} {add=[144]} 0 1
[junit4] 2> 1998572 T4205 C1178 oasup.LogUpdateProcessor.finish [collection1] webapp= path=/update params={wt=javabin&version=2} {add=[145]} 0 0
[junit4] 2> 1998577 T4207 C1179 oasup.LogUpdateProcessor.finish [collection1] webapp= path=/update params={wt=javabin&version=2} {add=[145]} 0 1
[junit4] 2> 1998584 T4209 C1178 oasup.LogUpdateProcessor.finish [collection1] webapp= path=/update params={wt=javabin&version=2} {add=[146]} 0 1
[junit4] 2> 1998588 T4211 C1179 oasup.LogUpdateProcessor.finish [collection1] webapp= path=/update params={wt=javabin&version=2} {add=[146]} 0 0
[junit4] 2> 1998593 T4213 C1178 oasup.LogUpdateProcessor.finish [collection1] webapp= path=/update params={wt=javabin&version=2} {add=[147]} 0 0
[junit4] 2> 1998597 T4215 C1179 oasup.LogUpdateProcessor.finish [collection1] webapp= path=/update params={wt=javabin&version=2} {add=[147]} 0 0
[junit4] 2> 1998603 T4217 C1178 oasup.LogUpdateProcessor.finish [collection1] webapp= path=/update params={wt=javabin&version=2} {add=[148]} 0 1
[junit4] 2> 1998607 T4219 C1179 oasup.LogUpdateProcessor.finish [collection1] webapp= path=/update params={wt=javabin&version=2} {add=[148]} 0 0
[junit4] 2> 1998613 T4221 C1178 oasup.LogUpdateProcessor.finish [collection1] webapp= path=/update params={wt=javabin&version=2} {add=[149]} 0 1
[junit4] 2> 1998618 T4223 C1179 oasup.LogUpdateProcessor.finish [collection1] webapp= path=/update params={wt=javabin&version=2} {add=[149]} 0 0
[junit4] 2> 1998624 T4225 C1178 oasu.DirectUpdateHandler2.commit start commit{,optimize=false,openSearcher=true,waitSearcher=true,expungeDeletes=false,softCommit=false,prepareCommit=false}
[junit4] 2> 1998640 T4225 C1178 oasc.SolrDeletionPolicy.onCommit SolrDeletionPolicy.onCommit: commits: num=2
[junit4] 2> commit{dir=RateLimitedDirectoryWrapper(MockDirectoryWrapper(RateLimitedDirectoryWrapper(RAMDirectory(id=lucene-3592b6b)))),segFN=segments_2,generation=2}
[junit4] 2> commit{dir=RateLimitedDirectoryWrapper(MockDirectoryWrapper(RateLimitedDirectoryWrapper(RAMDirectory(id=lucene-3592b6b)))),segFN=segments_3,generation=3}
[junit4] 2> 1998641 T4225 C1178 oasc.SolrDeletionPolicy.updateCommits newest commit generation = 3
[junit4] 2> 1998647 T4225 C1178 oass.SolrIndexSearcher.<init> Opening Searcher@4d9024ab[collection1] main
[junit4] 2> 1998647 T4225 C1178 oasu.DirectUpdateHandler2.commit end_commit_flush
[junit4] 2> 1998649 T3945 oasc.SolrCore.registerSearcher [collection1] Registered new searcher Searcher@4d9024ab[collection1] main{ExitableDirectoryReader(UninvertingDirectoryReader(Uninverting(_0(5.0.0):c9) Uninverting(_1(5.0.0):c59)))}
[junit4] 2> 1998650 T4225 C1178 oasup.LogUpdateProcessor.finish [collection1] webapp= path=/update params={wt=javabin&commit=true&version=2&softCommit=false&waitSearcher=true} {commit=} 0 26
[junit4] 2> 1998656 T4227 C1179 oasu.DirectUpdateHandler2.commit start commit{,optimize=false,openSearcher=true,waitSearcher=true,expungeDeletes=false,softCommit=false,prepareCommit=false}
[junit4] 2> 1998672 T4227 C1179 oasc.SolrDeletionPolicy.onCommit SolrDeletionPolicy.onCommit: commits: num=2
[junit4] 2> commit{dir=RateLimitedDirectoryWrapper(MockDirectoryWrapper(RateLimitedDirectoryWrapper(RAMDirectory(id=lucene-5582c258)))),segFN=segments_2,generation=2}
[junit4] 2> commit{dir=RateLimitedDirectoryWrapper(MockDirectoryWrapper(RateLimitedDirectoryWrapper(RAMDirectory(id=lucene-5582c258)))),segFN=segments_3,generation=3}
[junit4] 2> 1998673 T4227 C1179 oasc.SolrDeletionPolicy.updateCommits newest commit generation = 3
[junit4] 2> 1998674 T4227 C1179 oass.SolrIndexSearcher.<init> Opening Searcher@1bbe9347[collection1] main
[junit4] 2> 1998675 T4227 C1179 oasu.DirectUpdateHandler2.commit end_commit_flush
[junit4] 2> 1998676 T3957 oasc.SolrCore.registerSearcher [collection1] Registered new searcher Searcher@1bbe9347[collection1] main{ExitableDirectoryReader(UninvertingDirectoryReader(Uninverting(_0(5.0.0):c9) Uninverting(_1(5.0.0):c59)))}
[junit4] 2> 1998676 T4227 C1179 oasup.LogUpdateProcessor.finish [collection1] webapp= path=/update params={wt=javabin&commit=true&version=2&softCommit=false&waitSearcher=true} {commit=} 0 20
[junit4] 2> 1998682 T4229 C1178 oasc.SolrCore.execute [collection1] webapp= path=/select params={wt=javabin&q=*:*&version=2&distrib=false&sort=n_ti1+desc} hits=68 status=0 QTime=1
[junit4] 2> 1998827 T4235 C1179 oasc.SolrCore.execute [collection1] webapp= path=/select params={NOW=1414832634867&wt=javabin&rows=10&start=0&shard.url=[ff01::213]:33332/|https://127.0.0.1:18744/|[ff01::083]:33332/|[ff01::114]:33332/&fsv=true&q=*:*&version=2&fl=id&distrib=false&sort=n_ti1+desc&isShard=true} hits=68 status=0 QTime=1
[junit4] 2> 1998834 T4237 C1179 oasc.SolrCore.execute [collection1] webapp= path=/select params={NOW=1414832634867&wt=javabin&shard.url=[ff01::213]:33332/|https://127.0.0.1:18744/|[ff01::083]:33332/|[ff01::114]:33332/&q=*:*&version=2&distrib=false&ids=124,1,7,112,146,113,145,148,17,140&isShard=true} status=0 QTime=1
[junit4] 2> 1998839 T4231 C1179 oasc.SolrCore.execute [collection1] webapp= path=/select params={wt=javabin&q=*:*&version=2&shards=[ff01::213]:33332/|https://127.0.0.1:18744/|[ff01::083]:33332/|[ff01::114]:33332/&sort=n_ti1+desc} hits=68 status=0 QTime=152
[junit4] 2> 1998840 T3934 oas.BaseDistributedSearchTestCase.query starting stress...
[junit4] 2> 1998856 T4250 C1179 oasc.SolrCore.execute [collection1] webapp= path=/select params={NOW=1414832635030&wt=javabin&rows=10&start=0&shard.url=[ff01::213]:33332/|https://127.0.0.1:18744/|[ff01::083]:33332/|[ff01::114]:33332/&fsv=true&q=*:*&version=2&fl=id&distrib=false&sort=n_ti1+desc&isShard=true} hits=68 status=0 QTime=0
[junit4] 2> 1998859 T4251 C1179 oasc.SolrCore.execute [collection1] webapp= path=/select params={NOW=1414832635030&wt=javabin&rows=10&start=0&shard.url=[ff01::213]:33332/|https://127.0.0.1:18744/|[ff01::083]:33332/|[ff01::114]:33332/&fsv=true&q=*:*&version=2&fl=id&distrib=false&sort=n_ti1+desc&isShard=true} hits=68 status=0 QTime=1
[junit4] 2> 1998859 T4253 C1179 oasc.SolrCore.execute [collection1] webapp= path=/select params={NOW=1414832635030&wt=javabin&rows=10&start=0&shard.url=[ff01::213]:33332/|https://127.0.0.1:18744/|[ff01::083]:33332/|[ff01::114]:33332/&fsv=true&q=*:*&version=2&fl=id&distrib=false&sort=n_ti1+desc&isShard=true} hits=68 status=0 QTime=0
[junit4] 2> 1998862 T4256 C1179 oasc.SolrCore.execute [collection1] webapp= path=/select params={NOW=1414832635030&wt=javabin&shard.url=[ff01::213]:33332/|https://127.0.0.1:18744/|[ff01::083]:33332/|[ff01::114]:33332/&q=*:*&version=2&distrib=false&ids=124,1,7,112,146,113,145,148,17,140&isShard=true} status=0 QTime=0
[junit4] 2> 1998864 T4244 C1179 oasc.SolrCore.execute [collection1] webapp= path=/select params={wt=javabin&q=*:*&version=2&shards=[ff01::213]:33332/|https://127.0.0.1:18744/|[ff01::083]:33332/|[ff01::114]:33332/&sort=n_ti1+desc} hits=68 status=0 QTime=14
[junit4] 2> 1998865 T4257 C1179 oasc.SolrCore.execute [collection1] webapp= path=/select params={NOW=1414832635030&wt=javabin&shard.url=[ff01::213]:33332/|https://127.0.0.1:18744/|[ff01::083]:33332/|[ff01::114]:33332/&q=*:*&version=2&distrib=false&ids=124,1,7,112,146,113,145,148,17,140&isShard=true} status=0 QTime=1
[junit4] 2> 1998865 T4259 C1179 oasc.SolrCore.execute [collection1] webapp= path=/select params={NOW=1414832635030&wt=javabin&shard.url=[ff01::213]:33332/|https://127.0.0.1:18744/|[ff01::083]:33332/|[ff01::114]:33332/&q=*:*&version=2&distrib=false&ids=124,1,7,112,146,113,145,148,17,140&isShard=true} status=0 QTime=0
[junit4] 2> 1998866 T4243 C1179 oasc.SolrCore.execute [collection1] webapp= path=/select params={wt=javabin&q=*:*&version=2&shards=[ff01::213]:33332/|https://127.0.0.1:18744/|[ff01::083]:33332/|[ff01::114]:33332/&sort=n_ti1+desc} hits=68 status=0 QTime=16
[junit4] 2> 1998866 T4242 C1179 oasc.SolrCore.execute [collection1] webapp= path=/select params={wt=javabin&q=*:*&version=2&shards=[ff01::213]:33332/|https://127.0.0.1:18744/|[ff01::083]:33332/|[ff01::114]:33332/&sort=n_ti1+desc} hits=68 status=0 QTime=16
[junit4] 2> 1998875 T4266 C1179 oasc.SolrCore.execute [collection1] webapp= path=/select params={NOW=1414832635049&wt=javabin&rows=10&start=0&shard.url=[ff01::213]:33332/|https://127.0.0.1:18744/|[ff01::083]:33332/|[ff01::114]:33332/&fsv=true&q=*:*&version=2&fl=id&distrib=false&sort=n_ti1+desc&isShard=true} hits=68 status=0 QTime=1
[junit4] 2> 1998878 T4270 C1179 oasc.SolrCore.execute [collection1] webapp= path=/select params={NOW=1414832635053&wt=javabin&rows=10&start=0&shard.url=[ff01::213]:33332/|https://127.0.0.1:18744/|[ff01::083]:33332/|[ff01::114]:33332/&fsv=true&q=*:*&version=2&fl=id&distrib=false&sort=n_ti1+desc&isShard=true} hits=68 status=0 QTime=0
[junit4] 2> 1998879 T4271 C1179 oasc.SolrCore.execute [collection1] webapp= path=/select params={NOW=1414832635054&wt=javabin&rows=10&start=0&shard.url=[ff01::213]:33332/|https://127.0.0.1:18744/|[ff01::083]:33332/|[ff01::114]:33332/&fsv=true&q=*:*&version=2&fl=id&distrib=false&sort=n_ti1+desc&isShard=true} hits=68 status=0 QTime=0
[junit4] 2> 1998883 T4274 C1179 oasc.SolrCore.execute [collection1] webapp= path=/select params={NOW=1414832635049&wt=javabin&shard.url=[ff01::213]:33332/|https://127.0.0.1:18744/|[ff01::083]:33332/|[ff01::114]:33332/&q=*:*&version=2&distrib=false&ids=124,1,7,112,146,113,145,148,17,140&isShard=true} status=0 QTime=1
[junit4] 2> 1998884 T4262 C1179 oasc.SolrCore.execute [collection1] webapp= path=/select params={wt=javabin&q=*:*&version=2&shards=[ff01::213]:33332/|https://127.0.0.1:18744/|[ff01::083]:33332/|[ff01::114]:33332/&sort=n_ti1+desc} hits=68 status=0 QTime=15
[junit4] 2> 1998885 T4275 C1179 oasc.SolrCore.execute [collection1] webapp= path=/select params={NOW=1414832635053&wt=javabin&shard.url=[ff01::213]:33332/|https://127.0.0.1:18744/|[ff01::083]:33332/|[ff01::114]:33332/&q=*:*&version=2&distrib=false&ids=124,1,7,112,146,113,145,148,17,140&isShard=true} status=0 QTime=1
[junit4] 2> 1998886 T4277 C1179 oasc.SolrCore.execute [collection1] webapp= path=/select params={NOW=1414832635054&wt=javabin&shard.url=[ff01::213]:33332/|https://127.0.0.1:18744/|[ff01::083]:33332/|[ff01::114]:33332/&q=*:*&version=2&distrib=false&ids=124,1,7,112,146,113,145,148,17,140&isShard=true} status=0 QTime=1
[junit4] 2> 1998887 T4264 C1179 oasc.SolrCore.execute [collection1] webapp= path=/select params={wt=javabin&q=*:*&version=2&shards=[ff01::213]:33332/|https://127.0.0.1:18744/|[ff01::083]:33332/|[ff01::114]:33332/&sort=n_ti1+desc} hits=68 status=0 QTime=14
[junit4] 2> 1998888 T4265 C1179 oasc.SolrCore.execute [collection1] webapp= path=/select params={wt=javabin&q=*:*&version=2&shards=[ff01::213]:33332/|https://127.0.0.1:18744/|[ff01::083]:33332/|[ff01::114]:33332/&sort=n_ti1+desc} hits=68 status=0 QTime=14
[junit4] 2> 1998895 T4280 C1178 oasc.SolrCore.execute [collection1] webapp= path=/select params={wt=javabin&q=*:*&version=2&distrib=false&sort=n_ti1+asc} hits=68 status=0 QTime=1
[junit4] 2> 1998907 T4284 C1179 oasc.SolrCore.execute [collection1] webapp= path=/select params={NOW=1414832635081&wt=javabin&rows=10&start=0&shard.url=https://127.0.0.1:18744/|[ff01::213]:33332/|[ff01::083]:33332/&fsv=true&q=*:*&version=2&fl=id&distrib=false&sort=n_ti1+asc&isShard=true} hits=68 status=0 QTime=1
[junit4] 2> 1998913 T4286 C1179 oasc.SolrCore.execute [collection1] webapp= path=/select params={NOW=1414832635081&wt=javabin&shard.url=https://127.0.0.1:18744/|[ff01::213]:33332/|[ff01::083]:33332/&q=*:*&version=2&distrib=false&ids=103,137,133,9,131,128,15,5,149,4&isShard=true} status=0 QTime=0
[junit4] 2> 1998923 T4282 C1179 oasc.SolrCore.execute [collection1] webapp= path=/select params={wt=javabin&q=*:*&version=2&shards=https://127.0.0.1:18744/|[ff01::213]:33332/|[ff01::083]:33332/&sort=n_ti1+asc} hits=68 status=0 QTime=22
[junit4] 2> 1998926 T3934 oas.BaseDistributedSearchTestCase.query starting stress...
[junit4] 2> 1998936 T4296 C1179 oasc.SolrCore.execute [collection1] webapp= path=/select params={NOW=1414832635112&wt=javabin&rows=10&start=0&shard.url=https://127.0.0.1:18744/|[ff01::213]:33332/|[ff01::083]:33332/&fsv=true&q=*:*&version=2&fl=id&distrib=false&sort=n_ti1+asc&isShard=true} hits=68 status=0 QTime=0
[junit4] 2> 1998937 T4298 C1179 oasc.SolrCore.execute [collection1] webapp= path=/select params={NOW=1414832635112&wt=javabin&rows=10&start=0&shard.url=https://127.0.0.1:18744/|[ff01::213]:33332/|[ff01::083]:33332/&fsv=true&q=*:*&version=2&fl=id&distrib=false&sort=n_ti1+asc&isShard=true} hits=68 status=0 QTime=0
[junit4] 2> 1998939 T4300 C1179 oasc.SolrCore.execute [collection1] webapp= path=/select params={NOW=1414832635114&wt=javabin&rows=10&start=0&shard.url=https://127.0.0.1:18744/|[ff01::213]:33332/|[ff01::083]:33332/&fsv=true&q=*:*&version=2&fl=id&distrib=false&sort=n_ti1+asc&isShard=true} hits=68 status=0 QTime=0
[junit4] 2> 1998942 T4303 C1179 oasc.SolrCore.execute [collection1] webapp= path=/select params={NOW=1414832635112&wt=javabin&shard.url=https://127.0.0.1:18744/|[ff01::213]:33332/|[ff01::083]:33332/&q=*:*&version=2&distrib=false&ids=103,137,133,9,131,128,15,5,149,4&isShard=true} status=0 QTime=0
[junit4] 2> 1998943 T4304 C1179 oasc.SolrCore.execute [collection1] webapp= path=/select params={NOW=1414832635112&wt=javabin&shard.url=https://127.0.0.1:18744/|[ff01::213]:33332/|[ff01::083]:33332/&q=*:*&version=2&distrib=false&ids=103,137,133,9,131,128,15,5,149,4&isShard=true} status=0 QTime=0
[junit4] 2> 1998943 T4292 C1179 oasc.SolrCore.execute [collection1] webapp= path=/select params={wt=javabin&q=*:*&version=2&shards=https://127.0.0.1:18744/|[ff01::213]:33332/|[ff01::083]:33332/&sort=n_ti1+asc} hits=68 status=0 QTime=11
[junit4] 2> 1998944 T4291 C1179 oasc.SolrCore.execute [collection1] webapp= path=/select params={wt=javabin&q=*:*&version=2&shards=https://127.0.0.1:18744/|[ff01::213]:33332/|[ff01::083]:33332/&sort=n_ti1+asc} hits=68 status=0 QTime=12
[junit4] 2> 1998944 T4237 C1179 oasc.SolrCore.execute [collection1] webapp= path=/select params={NOW=1414832635114&wt=javabin&shard.url=https://127.0.0.1:18744/|[ff01::213]:33332/|[ff01::083]:33332/&q=*:*&version=2&distrib=false&ids=103,137,133,9,131,128,15,5,149,4&isShard=true} status=0 QTime=0
[junit4] 2> 1998945 T4293 C1179 oasc.SolrCore.execute [collection1] webapp= path=/select params={wt=javabin&q=*:*&version=2&shards=https://127.0.0.1:18744/|[ff01::213]:33332/|[ff01::083]:33332/&sort=n_ti1+asc} hits=68 status=0 QTime=11
[junit4] 2> ASYNC NEW_CORE C1180 name=collection1 org.apache.solr.core.SolrCore@1bfce2b3
[junit4] 2> 1998966 T4250 C1180 oasc.SolrCore.execute [collection1] webapp= path=/select params={NOW=1414832635142&wt=javabin&rows=10&start=0&shard.url=https://127.0.0.1:18744/|[ff01::213]:33332/|[ff01::083]:33332/&fsv=true&q=*:*&version=2&fl=id&distrib=false&sort=n_ti1+asc&isShard=true} hits=68 status=0 QTime=1
[junit4] 2> 1998967 T4251 C1180 oasc.SolrCore.execute [collection1] webapp= path=/select params={NOW=1414832635142&wt=javabin&rows=10&start=0&shard.url=https://127.0.0.1:18744/|[ff01::213]:33332/|[ff01::083]:33332/&fsv=true&q=*:*&version=2&fl=id&distrib=false&sort=n_ti1+asc&isShard=true} hits=68 status=0 QTime=0
[junit4] 2> 1998967 T4253 C1180 oasc.SolrCore.execute [collection1] webapp= path=/select params={NOW=1414832635142&wt=javabin&rows=10&start=0&shard.url=https://127.0.0.1:18744/|[ff01::213]:33332/|[ff01::083]:33332/&fsv=true&q=*:*&version=2&fl=id&distrib=false&sort=n_ti1+asc&isShard=true} hits=68 status=0 QTime=0
[junit4] 2> 1998971 T4256 C1180 oasc.SolrCore.execute [collection1] webapp= path=/select params={NOW=1414832635142&wt=javabin&shard.url=https://127.0.0.1:18744/|[ff01::213]:33332/|[ff01::083]:33332/&q=*:*&version=2&distrib=false&ids=103,137,133,9,131,128,15,5,149,4&isShard=true} status=0 QTime=0
[junit4] 2> 1998972 T4259 C1180 oasc.SolrCore.execute [collection1] webapp= path=/select params={NOW=1414832635142&wt=javabin&shard.url=https://127.0.0.1:18744/|[ff01::213]:33332/|[ff01::083]:33332/&q=*:*&version=2&distrib=false&ids=103,137,133,9,131,128,15,5,149,4&isShard=true} status=0 QTime=0
[junit4] 2> 1998973 T4308 C1180 oasc.SolrCore.execute [collection1] webapp= path=/select params={wt=javabin&q=*:*&version=2&shards=https://127.0.0.1:18744/|[ff01::213]:33332/|[ff01::083]:33332/&sort=n_ti1+asc} hits=68 status=0 QTime=11
[junit4] 2> 1998974 T4309 C1180 oasc.SolrCore.execute [collection1] webapp= path=/select params={wt=javabin&q=*:*&version=2&shards=https://127.0.0.1:18744/|[ff01::213]:33332/|[ff01::083]:33332/&sort=n_ti1+asc} hits=68 status=0 QTime=12
[junit4] 2> 1998974 T4257 C1180 oasc.SolrCore.execute [collection1] webapp= path=/select params={NOW=1414832635142&wt=javabin&shard.url=https://127.0.0.1:18744/|[ff01::213]:33332/|[ff01::083]:33332/&q=*:*&version=2&distrib=false&ids=103,137,133,9,131,128,15,5,149,4&isShard=true} status=0 QTime=0
[junit4] 2> 1998976 T4310 C1180 oasc.SolrCore.execute [collection1] webapp= path=/select params={wt=javabin&q=*:*&version=2&shards=https://127.0.0.1:18744/|[ff01::213]:33332/|[ff01::083]:33332/&sort=n_ti1+asc} hits=68 status=0 QTime=14
[junit4] 2> ASYNC NEW_CORE C1181 name=collection1 org.apache.solr.core.SolrCore@7bd2cc2b
[junit4] 2> 1998983 T4320 C1181 oasc.SolrCore.execute [collection1] webapp= path=/select params={wt=javabin&q=*:*&version=2&distrib=false&sort=n_f1+desc} hits=68 status=0 QTime=1
[junit4] 2> 1998994 T4266 C1180 oasc.SolrCore.execute [collection1] webapp= path=/select params={NOW=1414832635169&wt=javabin&rows=10&start=0&shard.url=[ff01::114]:33332/|https://127.0.0.1:18744/&fsv=true&q=*:*&version=2&fl=id&distrib=false&sort=n_f1+desc&isShard=true} hits=68 status=0 QTime=1
[junit4] 2> 1999000 T4270 C1180 oasc.SolrCore.execute [collection1] webapp= path=/select params={NOW=1414832635169&wt=javabin&shard.url=[ff01::114]:33332/|https://127.0.0.1:18744/&q=*:*&version=2&distrib=false&ids=16,2,7,112,13,114,117,1001,125,14&isShard=true} status=0 QTime=1
[junit4] 2> 1999005 T4322 C1180 oasc.SolrCore.execute [collection1] webapp= path=/select params={wt=javabin&q=*:*&version=2&shards=[ff01::114]:33332/|https://127.0.0.1:18744/&sort=n_f1+desc} hits=68 status=0 QTime=16
[junit4] 2> 1999006 T3934 oas.BaseDistributedSearchTestCase.query starting stress...
[junit4] 2> 1999017 T4271 C1180 oasc.SolrCore.execute [collection1] webapp= path=/select params={NOW=1414832635192&wt=javabin&rows=10&start=0&shard.url=[ff01::114]:33332/|https://127.0.0.1:18744/&fsv=true&q=*:*&version=2&fl=id&distrib=false&sort=n_f1+desc&isShard=true} hits=68 status=0 QTime=0
[junit4] 2> 1999019 T4274 C1180 oasc.SolrCore.execute [collection1] webapp= path=/select params={NOW=1414832635192&wt=javabin&rows=10&start=0&shard.url=[ff01::114]:33332/|https://127.0.0.1:18744/&fsv=true&q=*:*&version=2&fl=id&distrib=false&sort=n_f1+desc&isShard=true} hits=68 status=0 QTime=1
[junit4] 2> 1999019 T4275 C1180 oasc.SolrCore.execute [collection1] webapp= path=/select params={NOW=1414832635193&wt=javabin&rows=10&start=0&shard.url=[ff01::114]:33332/|https://127.0.0.1:18744/&fsv=true&q=*:*&version=2&fl=id&distrib=false&sort=n_f1+desc&isShard=true} hits=68 status=0 QTime=0
[junit4] 2> 1999023 T4277 C1180 oasc.SolrCore.execute [collection1] webapp= path=/select params={NOW=1414832635192&wt=javabin&shard.url=[ff01::114]:33332/|https://127.0.0.1:18744/&q=*:*&version=2&distrib=false&ids=16,2,7,112,13,114,117,1001,125,14&isShard=true} status=0 QTime=1
[junit4] 2> 1999024 T4331 C1180 oasc.SolrCore.execute [collection1] webapp= path=/select params={wt=javabin&q=*:*&version=2&shards=[ff01::114]:33332/|https://127.0.0.1:18744/&sort=n_f1+desc} hits=68 status=0 QTime=12
[junit4] 2> 1999024 T4284 C1180 oasc.SolrCore.execute [collection1] webapp= path=/select params={NOW=1414832635192&wt=javabin&shard.url=[ff01::114]:33332/|https://127.0.0.1:18744/&q=*:*&version=2&distrib=false&ids=16,2,7,112,13,114,117,1001,125,14&isShard=true} status=0 QTime=0
[junit4] 2> 1999025 T4286 C1180 oasc.SolrCore.execute [collection1] webapp= path=/select params={NOW=1414832635193&wt=javabin&shard.url=[ff01::114]:33332/|https://127.0.0.1:18744/&q=*:*&version=2&distrib=false&ids=16,2,7,112,13,114,117,1001,125,14&isShard=true} status=0 QTime=0
[junit4] 2> 1999026 T4330 C1180 oasc.SolrCore.execute [collection1] webapp= path=/select params={wt=javabin&q=*:*&version=2&shards=[ff01::114]:33332/|https://127.0.0.1:18744/&sort=n_f1+desc} hits=68 status=0 QTime=14
[junit4] 2> 1999026 T4329 C1180 oasc.SolrCore.execute [collection1] webapp= path=/select params={wt=javabin&q=*:*&version=2&shards=[ff01::114]:33332/|https://127.0.0.1:18744/&sort=n_f1+desc} hits=68 status=0 QTime=13
[junit4] 2> 1999034 T4296 C1180 oasc.SolrCore.execute [collection1] webapp= path=/select params={NOW=1414832635210&wt=javabin&rows=10&start=0&shard.url=[ff01::114]:33332/|https://127.0.0.1:18744/&fsv=true&q=*:*&version=2&fl=id&distrib=false&sort=n_f1+desc&isShard=true} hits=68 status=0 QTime=0
[junit4] 2> 1999035 T4298 C1180 oasc.SolrCore.execute [collection1] webapp= path=/select params={NOW=1414832635211&wt=javabin&rows=10&start=0&shard.url=[ff01::114]:33332/|https://127.0.0.1:18744/&fsv=true&q=*:*&version=2&fl=id&distrib=false&sort=n_f1+desc&isShard=true} hits=68 status=0 QTime=0
[junit4] 2> 1999037 T4300 C1180 oasc.SolrCore.execute [collection1] webapp= path=/select params={NOW=1414832635212&wt=javabin&rows=10&start=0&shard.url=[ff01::114]:33332/|https://127.0.0.1:18744/&fsv=true&q=*:*&version=2&fl=id&distrib=false&sort=n_f1+desc&isShard=true} hits=68 status=0 QTime=0
[junit4] 2> 1999039 T4303 C1180 oasc.SolrCore.execute [collection1] webapp= path=/select params={NOW=1414832635210&wt=javabin&shard.url=[ff01::114]:33332/|https://127.0.0.1:18744/&q=*:*&version=2&distrib=false&ids=16,2,7,112,13,114,117,1001,125,14&isShard=true} status=0 QTime=0
[junit4] 2> 1999040 T4341 C1180 oasc.SolrCore.execute [collection1] webapp= path=/select params={wt=javabin&q=*:*&version=2&shards=[ff01::114]:33332/|https://127.0.0.1:18744/&sort=n_f1+desc} hits=68 status=0 QTime=10
[junit4] 2> 1999041 T4304 C1180 oasc.SolrCore.execute [collection1] webapp= path=/select params={NOW=1414832635211&wt=javabin&shard.url=[ff01::114]:33332/|https://127.0.0.1:18744/&q=*:*&version=2&distrib=false&ids=16,2,7,112,13,114,117,1001,125,14&isShard=true} status=0 QTime=1
[junit4] 2> 1999042 T4237 C1180 oasc.SolrCore.execute [collection1] webapp= path=/select params={NOW=1414832635212&wt=javabin&shard.url=[ff01::114]:33332/|https://127.0.0.1:18744/&q=*:*&version=2&distrib=false&ids=16,2,7,112,13,114,117,1001,125,14&isShard=true} status=0 QTime=0
[junit4] 2> 1999043 T4342 C1180 oasc.SolrCore.execute [collection1] webapp= path=/select params={wt=javabin&q=*:*&version=2&shards=[ff01::114]:33332/|https://127.0.0.1:18744/&sort=n_f1+desc} hits=68 status=0 QTime=12
[junit4] 2> 1999043 T4344 C1180 oasc.SolrCore.execute [collection1] webapp= path=/select params={wt=javabin&q=*:*&version=2&shards=[ff01::114]:33332/|https://127.0.0.1:18744/&sort=n_f1+desc} hits=68 status=0 QTime=11
[junit4] 2> 1999048 T4353 C1181 oasc.SolrCore.execute [collection1] webapp= path=/select params={wt=javabin&q=*:*&version=2&distrib=false&sort=n_f1+asc} hits=68 status=0 QTime=1
[junit4] 2> 1999055 T4250 C1180 oasc.SolrCore.execute [collection1] webapp= path=/select params={NOW=1414832635231&wt=javabin&rows=10&start=0&shard.url=[ff01::083]:33332/|[ff01::114]:33332/|https://127.0.0.1:18744/&fsv=true&q=*:*&version=2&fl=id&distrib=false&sort=n_f1+asc&isShard=true} hits=68 status=0 QTime=0
[junit4] 2> 1999060 T4251 C1180 oasc.SolrCore.execute [collection1] webapp= path=/select params={NOW=1414832635231&wt=javabin&shard.url=[ff01::083]:33332/|[ff01::114]:33332/|https://127.0.0.1:18744/&q=*:*&version=2&distrib=false&ids=3,119,108,109,146,110,103,137,143,127&isShard=true} status=0 QTime=1
[junit4] 2> 1999065 T4355 C1180 oasc.SolrCore.execute [collection1] webapp= path=/select params={wt=javabin&q=*:*&version=2&shards=[ff01::083]:33332/|[ff01::114]:33332/|https://127.0.0.1:18744/&sort=n_f1+asc} hits=68 status=0 QTime=14
[junit4] 2> 1999065 T3934 oas.BaseDistributedSearchTestCase.query starting stress...
[junit4] 2> 1999077 T4253 C1180 oasc.SolrCore.execute [collection1] webapp= path=/select params={NOW=1414832635254&wt=javabin&rows=10&start=0&shard.url=[ff01::083]:33332/|[ff01::114]:33332/|https://127.0.0.1:18744/&fsv=true&q=*:*&version=2&fl=id&distrib=false&sort=n_f1+asc&isShard=true} hits=68 status=0 QTime=0
[junit4] 2> 1999079 T4256 C1180 oasc.SolrCore.execute [collection1] webapp= path=/select params={NOW=1414832635253&wt=javabin&rows=10&start=0&shard.url=[ff01::083]:33332/|[ff01::114]:33332/|https://127.0.0.1:18744/&fsv=true&q=*:*&version=2&fl=id&distrib=false&sort=n_f1+asc&isShard=true} hits=68 status=0 QTime=0
[junit4] 2> 1999080 T4259 C1180 oasc.SolrCore.execute [collection1] webapp= path=/select params={NOW=1414832635255&wt=javabin&rows=10&start=0&shard.url=[ff01::083]:33332/|[ff01::114]:33332/|https://127.0.0.1:18744/&fsv=true&q=*:*&version=2&fl=id&distrib=false&sort=n_f1+asc&isShard=true} hits=68 status=0 QTime=1
[junit4] 2> 1999082 T4257 C1180 oasc.SolrCore.execute [collection1] webapp= path=/select params={NOW=1414832635254&wt=javabin&shard.url=[ff01::083]:33332/|[ff01::114]:33332/|https://127.0.0.1:18744/&q=*:*&version=2&distrib=false&ids=3,119,108,109,146,110,103,137,143,127&isShard=true} status=0 QTime=1
[junit4] 2> 1999083 T4362 C1180 oasc.SolrCore.execute [collection1] webapp= path=/select params={wt=javabin&q=*:*&version=2&shards=[ff01::083]:33332/|[ff01::114]:33332/|https://127.0.0.1:18744/&sort=n_f1+asc} hits=68 status=0 QTime=9
[junit4] 2> 1999084 T4266 C1180 oasc.SolrCore.execute [collection1] webapp= path=/select params={NOW=1414832635253&wt=javabin&shard.url=[ff01::083]:33332/|[ff01::114]:33332/|https://127.0.0.1:18744/&q=*:*&version=2&distrib=false&ids=3,119,108,109,146,110,103,137,143,127&isShard=true} status=0 QTime=0
[junit4] 2> 1999085 T4364 C1180 oasc.SolrCore.execute [collection1] webapp= path=/select params={wt=javabin&q=*:*&version=2&shards=[ff01::083]:33332/|[ff01::114]:33332/|https://127.0.0.1:18744/&sort=n_f1+asc} hits=68 status=0 QTime=12
[junit4] 2> 1999086 T4270 C1180 oasc.SolrCore.execute [collection1] webapp= path=/select params={NOW=1414832635255&wt=javabin&shard.url=[ff01::083]:33332/|[ff01::114]:33332/|https://127.0.0.1:18744/&q=*:*&version=2&distrib=false&ids=3,119,108,109,146,110,103,137,143,127&isShard=true} status=0 QTime=1
[junit4] 2> 1999087 T4363 C1180 oasc.SolrCore.execute [collection1] webapp= path=/select params={wt=javabin&q=*:*&version=2&shards=[ff01::083]:33332/|[ff01::114]:33332/|https://127.0.0.1:18744/&sort=n_f1+asc} hits=68 status=0 QTime=12
[junit4] 2> 1999095 T4271 C1180 oasc.SolrCore.execute [collection1] webapp= path=/select params={NOW=1414832635268&wt=javabin&rows=10&start=0&shard.url=[ff01::083]:33332/|[ff01::114]:33332/|https://127.0.0.1:18744/&fsv=true&q=*:*&version=2&fl=id&distrib=false&sort=n_f1+asc&isShard=true} hits=68 status=0 QTime=1
[junit4] 2> 1999095 T4275 C1180 oasc.SolrCore.execute [collection1] webapp= path=/select params={NOW=1414832635271&wt=javabin&rows=10&start=0&shard.url=[ff01::083]:33332/|[ff01::114]:33332/|https://127.0.0.1:18744/&fsv=true&q=*:*&version=2&fl=id&distrib=false&sort=n_f1+asc&isShard=true} hits=68 status=0 QTime=0
[junit4] 2> 1999095 T4274 C1180 oasc.SolrCore.execute [collection1] webapp= path=/select params={NOW=1414832635270&wt=javabin&rows=10&start=0&shard.url=[ff01::083]:33332/|[ff01::114]:33332/|https://127.0.0.1:18744/&fsv=true&q=*:*&version=2&fl=id&distrib=false&sort=n_f1+asc&isShard=true} hits=68 status=0 QTime=1
[junit4] 2> 1999101 T4284 C1180 oasc.SolrCore.execute [collection1] webapp= path=/select params={NOW=1414832635270&wt=javabin&shard.url=[ff01::083]:33332/|[ff01::114]:33332/|https://127.0.0.1:18744/&q=*:*&version=2&distrib=false&ids=3,119,108,109,146,110,103,137,143,127&isShard=true} status=0 QTime=1
[junit4] 2> 1999101 T4277 C1180 oasc.SolrCore.execute [collection1] webapp= path=/select params={NOW=1414832635268&wt=javabin&shard.url=[ff01::083]:33332/|[ff01::114]:33332/|https://127.0.0.1:18744/&q=*:*&version=2&distrib=false&ids=3,119,108,109,146,110,103,137,143,127&isShard=true} status=0 QTime=0
[junit4] 2> 1999102 T4375 C1180 oasc.SolrCore.execute [collection1] webapp= path=/select params={wt=javabin&q=*:*&version=2&shards=[ff01::083]:33332/|[ff01::114]:33332/|https://127.0.0.1:18744/&sort=n_f1+asc} hits=68 status=0 QTime=12
[junit4] 2> 1999102 T4374 C1180 oasc.SolrCore.execute [collection1] webapp= path=/select params={wt=javabin&q=*:*&version=2&shards=[ff01::083]:33332/|[ff01::114]:33332/|https://127.0.0.1:18744/&sort=n_f1+asc} hits=68 status=0 QTime=14
[junit4] 2> 1999103 T4286 C1180 oasc.SolrCore.execute [collection1] webapp= path=/select p
[...truncated too long message...]
losing directory: /usr/home/jenkins/jenkins-slave/workspace/Lucene-Solr-NightlyTests-5.x/solr/build/solr-core/test/J1/temp/solr.TestDistributedSearch-C5D8A97CC23B7905-001/tempDir-001/shard2/data
[junit4] 2> 2510044 T3934 oejsh.ContextHandler.doStop stopped o.e.j.s.ServletContextHandler{/,null}
[junit4] 2> 2515058 T3934 oas.SolrTestCaseJ4.tearDown ###Ending testDistribSearch
[junit4] 2> NOTE: download the large Jenkins line-docs file by running 'ant get-jenkins-line-docs' in the lucene directory.
[junit4] 2> NOTE: reproduce with: ant test -Dtestcase=TestDistributedSearch -Dtests.method=testDistribSearch -Dtests.seed=C5D8A97CC23B7905 -Dtests.multiplier=2 -Dtests.nightly=true -Dtests.slow=true -Dtests.linedocsfile=/home/jenkins/lucene-data/enwiki.random.lines.txt -Dtests.locale=in_ID -Dtests.timezone=Asia/Jakarta -Dtests.asserts=true -Dtests.file.encoding=US-ASCII
[junit4] ERROR 519s J1 | TestDistributedSearch.testDistribSearch <<<
[junit4] > Throwable #1: com.carrotsearch.randomizedtesting.UncaughtExceptionError: Captured an uncaught exception in thread: Thread[id=7230, name=Thread-1821, state=RUNNABLE, group=TGRP-TestDistributedSearch]
[junit4] > at __randomizedtesting.SeedInfo.seed([C5D8A97CC23B7905:443E2764B5641939]:0)
[junit4] > Caused by: java.lang.RuntimeException: org.apache.solr.client.solrj.SolrServerException: Timeout occured while waiting response from server at: https://127.0.0.1:21043
[junit4] > at __randomizedtesting.SeedInfo.seed([C5D8A97CC23B7905]:0)
[junit4] > at org.apache.solr.BaseDistributedSearchTestCase$5.run(BaseDistributedSearchTestCase.java:580)
[junit4] > Caused by: org.apache.solr.client.solrj.SolrServerException: Timeout occured while waiting response from server at: https://127.0.0.1:21043
[junit4] > at org.apache.solr.client.solrj.impl.HttpSolrServer.executeMethod(HttpSolrServer.java:579)
[junit4] > at org.apache.solr.client.solrj.impl.HttpSolrServer.request(HttpSolrServer.java:215)
[junit4] > at org.apache.solr.client.solrj.impl.HttpSolrServer.request(HttpSolrServer.java:211)
[junit4] > at org.apache.solr.client.solrj.request.QueryRequest.process(QueryRequest.java:91)
[junit4] > at org.apache.solr.client.solrj.SolrServer.query(SolrServer.java:301)
[junit4] > at org.apache.solr.BaseDistributedSearchTestCase$5.run(BaseDistributedSearchTestCase.java:575)
[junit4] > Caused by: java.net.SocketTimeoutException: Read timed out
[junit4] > at java.net.SocketInputStream.socketRead0(Native Method)
[junit4] > at java.net.SocketInputStream.read(SocketInputStream.java:152)
[junit4] > at java.net.SocketInputStream.read(SocketInputStream.java:122)
[junit4] > at sun.security.ssl.InputRecord.readFully(InputRecord.java:442)
[junit4] > at sun.security.ssl.InputRecord.read(InputRecord.java:480)
[junit4] > at sun.security.ssl.SSLSocketImpl.readRecord(SSLSocketImpl.java:927)
[junit4] > at sun.security.ssl.SSLSocketImpl.readDataRecord(SSLSocketImpl.java:884)
[junit4] > at sun.security.ssl.AppInputStream.read(AppInputStream.java:102)
[junit4] > at org.apache.http.impl.io.AbstractSessionInputBuffer.fillBuffer(AbstractSessionInputBuffer.java:160)
[junit4] > at org.apache.http.impl.io.SocketInputBuffer.fillBuffer(SocketInputBuffer.java:84)
[junit4] > at org.apache.http.impl.io.AbstractSessionInputBuffer.readLine(AbstractSessionInputBuffer.java:273)
[junit4] > at org.apache.http.impl.conn.DefaultHttpResponseParser.parseHead(DefaultHttpResponseParser.java:140)
[junit4] > at org.apache.http.impl.conn.DefaultHttpResponseParser.parseHead(DefaultHttpResponseParser.java:57)
[junit4] > at org.apache.http.impl.io.AbstractMessageParser.parse(AbstractMessageParser.java:260)
[junit4] > at org.apache.http.impl.AbstractHttpClientConnection.receiveResponseHeader(AbstractHttpClientConnection.java:283)
[junit4] > at org.apache.http.impl.conn.DefaultClientConnection.receiveResponseHeader(DefaultClientConnection.java:251)
[junit4] > at org.apache.http.impl.conn.ManagedClientConnectionImpl.receiveResponseHeader(ManagedClientConnectionImpl.java:197)
[junit4] > at org.apache.http.protocol.HttpRequestExecutor.doReceiveResponse(HttpRequestExecutor.java:271)
[junit4] > at org.apache.http.protocol.HttpRequestExecutor.execute(HttpRequestExecutor.java:123)
[junit4] > at org.apache.http.impl.client.DefaultRequestDirector.tryExecute(DefaultRequestDirector.java:682)
[junit4] > at org.apache.http.impl.client.DefaultRequestDirector.execute(DefaultRequestDirector.java:486)
[junit4] > at org.apache.http.impl.client.AbstractHttpClient.doExecute(AbstractHttpClient.java:863)
[junit4] > at org.apache.http.impl.client.CloseableHttpClient.execute(CloseableHttpClient.java:82)
[junit4] > at org.apache.http.impl.client.CloseableHttpClient.execute(CloseableHttpClient.java:106)
[junit4] > at org.apache.http.impl.client.CloseableHttpClient.execute(CloseableHttpClient.java:57)
[junit4] > at org.apache.solr.client.solrj.impl.HttpSolrServer.executeMethod(HttpSolrServer.java:465)
[junit4] > ... 5 more
[junit4] 2> 2515132 T3934 oas.SolrTestCaseJ4.deleteCore ###deleteCore
[junit4] 2> NOTE: test params are: codec=Asserting(Lucene50): {n_d1=PostingsFormat(name=LuceneFixedGap), n_ti1=Lucene50(blocksize=128), oddField_s=Lucene50(blocksize=128), b_n_tdt=BlockTreeOrds(blocksize=128), n_tl1=BlockTreeOrds(blocksize=128), SubjectTerms_mfacet=BlockTreeOrds(blocksize=128), lowerfilt1and2=PostingsFormat(name=LuceneFixedGap), n_tdt1=BlockTreeOrds(blocksize=128), text=PostingsFormat(name=MockRandom), n_f1=BlockTreeOrds(blocksize=128), n_l1=PostingsFormat(name=LuceneFixedGap), foo_d=Lucene50(blocksize=128), timestamp=PostingsFormat(name=LuceneFixedGap), rnd_b=Lucene50(blocksize=128), n_dt1=BlockTreeOrds(blocksize=128), foo_f=PostingsFormat(name=MockRandom), a_t=PostingsFormat(name=LuceneFixedGap), lowerfilt=PostingsFormat(name=LuceneFixedGap), intDefault=BlockTreeOrds(blocksize=128), id=Lucene50(blocksize=128), foo_b=PostingsFormat(name=MockRandom), other_tl1=BlockTreeOrds(blocksize=128), range_facet_l=PostingsFormat(name=LuceneFixedGap), multiDefault=PostingsFormat(name=LuceneFixedGap), n_tf1=PostingsFormat(name=LuceneFixedGap), n_td1=BlockTreeOrds(blocksize=128), a_n_tdt=PostingsFormat(name=MockRandom), a_i1=PostingsFormat(name=LuceneFixedGap)}, docValues:{timestamp=DocValuesFormat(name=SimpleText)}, sim=RandomSimilarityProvider(queryNorm=false,coord=no): {}, locale=in_ID, timezone=Asia/Jakarta
[junit4] 2> NOTE: FreeBSD 9.1-RELEASE-p3 amd64/Oracle Corporation 1.7.0_65 (64-bit)/cpus=16,threads=2,free=229851104,total=502792192
[junit4] 2> NOTE: All tests run in this JVM: [TestPartialUpdateDeduplication, CollectionsAPIAsyncDistributedZkTest, NotRequiredUniqueKeyTest, SuggesterFSTTest, NoCacheHeaderTest, SolrIndexConfigTest, PreAnalyzedFieldTest, ChaosMonkeySafeLeaderTest, TestCollationField, PathHierarchyTokenizerFactoryTest, PrimitiveFieldTypeTest, TestSystemIdResolver, SolrRequestParserTest, TestSweetSpotSimilarityFactory, TestSearcherReuse, DateFieldTest, SampleTest, TestFieldTypeResource, PeerSyncTest, TestFunctionQuery, SuggestComponentTest, TestAddFieldRealTimeGet, TestDefaultSearchFieldResource, FullSolrCloudDistribCmdsTest, TestReload, DebugComponentTest, TestAnalyzeInfixSuggestions, ClusterStateTest, TestReloadAndDeleteDocs, TestManagedSchemaFieldTypeResource, TestSchemaVersionResource, CurrencyFieldOpenExchangeTest, SolrCoreTest, ExternalFileFieldSortTest, TestExceedMaxTermLength, TestSchemaResource, TestManagedSynonymFilterFactory, HighlighterMaxOffsetTest, TestZkChroot, TestBM25SimilarityFactory, RequiredFieldsTest, CoreAdminRequestStatusTest, DirectUpdateHandlerOptimizeTest, SystemInfoHandlerTest, RankQueryTest, CloudMLTQParserTest, DirectSolrSpellCheckerTest, TestLMDirichletSimilarityFactory, TestBinaryField, BJQParserTest, TestStandardQParsers, TestComponentsName, SolrCoreCheckLockOnStartupTest, BasicDistributedZkTest, BasicDistributedZk2Test, SyncSliceTest, OverseerTest, LeaderElectionIntegrationTest, BasicZkTest, TestRandomFaceting, TestDistributedSearch]
[junit4] Completed on J1 in 519.45s, 1 test, 1 error <<< FAILURES!
[...truncated 314 lines...]
BUILD FAILED
/usr/home/jenkins/jenkins-slave/workspace/Lucene-Solr-NightlyTests-5.x/build.xml:532: The following error occurred while executing this line:
/usr/home/jenkins/jenkins-slave/workspace/Lucene-Solr-NightlyTests-5.x/build.xml:473: The following error occurred while executing this line:
/usr/home/jenkins/jenkins-slave/workspace/Lucene-Solr-NightlyTests-5.x/build.xml:61: The following error occurred while executing this line:
/usr/home/jenkins/jenkins-slave/workspace/Lucene-Solr-NightlyTests-5.x/extra-targets.xml:39: The following error occurred while executing this line:
/usr/home/jenkins/jenkins-slave/workspace/Lucene-Solr-NightlyTests-5.x/solr/build.xml:189: The following error occurred while executing this line:
/usr/home/jenkins/jenkins-slave/workspace/Lucene-Solr-NightlyTests-5.x/solr/common-build.xml:496: The following error occurred while executing this line:
/usr/home/jenkins/jenkins-slave/workspace/Lucene-Solr-NightlyTests-5.x/lucene/common-build.xml:1359: The following error occurred while executing this line:
/usr/home/jenkins/jenkins-slave/workspace/Lucene-Solr-NightlyTests-5.x/lucene/common-build.xml:966: There were test failures: 441 suites, 1804 tests, 1 error, 54 ignored (9 assumptions)
Total time: 250 minutes 23 seconds
Build step 'Invoke Ant' marked build as failure
Archiving artifacts
Sending artifact delta relative to Lucene-Solr-NightlyTests-5.x #654
Archived 5 artifacts
Archive block size is 32768
Received 0 blocks and 636752015 bytes
Compression is 0.0%
Took 1 min 58 sec
Recording test results
Email was triggered for: Failure
Sending email for trigger: Failure
[JENKINS] Lucene-Solr-NightlyTests-5.x - Build # 665 - Still
Failing
Posted by Apache Jenkins Server <je...@builds.apache.org>.
Build: https://builds.apache.org/job/Lucene-Solr-NightlyTests-5.x/665/
1 tests failed.
REGRESSION: org.apache.solr.cloud.CollectionsAPIDistributedZkTest.testDistribSearch
Error Message:
Error CREATEing SolrCore 'halfcollection_shard1_replica1': Unable to create core [halfcollection_shard1_replica1] Caused by: Could not get shard id for core: halfcollection_shard1_replica1
Stack Trace:
org.apache.solr.client.solrj.impl.HttpSolrServer$RemoteSolrException: Error CREATEing SolrCore 'halfcollection_shard1_replica1': Unable to create core [halfcollection_shard1_replica1] Caused by: Could not get shard id for core: halfcollection_shard1_replica1
at __randomizedtesting.SeedInfo.seed([6CFAFC4E7B581D4D:ED1C72560C077D71]:0)
at org.apache.solr.client.solrj.impl.HttpSolrServer.executeMethod(HttpSolrServer.java:569)
at org.apache.solr.client.solrj.impl.HttpSolrServer.request(HttpSolrServer.java:215)
at org.apache.solr.client.solrj.impl.HttpSolrServer.request(HttpSolrServer.java:211)
at org.apache.solr.cloud.CollectionsAPIDistributedZkTest.testErrorHandling(CollectionsAPIDistributedZkTest.java:583)
at org.apache.solr.cloud.CollectionsAPIDistributedZkTest.doTest(CollectionsAPIDistributedZkTest.java:205)
at org.apache.solr.BaseDistributedSearchTestCase.testDistribSearch(BaseDistributedSearchTestCase.java:869)
at sun.reflect.NativeMethodAccessorImpl.invoke0(Native Method)
at sun.reflect.NativeMethodAccessorImpl.invoke(NativeMethodAccessorImpl.java:57)
at sun.reflect.DelegatingMethodAccessorImpl.invoke(DelegatingMethodAccessorImpl.java:43)
at java.lang.reflect.Method.invoke(Method.java:606)
at com.carrotsearch.randomizedtesting.RandomizedRunner.invoke(RandomizedRunner.java:1618)
at com.carrotsearch.randomizedtesting.RandomizedRunner$6.evaluate(RandomizedRunner.java:827)
at com.carrotsearch.randomizedtesting.RandomizedRunner$7.evaluate(RandomizedRunner.java:863)
at com.carrotsearch.randomizedtesting.RandomizedRunner$8.evaluate(RandomizedRunner.java:877)
at com.carrotsearch.randomizedtesting.rules.SystemPropertiesRestoreRule$1.evaluate(SystemPropertiesRestoreRule.java:53)
at org.apache.lucene.util.TestRuleSetupTeardownChained$1.evaluate(TestRuleSetupTeardownChained.java:50)
at org.apache.lucene.util.AbstractBeforeAfterRule$1.evaluate(AbstractBeforeAfterRule.java:46)
at com.carrotsearch.randomizedtesting.rules.SystemPropertiesInvariantRule$1.evaluate(SystemPropertiesInvariantRule.java:55)
at org.apache.lucene.util.TestRuleThreadAndTestName$1.evaluate(TestRuleThreadAndTestName.java:49)
at org.apache.lucene.util.TestRuleIgnoreAfterMaxFailures$1.evaluate(TestRuleIgnoreAfterMaxFailures.java:65)
at org.apache.lucene.util.TestRuleMarkFailure$1.evaluate(TestRuleMarkFailure.java:48)
at com.carrotsearch.randomizedtesting.rules.StatementAdapter.evaluate(StatementAdapter.java:36)
at com.carrotsearch.randomizedtesting.ThreadLeakControl$StatementRunner.run(ThreadLeakControl.java:365)
at com.carrotsearch.randomizedtesting.ThreadLeakControl.forkTimeoutingTask(ThreadLeakControl.java:798)
at com.carrotsearch.randomizedtesting.ThreadLeakControl$3.evaluate(ThreadLeakControl.java:458)
at com.carrotsearch.randomizedtesting.RandomizedRunner.runSingleTest(RandomizedRunner.java:836)
at com.carrotsearch.randomizedtesting.RandomizedRunner$3.evaluate(RandomizedRunner.java:738)
at com.carrotsearch.randomizedtesting.RandomizedRunner$4.evaluate(RandomizedRunner.java:772)
at com.carrotsearch.randomizedtesting.RandomizedRunner$5.evaluate(RandomizedRunner.java:783)
at com.carrotsearch.randomizedtesting.rules.StatementAdapter.evaluate(StatementAdapter.java:36)
at com.carrotsearch.randomizedtesting.rules.SystemPropertiesRestoreRule$1.evaluate(SystemPropertiesRestoreRule.java:53)
at org.apache.lucene.util.AbstractBeforeAfterRule$1.evaluate(AbstractBeforeAfterRule.java:46)
at org.apache.lucene.util.TestRuleStoreClassName$1.evaluate(TestRuleStoreClassName.java:42)
at com.carrotsearch.randomizedtesting.rules.SystemPropertiesInvariantRule$1.evaluate(SystemPropertiesInvariantRule.java:55)
at com.carrotsearch.randomizedtesting.rules.NoShadowingOrOverridesOnMethodsRule$1.evaluate(NoShadowingOrOverridesOnMethodsRule.java:39)
at com.carrotsearch.randomizedtesting.rules.NoShadowingOrOverridesOnMethodsRule$1.evaluate(NoShadowingOrOverridesOnMethodsRule.java:39)
at com.carrotsearch.randomizedtesting.rules.StatementAdapter.evaluate(StatementAdapter.java:36)
at com.carrotsearch.randomizedtesting.rules.StatementAdapter.evaluate(StatementAdapter.java:36)
at com.carrotsearch.randomizedtesting.rules.StatementAdapter.evaluate(StatementAdapter.java:36)
at org.apache.lucene.util.TestRuleAssertionsRequired$1.evaluate(TestRuleAssertionsRequired.java:54)
at org.apache.lucene.util.TestRuleMarkFailure$1.evaluate(TestRuleMarkFailure.java:48)
at org.apache.lucene.util.TestRuleIgnoreAfterMaxFailures$1.evaluate(TestRuleIgnoreAfterMaxFailures.java:65)
at org.apache.lucene.util.TestRuleIgnoreTestSuites$1.evaluate(TestRuleIgnoreTestSuites.java:55)
at com.carrotsearch.randomizedtesting.rules.StatementAdapter.evaluate(StatementAdapter.java:36)
at com.carrotsearch.randomizedtesting.ThreadLeakControl$StatementRunner.run(ThreadLeakControl.java:365)
at java.lang.Thread.run(Thread.java:745)
Build Log:
[...truncated 13112 lines...]
[junit4] Suite: org.apache.solr.cloud.CollectionsAPIDistributedZkTest
[junit4] 2> Creating dataDir: /usr/home/jenkins/jenkins-slave/workspace/Lucene-Solr-NightlyTests-5.x/solr/build/solr-core/test/J3/temp/solr.cloud.CollectionsAPIDistributedZkTest-6CFAFC4E7B581D4D-001/init-core-data-001
[junit4] 2> 2581891 T7843 oas.SolrTestCaseJ4.buildSSLConfig Randomized ssl (true) and clientAuth (false)
[junit4] 2> 2581892 T7843 oas.BaseDistributedSearchTestCase.initHostContext Setting hostContext system property: /
[junit4] 2> 2581897 T7843 oas.SolrTestCaseJ4.setUp ###Starting testDistribSearch
[junit4] 2> 2581898 T7843 oasc.ZkTestServer.run STARTING ZK TEST SERVER
[junit4] 1> client port:0.0.0.0/0.0.0.0:0
[junit4] 2> 2581899 T7844 oasc.ZkTestServer$ZKServerMain.runFromConfig Starting server
[junit4] 2> 2581999 T7843 oasc.ZkTestServer.run start zk server on port:31689
[junit4] 2> 2582000 T7843 oascc.SolrZkClient.createZkCredentialsToAddAutomatically Using default ZkCredentialsProvider
[junit4] 2> 2582000 T7843 oascc.ConnectionManager.waitForConnected Waiting for client to connect to ZooKeeper
[junit4] 2> 2582003 T7850 oascc.ConnectionManager.process Watcher org.apache.solr.common.cloud.ConnectionManager@40ea041d name:ZooKeeperConnection Watcher:127.0.0.1:31689 got event WatchedEvent state:SyncConnected type:None path:null path:null type:None
[junit4] 2> 2582004 T7843 oascc.ConnectionManager.waitForConnected Client is connected to ZooKeeper
[junit4] 2> 2582004 T7843 oascc.SolrZkClient.createZkACLProvider Using default ZkACLProvider
[junit4] 2> 2582004 T7843 oascc.SolrZkClient.makePath makePath: /solr
[junit4] 2> 2582006 T7843 oascc.SolrZkClient.createZkCredentialsToAddAutomatically Using default ZkCredentialsProvider
[junit4] 2> 2582008 T7843 oascc.ConnectionManager.waitForConnected Waiting for client to connect to ZooKeeper
[junit4] 2> 2582008 T7852 oascc.ConnectionManager.process Watcher org.apache.solr.common.cloud.ConnectionManager@3296f5b1 name:ZooKeeperConnection Watcher:127.0.0.1:31689/solr got event WatchedEvent state:SyncConnected type:None path:null path:null type:None
[junit4] 2> 2582009 T7843 oascc.ConnectionManager.waitForConnected Client is connected to ZooKeeper
[junit4] 2> 2582009 T7843 oascc.SolrZkClient.createZkACLProvider Using default ZkACLProvider
[junit4] 2> 2582009 T7843 oascc.SolrZkClient.makePath makePath: /collections/collection1
[junit4] 2> 2582011 T7843 oascc.SolrZkClient.makePath makePath: /collections/collection1/shards
[junit4] 2> 2582012 T7843 oascc.SolrZkClient.makePath makePath: /collections/control_collection
[junit4] 2> 2582013 T7843 oascc.SolrZkClient.makePath makePath: /collections/control_collection/shards
[junit4] 2> 2582015 T7843 oasc.AbstractZkTestCase.putConfig put /usr/home/jenkins/jenkins-slave/workspace/Lucene-Solr-NightlyTests-5.x/solr/core/src/test-files/solr/collection1/conf/solrconfig-tlog.xml to /configs/conf1/solrconfig.xml
[junit4] 2> 2582016 T7843 oascc.SolrZkClient.makePath makePath: /configs/conf1/solrconfig.xml
[junit4] 2> 2582018 T7843 oasc.AbstractZkTestCase.putConfig put /usr/home/jenkins/jenkins-slave/workspace/Lucene-Solr-NightlyTests-5.x/solr/core/src/test-files/solr/collection1/conf/schema.xml to /configs/conf1/schema.xml
[junit4] 2> 2582019 T7843 oascc.SolrZkClient.makePath makePath: /configs/conf1/schema.xml
[junit4] 2> 2582120 T7843 oasc.AbstractZkTestCase.putConfig put /usr/home/jenkins/jenkins-slave/workspace/Lucene-Solr-NightlyTests-5.x/solr/core/src/test-files/solr/collection1/conf/solrconfig.snippet.randomindexconfig.xml to /configs/conf1/solrconfig.snippet.randomindexconfig.xml
[junit4] 2> 2582121 T7843 oascc.SolrZkClient.makePath makePath: /configs/conf1/solrconfig.snippet.randomindexconfig.xml
[junit4] 2> 2582123 T7843 oasc.AbstractZkTestCase.putConfig put /usr/home/jenkins/jenkins-slave/workspace/Lucene-Solr-NightlyTests-5.x/solr/core/src/test-files/solr/collection1/conf/stopwords.txt to /configs/conf1/stopwords.txt
[junit4] 2> 2582124 T7843 oascc.SolrZkClient.makePath makePath: /configs/conf1/stopwords.txt
[junit4] 2> 2582125 T7843 oasc.AbstractZkTestCase.putConfig put /usr/home/jenkins/jenkins-slave/workspace/Lucene-Solr-NightlyTests-5.x/solr/core/src/test-files/solr/collection1/conf/protwords.txt to /configs/conf1/protwords.txt
[junit4] 2> 2582126 T7843 oascc.SolrZkClient.makePath makePath: /configs/conf1/protwords.txt
[junit4] 2> 2582128 T7843 oasc.AbstractZkTestCase.putConfig put /usr/home/jenkins/jenkins-slave/workspace/Lucene-Solr-NightlyTests-5.x/solr/core/src/test-files/solr/collection1/conf/currency.xml to /configs/conf1/currency.xml
[junit4] 2> 2582128 T7843 oascc.SolrZkClient.makePath makePath: /configs/conf1/currency.xml
[junit4] 2> 2582130 T7843 oasc.AbstractZkTestCase.putConfig put /usr/home/jenkins/jenkins-slave/workspace/Lucene-Solr-NightlyTests-5.x/solr/core/src/test-files/solr/collection1/conf/enumsConfig.xml to /configs/conf1/enumsConfig.xml
[junit4] 2> 2582131 T7843 oascc.SolrZkClient.makePath makePath: /configs/conf1/enumsConfig.xml
[junit4] 2> 2582132 T7843 oasc.AbstractZkTestCase.putConfig put /usr/home/jenkins/jenkins-slave/workspace/Lucene-Solr-NightlyTests-5.x/solr/core/src/test-files/solr/collection1/conf/open-exchange-rates.json to /configs/conf1/open-exchange-rates.json
[junit4] 2> 2582133 T7843 oascc.SolrZkClient.makePath makePath: /configs/conf1/open-exchange-rates.json
[junit4] 2> 2582134 T7843 oasc.AbstractZkTestCase.putConfig put /usr/home/jenkins/jenkins-slave/workspace/Lucene-Solr-NightlyTests-5.x/solr/core/src/test-files/solr/collection1/conf/mapping-ISOLatin1Accent.txt to /configs/conf1/mapping-ISOLatin1Accent.txt
[junit4] 2> 2582135 T7843 oascc.SolrZkClient.makePath makePath: /configs/conf1/mapping-ISOLatin1Accent.txt
[junit4] 2> 2582137 T7843 oasc.AbstractZkTestCase.putConfig put /usr/home/jenkins/jenkins-slave/workspace/Lucene-Solr-NightlyTests-5.x/solr/core/src/test-files/solr/collection1/conf/old_synonyms.txt to /configs/conf1/old_synonyms.txt
[junit4] 2> 2582138 T7843 oascc.SolrZkClient.makePath makePath: /configs/conf1/old_synonyms.txt
[junit4] 2> 2582139 T7843 oasc.AbstractZkTestCase.putConfig put /usr/home/jenkins/jenkins-slave/workspace/Lucene-Solr-NightlyTests-5.x/solr/core/src/test-files/solr/collection1/conf/synonyms.txt to /configs/conf1/synonyms.txt
[junit4] 2> 2582140 T7843 oascc.SolrZkClient.makePath makePath: /configs/conf1/synonyms.txt
[junit4] 2> 2582142 T7843 oascc.SolrZkClient.createZkCredentialsToAddAutomatically Using default ZkCredentialsProvider
[junit4] 2> 2582143 T7843 oascc.ConnectionManager.waitForConnected Waiting for client to connect to ZooKeeper
[junit4] 2> 2582144 T7854 oascc.ConnectionManager.process Watcher org.apache.solr.common.cloud.ConnectionManager@6017f1b7 name:ZooKeeperConnection Watcher:127.0.0.1:31689/solr got event WatchedEvent state:SyncConnected type:None path:null path:null type:None
[junit4] 2> 2582144 T7843 oascc.ConnectionManager.waitForConnected Client is connected to ZooKeeper
[junit4] 2> 2582145 T7843 oascc.SolrZkClient.createZkACLProvider Using default ZkACLProvider
[junit4] 2> Using old style solr.xml
[junit4] 2> 2582146 T7843 oascc.SolrZkClient.createZkCredentialsToAddAutomatically Using default ZkCredentialsProvider
[junit4] 2> 2582147 T7843 oascc.ConnectionManager.waitForConnected Waiting for client to connect to ZooKeeper
[junit4] 2> 2582148 T7856 oascc.ConnectionManager.process Watcher org.apache.solr.common.cloud.ConnectionManager@23304b50 name:ZooKeeperConnection Watcher:127.0.0.1:31689 got event WatchedEvent state:SyncConnected type:None path:null path:null type:None
[junit4] 2> 2582148 T7843 oascc.ConnectionManager.waitForConnected Client is connected to ZooKeeper
[junit4] 2> 2582148 T7843 oascc.SolrZkClient.createZkACLProvider Using default ZkACLProvider
[junit4] 2> 2582149 T7843 oascc.SolrZkClient.makePath makePath: /solr
[junit4] 2> 2582150 T7843 oascc.SolrZkClient.createZkCredentialsToAddAutomatically Using default ZkCredentialsProvider
[junit4] 2> 2582151 T7843 oascc.ConnectionManager.waitForConnected Waiting for client to connect to ZooKeeper
[junit4] 2> 2582152 T7858 oascc.ConnectionManager.process Watcher org.apache.solr.common.cloud.ConnectionManager@7303f31f name:ZooKeeperConnection Watcher:127.0.0.1:31689/solr got event WatchedEvent state:SyncConnected type:None path:null path:null type:None
[junit4] 2> 2582152 T7843 oascc.ConnectionManager.waitForConnected Client is connected to ZooKeeper
[junit4] 2> 2582152 T7843 oascc.SolrZkClient.createZkACLProvider Using default ZkACLProvider
[junit4] 2> 2582153 T7843 oasc.AbstractZkTestCase.putConfig put /usr/home/jenkins/jenkins-slave/workspace/Lucene-Solr-NightlyTests-5.x/solr/core/src/test-files/solr/collection1/conf/solrconfig-tlog.xml to /configs/conf2/solrconfig.xml
[junit4] 2> 2582153 T7843 oascc.SolrZkClient.makePath makePath: /configs/conf2/solrconfig.xml
[junit4] 2> 2582156 T7843 oasc.AbstractZkTestCase.putConfig put /usr/home/jenkins/jenkins-slave/workspace/Lucene-Solr-NightlyTests-5.x/solr/core/src/test-files/solr/collection1/conf/schema.xml to /configs/conf2/schema.xml
[junit4] 2> 2582156 T7843 oascc.SolrZkClient.makePath makePath: /configs/conf2/schema.xml
[junit4] 2> 2582257 T7843 oasc.AbstractZkTestCase.putConfig put /usr/home/jenkins/jenkins-slave/workspace/Lucene-Solr-NightlyTests-5.x/solr/core/src/test-files/solr/collection1/conf/solrconfig.snippet.randomindexconfig.xml to /configs/conf2/solrconfig.snippet.randomindexconfig.xml
[junit4] 2> 2582258 T7843 oascc.SolrZkClient.makePath makePath: /configs/conf2/solrconfig.snippet.randomindexconfig.xml
[junit4] 2> 2582259 T7843 oasc.AbstractZkTestCase.putConfig put /usr/home/jenkins/jenkins-slave/workspace/Lucene-Solr-NightlyTests-5.x/solr/core/src/test-files/solr/collection1/conf/stopwords.txt to /configs/conf2/stopwords.txt
[junit4] 2> 2582260 T7843 oascc.SolrZkClient.makePath makePath: /configs/conf2/stopwords.txt
[junit4] 2> 2582262 T7843 oasc.AbstractZkTestCase.putConfig put /usr/home/jenkins/jenkins-slave/workspace/Lucene-Solr-NightlyTests-5.x/solr/core/src/test-files/solr/collection1/conf/protwords.txt to /configs/conf2/protwords.txt
[junit4] 2> 2582262 T7843 oascc.SolrZkClient.makePath makePath: /configs/conf2/protwords.txt
[junit4] 2> 2582264 T7843 oasc.AbstractZkTestCase.putConfig put /usr/home/jenkins/jenkins-slave/workspace/Lucene-Solr-NightlyTests-5.x/solr/core/src/test-files/solr/collection1/conf/currency.xml to /configs/conf2/currency.xml
[junit4] 2> 2582264 T7843 oascc.SolrZkClient.makePath makePath: /configs/conf2/currency.xml
[junit4] 2> 2582266 T7843 oasc.AbstractZkTestCase.putConfig put /usr/home/jenkins/jenkins-slave/workspace/Lucene-Solr-NightlyTests-5.x/solr/core/src/test-files/solr/collection1/conf/open-exchange-rates.json to /configs/conf2/open-exchange-rates.json
[junit4] 2> 2582266 T7843 oascc.SolrZkClient.makePath makePath: /configs/conf2/open-exchange-rates.json
[junit4] 2> 2582268 T7843 oasc.AbstractZkTestCase.putConfig put /usr/home/jenkins/jenkins-slave/workspace/Lucene-Solr-NightlyTests-5.x/solr/core/src/test-files/solr/collection1/conf/mapping-ISOLatin1Accent.txt to /configs/conf2/mapping-ISOLatin1Accent.txt
[junit4] 2> 2582268 T7843 oascc.SolrZkClient.makePath makePath: /configs/conf2/mapping-ISOLatin1Accent.txt
[junit4] 2> 2582270 T7843 oasc.AbstractZkTestCase.putConfig put /usr/home/jenkins/jenkins-slave/workspace/Lucene-Solr-NightlyTests-5.x/solr/core/src/test-files/solr/collection1/conf/old_synonyms.txt to /configs/conf2/old_synonyms.txt
[junit4] 2> 2582270 T7843 oascc.SolrZkClient.makePath makePath: /configs/conf2/old_synonyms.txt
[junit4] 2> 2582272 T7843 oasc.AbstractZkTestCase.putConfig put /usr/home/jenkins/jenkins-slave/workspace/Lucene-Solr-NightlyTests-5.x/solr/core/src/test-files/solr/collection1/conf/synonyms.txt to /configs/conf2/synonyms.txt
[junit4] 2> 2582272 T7843 oascc.SolrZkClient.makePath makePath: /configs/conf2/synonyms.txt
[junit4] 2> 2582274 T7843 oasc.AbstractZkTestCase.putConfig put /usr/home/jenkins/jenkins-slave/workspace/Lucene-Solr-NightlyTests-5.x/solr/core/src/test-files/solr/collection1/conf/elevate.xml to /configs/conf2/elevate.xml
[junit4] 2> 2582275 T7843 oascc.SolrZkClient.makePath makePath: /configs/conf2/elevate.xml
[junit4] 2> 2583422 T7843 oejs.Server.doStart jetty-8.1.10.v20130312
[junit4] 2> 2583426 T7843 oejus.SslContextFactory.doStart Enabled Protocols [SSLv2Hello, SSLv3, TLSv1, TLSv1.1, TLSv1.2] of [SSLv2Hello, SSLv3, TLSv1, TLSv1.1, TLSv1.2]
[junit4] 2> 2583429 T7843 oejs.AbstractConnector.doStart Started SslSocketConnector@127.0.0.1:?????
[junit4] 2> 2583431 T7843 oass.SolrDispatchFilter.init SolrDispatchFilter.init()
[junit4] 2> 2583432 T7843 oasc.SolrResourceLoader.locateSolrHome JNDI not configured for solr (NoInitialContextEx)
[junit4] 2> 2583432 T7843 oasc.SolrResourceLoader.locateSolrHome using system property solr.solr.home: ../../../../../../../../../../../usr/home/jenkins/jenkins-slave/workspace/Lucene-Solr-NightlyTests-5.x/solr/build/solr-core/test/J3/temp/solr.cloud.CollectionsAPIDistributedZkTest-6CFAFC4E7B581D4D-001/tempDir-002
[junit4] 2> 2583432 T7843 oasc.SolrResourceLoader.<init> new SolrResourceLoader for directory: '../../../../../../../../../../../usr/home/jenkins/jenkins-slave/workspace/Lucene-Solr-NightlyTests-5.x/solr/build/solr-core/test/J3/temp/solr.cloud.CollectionsAPIDistributedZkTest-6CFAFC4E7B581D4D-001/tempDir-002/'
[junit4] 2> 2583697 T7843 oasc.ConfigSolr.fromFile Loading container configuration from /usr/home/jenkins/jenkins-slave/workspace/Lucene-Solr-NightlyTests-5.x/solr/build/solr-core/test/J3/../../../../../../../../../../../usr/home/jenkins/jenkins-slave/workspace/Lucene-Solr-NightlyTests-5.x/solr/build/solr-core/test/J3/temp/solr.cloud.CollectionsAPIDistributedZkTest-6CFAFC4E7B581D4D-001/tempDir-002/solr.xml
[junit4] 2> 2583753 T7843 oasc.CoreContainer.<init> New CoreContainer 1069957240
[junit4] 2> 2583753 T7843 oasc.CoreContainer.load Loading cores into CoreContainer [instanceDir=../../../../../../../../../../../usr/home/jenkins/jenkins-slave/workspace/Lucene-Solr-NightlyTests-5.x/solr/build/solr-core/test/J3/temp/solr.cloud.CollectionsAPIDistributedZkTest-6CFAFC4E7B581D4D-001/tempDir-002/]
[junit4] 2> 2583754 T7843 oashc.HttpShardHandlerFactory.getParameter Setting socketTimeout to: 120000
[junit4] 2> 2583755 T7843 oashc.HttpShardHandlerFactory.getParameter Setting urlScheme to: null
[junit4] 2> 2583755 T7843 oashc.HttpShardHandlerFactory.getParameter Setting connTimeout to: 15000
[junit4] 2> 2583755 T7843 oashc.HttpShardHandlerFactory.getParameter Setting maxConnectionsPerHost to: 20
[junit4] 2> 2583755 T7843 oashc.HttpShardHandlerFactory.getParameter Setting maxConnections to: 10000
[junit4] 2> 2583755 T7843 oashc.HttpShardHandlerFactory.getParameter Setting corePoolSize to: 0
[junit4] 2> 2583756 T7843 oashc.HttpShardHandlerFactory.getParameter Setting maximumPoolSize to: 2147483647
[junit4] 2> 2583756 T7843 oashc.HttpShardHandlerFactory.getParameter Setting maxThreadIdleTime to: 5
[junit4] 2> 2583756 T7843 oashc.HttpShardHandlerFactory.getParameter Setting sizeOfQueue to: -1
[junit4] 2> 2583756 T7843 oashc.HttpShardHandlerFactory.getParameter Setting fairnessPolicy to: false
[junit4] 2> 2583758 T7843 oasu.UpdateShardHandler.<init> Creating UpdateShardHandler HTTP client with params: socketTimeout=3400000&connTimeout=45000&retry=false
[junit4] 2> 2583760 T7843 oasl.LogWatcher.createWatcher SLF4J impl is org.slf4j.impl.Log4jLoggerFactory
[junit4] 2> 2583760 T7843 oasl.LogWatcher.newRegisteredLogWatcher Registering Log Listener [Log4j (org.slf4j.impl.Log4jLoggerFactory)]
[junit4] 2> 2583760 T7843 oasc.CoreContainer.load Host Name: 127.0.0.1
[junit4] 2> 2583761 T7843 oasc.ZkContainer.initZooKeeper Zookeeper client=127.0.0.1:31689/solr
[junit4] 2> 2583761 T7843 oasc.ZkController.checkChrootPath zkHost includes chroot
[junit4] 2> 2583761 T7843 oascc.SolrZkClient.createZkCredentialsToAddAutomatically Using default ZkCredentialsProvider
[junit4] 2> 2583762 T7843 oascc.ConnectionManager.waitForConnected Waiting for client to connect to ZooKeeper
[junit4] 2> 2583764 T7869 oascc.ConnectionManager.process Watcher org.apache.solr.common.cloud.ConnectionManager@73b49c82 name:ZooKeeperConnection Watcher:127.0.0.1:31689 got event WatchedEvent state:SyncConnected type:None path:null path:null type:None
[junit4] 2> 2583765 T7843 oascc.ConnectionManager.waitForConnected Client is connected to ZooKeeper
[junit4] 2> 2583765 T7843 oascc.SolrZkClient.createZkACLProvider Using default ZkACLProvider
[junit4] 2> 2583767 T7843 oascc.ConnectionManager.waitForConnected Waiting for client to connect to ZooKeeper
[junit4] 2> 2583768 T7871 oascc.ConnectionManager.process Watcher org.apache.solr.common.cloud.ConnectionManager@7b0000c7 name:ZooKeeperConnection Watcher:127.0.0.1:31689/solr got event WatchedEvent state:SyncConnected type:None path:null path:null type:None
[junit4] 2> 2583768 T7843 oascc.ConnectionManager.waitForConnected Client is connected to ZooKeeper
[junit4] 2> 2583769 T7843 oascc.SolrZkClient.makePath makePath: /overseer/queue
[junit4] 2> 2583771 T7843 oascc.SolrZkClient.makePath makePath: /overseer/collection-queue-work
[junit4] 2> 2583772 T7843 oascc.SolrZkClient.makePath makePath: /overseer/collection-map-running
[junit4] 2> 2583774 T7843 oascc.SolrZkClient.makePath makePath: /overseer/collection-map-completed
[junit4] 2> 2583775 T7843 oascc.SolrZkClient.makePath makePath: /overseer/collection-map-failure
[junit4] 2> 2583777 T7843 oascc.SolrZkClient.makePath makePath: /live_nodes
[junit4] 2> 2583778 T7843 oasc.ZkController.createEphemeralLiveNode Register node as live in ZooKeeper:/live_nodes/127.0.0.1:31695_
[junit4] 2> 2583779 T7843 oascc.SolrZkClient.makePath makePath: /live_nodes/127.0.0.1:31695_
[junit4] 2> 2583780 T7843 oascc.SolrZkClient.makePath makePath: /overseer_elect
[junit4] 2> 2583781 T7843 oascc.SolrZkClient.makePath makePath: /overseer_elect/election
[junit4] 2> 2583782 T7843 oasc.Overseer.close Overseer (id=null) closing
[junit4] 2> 2583784 T7843 oasc.OverseerElectionContext.runLeaderProcess I am going to be the leader 127.0.0.1:31695_
[junit4] 2> 2583784 T7843 oascc.SolrZkClient.makePath makePath: /overseer_elect/leader
[junit4] 2> 2583785 T7843 oasc.Overseer.start Overseer (id=92729847167123462-127.0.0.1:31695_-n_0000000000) starting
[junit4] 2> 2583787 T7843 oascc.SolrZkClient.makePath makePath: /overseer/queue-work
[junit4] 2> 2583792 T7843 oasc.OverseerAutoReplicaFailoverThread.<init> Starting OverseerAutoReplicaFailoverThread autoReplicaFailoverWorkLoopDelay=10000 autoReplicaFailoverWaitAfterExpiration=30000 autoReplicaFailoverBadNodeExpiration=60000
[junit4] 2> 2583792 T7873 oasc.OverseerCollectionProcessor.run Process current queue of collection creations
[junit4] 2> 2583793 T7843 oascc.SolrZkClient.makePath makePath: /clusterstate.json
[junit4] 2> 2583794 T7843 oascc.SolrZkClient.makePath makePath: /aliases.json
[junit4] 2> 2583795 T7843 oascc.ZkStateReader.createClusterStateWatchersAndUpdate Updating cluster state from ZooKeeper...
[junit4] 2> 2583797 T7872 oasc.Overseer$ClusterStateUpdater.run Starting to work on the main queue
[junit4] 2> 2583801 T7843 oass.SolrDispatchFilter.init user.dir=/usr/home/jenkins/jenkins-slave/workspace/Lucene-Solr-NightlyTests-5.x/solr/build/solr-core/test/J3
[junit4] 2> 2583801 T7843 oass.SolrDispatchFilter.init SolrDispatchFilter.init() done
[junit4] 2> 2583806 T7843 oascc.SolrZkClient.createZkCredentialsToAddAutomatically Using default ZkCredentialsProvider
[junit4] 2> 2583807 T7843 oascc.ConnectionManager.waitForConnected Waiting for client to connect to ZooKeeper
[junit4] 2> 2583808 T7877 oascc.ConnectionManager.process Watcher org.apache.solr.common.cloud.ConnectionManager@6f80e7e7 name:ZooKeeperConnection Watcher:127.0.0.1:31689/solr got event WatchedEvent state:SyncConnected type:None path:null path:null type:None
[junit4] 2> 2583809 T7843 oascc.ConnectionManager.waitForConnected Client is connected to ZooKeeper
[junit4] 2> 2583809 T7843 oascc.SolrZkClient.createZkACLProvider Using default ZkACLProvider
[junit4] 2> 2583810 T7843 oascc.ZkStateReader.createClusterStateWatchersAndUpdate Updating cluster state from ZooKeeper...
[junit4] 2> 2583811 T7843 oasc.ChaosMonkey.monkeyLog monkey: init - expire sessions:false cause connection loss:false
[junit4] 2> 2583812 T7843 oasc.AbstractFullDistribZkTestBase.createJettys Creating collection1 with stateFormat=2
[junit4] 2> 2583812 T7843 oascc.SolrZkClient.createZkCredentialsToAddAutomatically Using default ZkCredentialsProvider
[junit4] 2> 2583813 T7843 oascc.ConnectionManager.waitForConnected Waiting for client to connect to ZooKeeper
[junit4] 2> 2583814 T7879 oascc.ConnectionManager.process Watcher org.apache.solr.common.cloud.ConnectionManager@dd7e104 name:ZooKeeperConnection Watcher:127.0.0.1:31689/solr got event WatchedEvent state:SyncConnected type:None path:null path:null type:None
[junit4] 2> 2583814 T7843 oascc.ConnectionManager.waitForConnected Client is connected to ZooKeeper
[junit4] 2> 2583814 T7843 oascc.SolrZkClient.createZkACLProvider Using default ZkACLProvider
[junit4] 2> 2583816 T7880 oasc.DistributedQueue$LatchWatcher.process NodeChildrenChanged fired on path /overseer/queue state SyncConnected
[junit4] 2> 2583818 T7872 oasc.Overseer$ClusterStateUpdater.buildCollection building a new collection: collection1
[junit4] 2> 2583818 T7872 oasc.Overseer$ClusterStateUpdater.createCollection Create collection collection1 with shards [shard1, shard2]
[junit4] 2> 2583818 T7872 oasc.Overseer$ClusterStateUpdater.createCollection state version collection1 2
[junit4] 2> 2583820 T7872 oasc.Overseer$ClusterStateUpdater.updateZkStates going to create_collection /collections/collection1/state.json
[junit4] 2> 2583821 T7880 oascc.ZkStateReader$2.process A cluster state change: WatchedEvent state:SyncConnected type:NodeDataChanged path:/clusterstate.json, has occurred - updating... (live nodes size: 1)
[junit4] 2> 2583821 T7881 oascc.ZkStateReader$2.process A cluster state change: WatchedEvent state:SyncConnected type:NodeDataChanged path:/clusterstate.json, has occurred - updating... (live nodes size: 1)
[junit4] 2> 2584953 T7843 oasc.AbstractFullDistribZkTestBase.createJettys create jetty 1
[junit4] 2> 2584954 T7843 oejs.Server.doStart jetty-8.1.10.v20130312
[junit4] 2> 2584959 T7843 oejus.SslContextFactory.doStart Enabled Protocols [SSLv2Hello, SSLv3, TLSv1, TLSv1.1, TLSv1.2] of [SSLv2Hello, SSLv3, TLSv1, TLSv1.1, TLSv1.2]
[junit4] 2> 2584960 T7843 oejs.AbstractConnector.doStart Started SslSocketConnector@127.0.0.1:?????
[junit4] 2> 2584962 T7843 oass.SolrDispatchFilter.init SolrDispatchFilter.init()
[junit4] 2> 2584963 T7843 oasc.SolrResourceLoader.locateSolrHome JNDI not configured for solr (NoInitialContextEx)
[junit4] 2> 2584963 T7843 oasc.SolrResourceLoader.locateSolrHome using system property solr.solr.home: ../../../../../../../../../../../usr/home/jenkins/jenkins-slave/workspace/Lucene-Solr-NightlyTests-5.x/solr/build/solr-core/test/J3/temp/solr.cloud.CollectionsAPIDistributedZkTest-6CFAFC4E7B581D4D-001/tempDir-003
[junit4] 2> 2584963 T7843 oasc.SolrResourceLoader.<init> new SolrResourceLoader for directory: '../../../../../../../../../../../usr/home/jenkins/jenkins-slave/workspace/Lucene-Solr-NightlyTests-5.x/solr/build/solr-core/test/J3/temp/solr.cloud.CollectionsAPIDistributedZkTest-6CFAFC4E7B581D4D-001/tempDir-003/'
[junit4] 2> 2584992 T7843 oasc.ConfigSolr.fromFile Loading container configuration from /usr/home/jenkins/jenkins-slave/workspace/Lucene-Solr-NightlyTests-5.x/solr/build/solr-core/test/J3/../../../../../../../../../../../usr/home/jenkins/jenkins-slave/workspace/Lucene-Solr-NightlyTests-5.x/solr/build/solr-core/test/J3/temp/solr.cloud.CollectionsAPIDistributedZkTest-6CFAFC4E7B581D4D-001/tempDir-003/solr.xml
[junit4] 2> 2585044 T7843 oasc.CoreContainer.<init> New CoreContainer 704938551
[junit4] 2> 2585044 T7843 oasc.CoreContainer.load Loading cores into CoreContainer [instanceDir=../../../../../../../../../../../usr/home/jenkins/jenkins-slave/workspace/Lucene-Solr-NightlyTests-5.x/solr/build/solr-core/test/J3/temp/solr.cloud.CollectionsAPIDistributedZkTest-6CFAFC4E7B581D4D-001/tempDir-003/]
[junit4] 2> 2585045 T7843 oashc.HttpShardHandlerFactory.getParameter Setting socketTimeout to: 120000
[junit4] 2> 2585045 T7843 oashc.HttpShardHandlerFactory.getParameter Setting urlScheme to: null
[junit4] 2> 2585046 T7843 oashc.HttpShardHandlerFactory.getParameter Setting connTimeout to: 15000
[junit4] 2> 2585046 T7843 oashc.HttpShardHandlerFactory.getParameter Setting maxConnectionsPerHost to: 20
[junit4] 2> 2585046 T7843 oashc.HttpShardHandlerFactory.getParameter Setting maxConnections to: 10000
[junit4] 2> 2585046 T7843 oashc.HttpShardHandlerFactory.getParameter Setting corePoolSize to: 0
[junit4] 2> 2585046 T7843 oashc.HttpShardHandlerFactory.getParameter Setting maximumPoolSize to: 2147483647
[junit4] 2> 2585047 T7843 oashc.HttpShardHandlerFactory.getParameter Setting maxThreadIdleTime to: 5
[junit4] 2> 2585047 T7843 oashc.HttpShardHandlerFactory.getParameter Setting sizeOfQueue to: -1
[junit4] 2> 2585047 T7843 oashc.HttpShardHandlerFactory.getParameter Setting fairnessPolicy to: false
[junit4] 2> 2585049 T7843 oasu.UpdateShardHandler.<init> Creating UpdateShardHandler HTTP client with params: socketTimeout=3400000&connTimeout=45000&retry=false
[junit4] 2> 2585051 T7843 oasl.LogWatcher.createWatcher SLF4J impl is org.slf4j.impl.Log4jLoggerFactory
[junit4] 2> 2585051 T7843 oasl.LogWatcher.newRegisteredLogWatcher Registering Log Listener [Log4j (org.slf4j.impl.Log4jLoggerFactory)]
[junit4] 2> 2585051 T7843 oasc.CoreContainer.load Host Name: 127.0.0.1
[junit4] 2> 2585051 T7843 oasc.ZkContainer.initZooKeeper Zookeeper client=127.0.0.1:31689/solr
[junit4] 2> 2585052 T7843 oasc.ZkController.checkChrootPath zkHost includes chroot
[junit4] 2> 2585052 T7843 oascc.SolrZkClient.createZkCredentialsToAddAutomatically Using default ZkCredentialsProvider
[junit4] 2> 2585053 T7843 oascc.ConnectionManager.waitForConnected Waiting for client to connect to ZooKeeper
[junit4] 2> 2585054 T7892 oascc.ConnectionManager.process Watcher org.apache.solr.common.cloud.ConnectionManager@2e492812 name:ZooKeeperConnection Watcher:127.0.0.1:31689 got event WatchedEvent state:SyncConnected type:None path:null path:null type:None
[junit4] 2> 2585054 T7843 oascc.ConnectionManager.waitForConnected Client is connected to ZooKeeper
[junit4] 2> 2585055 T7843 oascc.SolrZkClient.createZkACLProvider Using default ZkACLProvider
[junit4] 2> 2585057 T7843 oascc.ConnectionManager.waitForConnected Waiting for client to connect to ZooKeeper
[junit4] 2> 2585058 T7894 oascc.ConnectionManager.process Watcher org.apache.solr.common.cloud.ConnectionManager@4007e19b name:ZooKeeperConnection Watcher:127.0.0.1:31689/solr got event WatchedEvent state:SyncConnected type:None path:null path:null type:None
[junit4] 2> 2585058 T7843 oascc.ConnectionManager.waitForConnected Client is connected to ZooKeeper
[junit4] 2> 2585062 T7843 oascc.ZkStateReader.createClusterStateWatchersAndUpdate Updating cluster state from ZooKeeper...
[junit4] 2> 2586066 T7843 oasc.ZkController.createEphemeralLiveNode Register node as live in ZooKeeper:/live_nodes/127.0.0.1:31704_
[junit4] 2> 2586067 T7843 oascc.SolrZkClient.makePath makePath: /live_nodes/127.0.0.1:31704_
[junit4] 2> 2586070 T7843 oasc.Overseer.close Overseer (id=null) closing
[junit4] 2> 2586075 T7843 oass.SolrDispatchFilter.init user.dir=/usr/home/jenkins/jenkins-slave/workspace/Lucene-Solr-NightlyTests-5.x/solr/build/solr-core/test/J3
[junit4] 2> 2586075 T7843 oass.SolrDispatchFilter.init SolrDispatchFilter.init() done
[junit4] 2> 2587295 T7843 oasc.AbstractFullDistribZkTestBase.createJettys create jetty 2
[junit4] 2> 2587296 T7843 oejs.Server.doStart jetty-8.1.10.v20130312
[junit4] 2> 2587300 T7843 oejus.SslContextFactory.doStart Enabled Protocols [SSLv2Hello, SSLv3, TLSv1, TLSv1.1, TLSv1.2] of [SSLv2Hello, SSLv3, TLSv1, TLSv1.1, TLSv1.2]
[junit4] 2> 2587301 T7843 oejs.AbstractConnector.doStart Started SslSocketConnector@127.0.0.1:?????
[junit4] 2> 2587303 T7843 oass.SolrDispatchFilter.init SolrDispatchFilter.init()
[junit4] 2> 2587304 T7843 oasc.SolrResourceLoader.locateSolrHome JNDI not configured for solr (NoInitialContextEx)
[junit4] 2> 2587304 T7843 oasc.SolrResourceLoader.locateSolrHome using system property solr.solr.home: /usr/home/jenkins/jenkins-slave/workspace/Lucene-Solr-NightlyTests-5.x/solr/build/solr-core/test/J3/temp/solr.cloud.CollectionsAPIDistributedZkTest-6CFAFC4E7B581D4D-001/tempDir-004
[junit4] 2> 2587304 T7843 oasc.SolrResourceLoader.<init> new SolrResourceLoader for directory: '/usr/home/jenkins/jenkins-slave/workspace/Lucene-Solr-NightlyTests-5.x/solr/build/solr-core/test/J3/temp/solr.cloud.CollectionsAPIDistributedZkTest-6CFAFC4E7B581D4D-001/tempDir-004/'
[junit4] 2> 2587333 T7843 oasc.ConfigSolr.fromFile Loading container configuration from /usr/home/jenkins/jenkins-slave/workspace/Lucene-Solr-NightlyTests-5.x/solr/build/solr-core/test/J3/temp/solr.cloud.CollectionsAPIDistributedZkTest-6CFAFC4E7B581D4D-001/tempDir-004/solr.xml
[junit4] 2> 2587386 T7843 oasc.CoreContainer.<init> New CoreContainer 739187808
[junit4] 2> 2587386 T7843 oasc.CoreContainer.load Loading cores into CoreContainer [instanceDir=/usr/home/jenkins/jenkins-slave/workspace/Lucene-Solr-NightlyTests-5.x/solr/build/solr-core/test/J3/temp/solr.cloud.CollectionsAPIDistributedZkTest-6CFAFC4E7B581D4D-001/tempDir-004/]
[junit4] 2> 2587387 T7843 oashc.HttpShardHandlerFactory.getParameter Setting socketTimeout to: 120000
[junit4] 2> 2587387 T7843 oashc.HttpShardHandlerFactory.getParameter Setting urlScheme to: null
[junit4] 2> 2587387 T7843 oashc.HttpShardHandlerFactory.getParameter Setting connTimeout to: 15000
[junit4] 2> 2587388 T7843 oashc.HttpShardHandlerFactory.getParameter Setting maxConnectionsPerHost to: 20
[junit4] 2> 2587388 T7843 oashc.HttpShardHandlerFactory.getParameter Setting maxConnections to: 10000
[junit4] 2> 2587388 T7843 oashc.HttpShardHandlerFactory.getParameter Setting corePoolSize to: 0
[junit4] 2> 2587388 T7843 oashc.HttpShardHandlerFactory.getParameter Setting maximumPoolSize to: 2147483647
[junit4] 2> 2587389 T7843 oashc.HttpShardHandlerFactory.getParameter Setting maxThreadIdleTime to: 5
[junit4] 2> 2587389 T7843 oashc.HttpShardHandlerFactory.getParameter Setting sizeOfQueue to: -1
[junit4] 2> 2587389 T7843 oashc.HttpShardHandlerFactory.getParameter Setting fairnessPolicy to: false
[junit4] 2> 2587391 T7843 oasu.UpdateShardHandler.<init> Creating UpdateShardHandler HTTP client with params: socketTimeout=3400000&connTimeout=45000&retry=false
[junit4] 2> 2587393 T7843 oasl.LogWatcher.createWatcher SLF4J impl is org.slf4j.impl.Log4jLoggerFactory
[junit4] 2> 2587393 T7843 oasl.LogWatcher.newRegisteredLogWatcher Registering Log Listener [Log4j (org.slf4j.impl.Log4jLoggerFactory)]
[junit4] 2> 2587393 T7843 oasc.CoreContainer.load Host Name: 127.0.0.1
[junit4] 2> 2587393 T7843 oasc.ZkContainer.initZooKeeper Zookeeper client=127.0.0.1:31689/solr
[junit4] 2> 2587393 T7843 oasc.ZkController.checkChrootPath zkHost includes chroot
[junit4] 2> 2587394 T7843 oascc.SolrZkClient.createZkCredentialsToAddAutomatically Using default ZkCredentialsProvider
[junit4] 2> 2587394 T7843 oascc.ConnectionManager.waitForConnected Waiting for client to connect to ZooKeeper
[junit4] 2> 2587396 T7907 oascc.ConnectionManager.process Watcher org.apache.solr.common.cloud.ConnectionManager@32ce2cc6 name:ZooKeeperConnection Watcher:127.0.0.1:31689 got event WatchedEvent state:SyncConnected type:None path:null path:null type:None
[junit4] 2> 2587397 T7843 oascc.ConnectionManager.waitForConnected Client is connected to ZooKeeper
[junit4] 2> 2587397 T7843 oascc.SolrZkClient.createZkACLProvider Using default ZkACLProvider
[junit4] 2> 2587399 T7843 oascc.ConnectionManager.waitForConnected Waiting for client to connect to ZooKeeper
[junit4] 2> 2587400 T7909 oascc.ConnectionManager.process Watcher org.apache.solr.common.cloud.ConnectionManager@4ca31e12 name:ZooKeeperConnection Watcher:127.0.0.1:31689/solr got event WatchedEvent state:SyncConnected type:None path:null path:null type:None
[junit4] 2> 2587400 T7843 oascc.ConnectionManager.waitForConnected Client is connected to ZooKeeper
[junit4] 2> 2587404 T7843 oascc.ZkStateReader.createClusterStateWatchersAndUpdate Updating cluster state from ZooKeeper...
[junit4] 2> 2588408 T7843 oasc.ZkController.createEphemeralLiveNode Register node as live in ZooKeeper:/live_nodes/127.0.0.1:31710_
[junit4] 2> 2588409 T7843 oascc.SolrZkClient.makePath makePath: /live_nodes/127.0.0.1:31710_
[junit4] 2> 2588412 T7843 oasc.Overseer.close Overseer (id=null) closing
[junit4] 2> 2588417 T7843 oass.SolrDispatchFilter.init user.dir=/usr/home/jenkins/jenkins-slave/workspace/Lucene-Solr-NightlyTests-5.x/solr/build/solr-core/test/J3
[junit4] 2> 2588417 T7843 oass.SolrDispatchFilter.init SolrDispatchFilter.init() done
[junit4] 2> 2589562 T7843 oasc.AbstractFullDistribZkTestBase.createJettys create jetty 3
[junit4] 2> 2589562 T7843 oejs.Server.doStart jetty-8.1.10.v20130312
[junit4] 2> 2589568 T7843 oejus.SslContextFactory.doStart Enabled Protocols [SSLv2Hello, SSLv3, TLSv1, TLSv1.1, TLSv1.2] of [SSLv2Hello, SSLv3, TLSv1, TLSv1.1, TLSv1.2]
[junit4] 2> 2589569 T7843 oejs.AbstractConnector.doStart Started SslSocketConnector@127.0.0.1:?????
[junit4] 2> 2589571 T7843 oass.SolrDispatchFilter.init SolrDispatchFilter.init()
[junit4] 2> 2589572 T7843 oasc.SolrResourceLoader.locateSolrHome JNDI not configured for solr (NoInitialContextEx)
[junit4] 2> 2589572 T7843 oasc.SolrResourceLoader.locateSolrHome using system property solr.solr.home: /usr/home/jenkins/jenkins-slave/workspace/Lucene-Solr-NightlyTests-5.x/solr/build/solr-core/test/J3/temp/solr.cloud.CollectionsAPIDistributedZkTest-6CFAFC4E7B581D4D-001/tempDir-005
[junit4] 2> 2589572 T7843 oasc.SolrResourceLoader.<init> new SolrResourceLoader for directory: '/usr/home/jenkins/jenkins-slave/workspace/Lucene-Solr-NightlyTests-5.x/solr/build/solr-core/test/J3/temp/solr.cloud.CollectionsAPIDistributedZkTest-6CFAFC4E7B581D4D-001/tempDir-005/'
[junit4] 2> 2589601 T7843 oasc.ConfigSolr.fromFile Loading container configuration from /usr/home/jenkins/jenkins-slave/workspace/Lucene-Solr-NightlyTests-5.x/solr/build/solr-core/test/J3/temp/solr.cloud.CollectionsAPIDistributedZkTest-6CFAFC4E7B581D4D-001/tempDir-005/solr.xml
[junit4] 2> 2589653 T7843 oasc.CoreContainer.<init> New CoreContainer 2115939908
[junit4] 2> 2589653 T7843 oasc.CoreContainer.load Loading cores into CoreContainer [instanceDir=/usr/home/jenkins/jenkins-slave/workspace/Lucene-Solr-NightlyTests-5.x/solr/build/solr-core/test/J3/temp/solr.cloud.CollectionsAPIDistributedZkTest-6CFAFC4E7B581D4D-001/tempDir-005/]
[junit4] 2> 2589654 T7843 oashc.HttpShardHandlerFactory.getParameter Setting socketTimeout to: 120000
[junit4] 2> 2589654 T7843 oashc.HttpShardHandlerFactory.getParameter Setting urlScheme to: null
[junit4] 2> 2589654 T7843 oashc.HttpShardHandlerFactory.getParameter Setting connTimeout to: 15000
[junit4] 2> 2589655 T7843 oashc.HttpShardHandlerFactory.getParameter Setting maxConnectionsPerHost to: 20
[junit4] 2> 2589655 T7843 oashc.HttpShardHandlerFactory.getParameter Setting maxConnections to: 10000
[junit4] 2> 2589655 T7843 oashc.HttpShardHandlerFactory.getParameter Setting corePoolSize to: 0
[junit4] 2> 2589655 T7843 oashc.HttpShardHandlerFactory.getParameter Setting maximumPoolSize to: 2147483647
[junit4] 2> 2589655 T7843 oashc.HttpShardHandlerFactory.getParameter Setting maxThreadIdleTime to: 5
[junit4] 2> 2589656 T7843 oashc.HttpShardHandlerFactory.getParameter Setting sizeOfQueue to: -1
[junit4] 2> 2589656 T7843 oashc.HttpShardHandlerFactory.getParameter Setting fairnessPolicy to: false
[junit4] 2> 2589658 T7843 oasu.UpdateShardHandler.<init> Creating UpdateShardHandler HTTP client with params: socketTimeout=3400000&connTimeout=45000&retry=false
[junit4] 2> 2589678 T7843 oasl.LogWatcher.createWatcher SLF4J impl is org.slf4j.impl.Log4jLoggerFactory
[junit4] 2> 2589679 T7843 oasl.LogWatcher.newRegisteredLogWatcher Registering Log Listener [Log4j (org.slf4j.impl.Log4jLoggerFactory)]
[junit4] 2> 2589679 T7843 oasc.CoreContainer.load Host Name: 127.0.0.1
[junit4] 2> 2589680 T7843 oasc.ZkContainer.initZooKeeper Zookeeper client=127.0.0.1:31689/solr
[junit4] 2> 2589680 T7843 oasc.ZkController.checkChrootPath zkHost includes chroot
[junit4] 2> 2589680 T7843 oascc.SolrZkClient.createZkCredentialsToAddAutomatically Using default ZkCredentialsProvider
[junit4] 2> 2589681 T7843 oascc.ConnectionManager.waitForConnected Waiting for client to connect to ZooKeeper
[junit4] 2> 2589683 T7922 oascc.ConnectionManager.process Watcher org.apache.solr.common.cloud.ConnectionManager@732595c5 name:ZooKeeperConnection Watcher:127.0.0.1:31689 got event WatchedEvent state:SyncConnected type:None path:null path:null type:None
[junit4] 2> 2589684 T7843 oascc.ConnectionManager.waitForConnected Client is connected to ZooKeeper
[junit4] 2> 2589684 T7843 oascc.SolrZkClient.createZkACLProvider Using default ZkACLProvider
[junit4] 2> 2589686 T7843 oascc.ConnectionManager.waitForConnected Waiting for client to connect to ZooKeeper
[junit4] 2> 2589687 T7924 oascc.ConnectionManager.process Watcher org.apache.solr.common.cloud.ConnectionManager@2f8c620e name:ZooKeeperConnection Watcher:127.0.0.1:31689/solr got event WatchedEvent state:SyncConnected type:None path:null path:null type:None
[junit4] 2> 2589687 T7843 oascc.ConnectionManager.waitForConnected Client is connected to ZooKeeper
[junit4] 2> 2589691 T7843 oascc.ZkStateReader.createClusterStateWatchersAndUpdate Updating cluster state from ZooKeeper...
[junit4] 2> 2590695 T7843 oasc.ZkController.createEphemeralLiveNode Register node as live in ZooKeeper:/live_nodes/127.0.0.1:31716_
[junit4] 2> 2590696 T7843 oascc.SolrZkClient.makePath makePath: /live_nodes/127.0.0.1:31716_
[junit4] 2> 2590699 T7843 oasc.Overseer.close Overseer (id=null) closing
[junit4] 2> 2590704 T7843 oass.SolrDispatchFilter.init user.dir=/usr/home/jenkins/jenkins-slave/workspace/Lucene-Solr-NightlyTests-5.x/solr/build/solr-core/test/J3
[junit4] 2> 2590704 T7843 oass.SolrDispatchFilter.init SolrDispatchFilter.init() done
[junit4] 2> 2591863 T7843 oasc.AbstractFullDistribZkTestBase.createJettys create jetty 4
[junit4] 2> 2591864 T7843 oejs.Server.doStart jetty-8.1.10.v20130312
[junit4] 2> 2591867 T7843 oejus.SslContextFactory.doStart Enabled Protocols [SSLv2Hello, SSLv3, TLSv1, TLSv1.1, TLSv1.2] of [SSLv2Hello, SSLv3, TLSv1, TLSv1.1, TLSv1.2]
[junit4] 2> 2591869 T7843 oejs.AbstractConnector.doStart Started SslSocketConnector@127.0.0.1:?????
[junit4] 2> 2591871 T7843 oass.SolrDispatchFilter.init SolrDispatchFilter.init()
[junit4] 2> 2591871 T7843 oasc.SolrResourceLoader.locateSolrHome JNDI not configured for solr (NoInitialContextEx)
[junit4] 2> 2591872 T7843 oasc.SolrResourceLoader.locateSolrHome using system property solr.solr.home: /usr/home/jenkins/jenkins-slave/workspace/Lucene-Solr-NightlyTests-5.x/solr/build/solr-core/test/J3/temp/solr.cloud.CollectionsAPIDistributedZkTest-6CFAFC4E7B581D4D-001/tempDir-006
[junit4] 2> 2591872 T7843 oasc.SolrResourceLoader.<init> new SolrResourceLoader for directory: '/usr/home/jenkins/jenkins-slave/workspace/Lucene-Solr-NightlyTests-5.x/solr/build/solr-core/test/J3/temp/solr.cloud.CollectionsAPIDistributedZkTest-6CFAFC4E7B581D4D-001/tempDir-006/'
[junit4] 2> 2591901 T7843 oasc.ConfigSolr.fromFile Loading container configuration from /usr/home/jenkins/jenkins-slave/workspace/Lucene-Solr-NightlyTests-5.x/solr/build/solr-core/test/J3/temp/solr.cloud.CollectionsAPIDistributedZkTest-6CFAFC4E7B581D4D-001/tempDir-006/solr.xml
[junit4] 2> 2591953 T7843 oasc.CoreContainer.<init> New CoreContainer 1058545640
[junit4] 2> 2591953 T7843 oasc.CoreContainer.load Loading cores into CoreContainer [instanceDir=/usr/home/jenkins/jenkins-slave/workspace/Lucene-Solr-NightlyTests-5.x/solr/build/solr-core/test/J3/temp/solr.cloud.CollectionsAPIDistributedZkTest-6CFAFC4E7B581D4D-001/tempDir-006/]
[junit4] 2> 2591954 T7843 oashc.HttpShardHandlerFactory.getParameter Setting socketTimeout to: 120000
[junit4] 2> 2591954 T7843 oashc.HttpShardHandlerFactory.getParameter Setting urlScheme to: null
[junit4] 2> 2591954 T7843 oashc.HttpShardHandlerFactory.getParameter Setting connTimeout to: 15000
[junit4] 2> 2591955 T7843 oashc.HttpShardHandlerFactory.getParameter Setting maxConnectionsPerHost to: 20
[junit4] 2> 2591955 T7843 oashc.HttpShardHandlerFactory.getParameter Setting maxConnections to: 10000
[junit4] 2> 2591955 T7843 oashc.HttpShardHandlerFactory.getParameter Setting corePoolSize to: 0
[junit4] 2> 2591955 T7843 oashc.HttpShardHandlerFactory.getParameter Setting maximumPoolSize to: 2147483647
[junit4] 2> 2591956 T7843 oashc.HttpShardHandlerFactory.getParameter Setting maxThreadIdleTime to: 5
[junit4] 2> 2591956 T7843 oashc.HttpShardHandlerFactory.getParameter Setting sizeOfQueue to: -1
[junit4] 2> 2591956 T7843 oashc.HttpShardHandlerFactory.getParameter Setting fairnessPolicy to: false
[junit4] 2> 2591958 T7843 oasu.UpdateShardHandler.<init> Creating UpdateShardHandler HTTP client with params: socketTimeout=3400000&connTimeout=45000&retry=false
[junit4] 2> 2591959 T7843 oasl.LogWatcher.createWatcher SLF4J impl is org.slf4j.impl.Log4jLoggerFactory
[junit4] 2> 2591960 T7843 oasl.LogWatcher.newRegisteredLogWatcher Registering Log Listener [Log4j (org.slf4j.impl.Log4jLoggerFactory)]
[junit4] 2> 2591960 T7843 oasc.CoreContainer.load Host Name: 127.0.0.1
[junit4] 2> 2591960 T7843 oasc.ZkContainer.initZooKeeper Zookeeper client=127.0.0.1:31689/solr
[junit4] 2> 2591960 T7843 oasc.ZkController.checkChrootPath zkHost includes chroot
[junit4] 2> 2591961 T7843 oascc.SolrZkClient.createZkCredentialsToAddAutomatically Using default ZkCredentialsProvider
[junit4] 2> 2591961 T7843 oascc.ConnectionManager.waitForConnected Waiting for client to connect to ZooKeeper
[junit4] 2> 2591963 T7937 oascc.ConnectionManager.process Watcher org.apache.solr.common.cloud.ConnectionManager@26145e74 name:ZooKeeperConnection Watcher:127.0.0.1:31689 got event WatchedEvent state:SyncConnected type:None path:null path:null type:None
[junit4] 2> 2591964 T7843 oascc.ConnectionManager.waitForConnected Client is connected to ZooKeeper
[junit4] 2> 2591964 T7843 oascc.SolrZkClient.createZkACLProvider Using default ZkACLProvider
[junit4] 2> 2591965 T7843 oascc.ConnectionManager.waitForConnected Waiting for client to connect to ZooKeeper
[junit4] 2> 2591966 T7939 oascc.ConnectionManager.process Watcher org.apache.solr.common.cloud.ConnectionManager@6ea60c8c name:ZooKeeperConnection Watcher:127.0.0.1:31689/solr got event WatchedEvent state:SyncConnected type:None path:null path:null type:None
[junit4] 2> 2591966 T7843 oascc.ConnectionManager.waitForConnected Client is connected to ZooKeeper
[junit4] 2> 2591970 T7843 oascc.ZkStateReader.createClusterStateWatchersAndUpdate Updating cluster state from ZooKeeper...
[junit4] 2> 2592974 T7843 oasc.ZkController.createEphemeralLiveNode Register node as live in ZooKeeper:/live_nodes/127.0.0.1:31724_
[junit4] 2> 2592975 T7843 oascc.SolrZkClient.makePath makePath: /live_nodes/127.0.0.1:31724_
[junit4] 2> 2592978 T7843 oasc.Overseer.close Overseer (id=null) closing
[junit4] 2> 2592983 T7843 oass.SolrDispatchFilter.init user.dir=/usr/home/jenkins/jenkins-slave/workspace/Lucene-Solr-NightlyTests-5.x/solr/build/solr-core/test/J3
[junit4] 2> 2592983 T7843 oass.SolrDispatchFilter.init SolrDispatchFilter.init() done
[junit4] 2> 2593128 T7885 oasha.CollectionsHandler.handleCreateAction Creating Collection : numShards=2&name=solrj_collection&wt=javabin&router.field=myOwnField&collection.configName=conf1&action=CREATE&version=2&replicationFactor=2
[junit4] 2> 2593129 T7880 oasc.DistributedQueue$LatchWatcher.process NodeChildrenChanged fired on path /overseer/collection-queue-work state SyncConnected
[junit4] 2> 2593130 T7873 oasc.OverseerCollectionProcessor.run Overseer Collection Processor: Get the message id:/overseer/collection-queue-work/qn-0000000000 message:{
[junit4] 2> "operation":"create",
[junit4] 2> "fromApi":"true",
[junit4] 2> "name":"solrj_collection",
[junit4] 2> "replicationFactor":"2",
[junit4] 2> "collection.configName":"conf1",
[junit4] 2> "numShards":"2",
[junit4] 2> "router.field":"myOwnField"}
[junit4] 2> 2593131 T7943 oasc.OverseerCollectionProcessor.processMessage WARN OverseerCollectionProcessor.processMessage : create , {
[junit4] 2> "operation":"create",
[junit4] 2> "fromApi":"true",
[junit4] 2> "name":"solrj_collection",
[junit4] 2> "replicationFactor":"2",
[junit4] 2> "collection.configName":"conf1",
[junit4] 2> "numShards":"2",
[junit4] 2> "router.field":"myOwnField"}
[junit4] 2> 2593132 T7943 oasc.OverseerCollectionProcessor.createConfNode creating collections conf node /collections/solrj_collection
[junit4] 2> 2593133 T7943 oascc.SolrZkClient.makePath makePath: /collections/solrj_collection
[junit4] 2> 2593135 T7880 oasc.DistributedQueue$LatchWatcher.process NodeChildrenChanged fired on path /overseer/queue state SyncConnected
[junit4] 2> 2593137 T7872 oasc.Overseer$ClusterStateUpdater.buildCollection building a new collection: solrj_collection
[junit4] 2> 2593137 T7872 oasc.Overseer$ClusterStateUpdater.createCollection Create collection solrj_collection with shards [shard1, shard2]
[junit4] 2> 2593138 T7872 oasc.Overseer$ClusterStateUpdater.createCollection state version solrj_collection 1
[junit4] 2> 2593140 T7880 oascc.ZkStateReader$2.process A cluster state change: WatchedEvent state:SyncConnected type:NodeDataChanged path:/clusterstate.json, has occurred - updating... (live nodes size: 5)
[junit4] 2> 2593140 T7910 oascc.ZkStateReader$2.process A cluster state change: WatchedEvent state:SyncConnected type:NodeDataChanged path:/clusterstate.json, has occurred - updating... (live nodes size: 5)
[junit4] 2> 2593140 T7895 oascc.ZkStateReader$2.process A cluster state change: WatchedEvent state:SyncConnected type:NodeDataChanged path:/clusterstate.json, has occurred - updating... (live nodes size: 5)
[junit4] 2> 2593140 T7925 oascc.ZkStateReader$2.process A cluster state change: WatchedEvent state:SyncConnected type:NodeDataChanged path:/clusterstate.json, has occurred - updating... (live nodes size: 5)
[junit4] 2> 2593140 T7940 oascc.ZkStateReader$2.process A cluster state change: WatchedEvent state:SyncConnected type:NodeDataChanged path:/clusterstate.json, has occurred - updating... (live nodes size: 5)
[junit4] 2> 2593140 T7881 oascc.ZkStateReader$2.process A cluster state change: WatchedEvent state:SyncConnected type:NodeDataChanged path:/clusterstate.json, has occurred - updating... (live nodes size: 5)
[junit4] 2> 2593235 T7943 oasc.OverseerCollectionProcessor.createCollection Creating SolrCores for new collection solrj_collection, shardNames [shard1, shard2] , replicationFactor : 2
[junit4] 2> 2593236 T7943 oasc.OverseerCollectionProcessor.createCollection Creating shard solrj_collection_shard1_replica1 as part of slice shard1 of collection solrj_collection on 127.0.0.1:31695_
[junit4] 2> 2593237 T7943 oasc.OverseerCollectionProcessor.createCollection Creating shard solrj_collection_shard1_replica2 as part of slice shard1 of collection solrj_collection on 127.0.0.1:31710_
[junit4] 2> 2593238 T7943 oasc.OverseerCollectionProcessor.createCollection Creating shard solrj_collection_shard2_replica1 as part of slice shard2 of collection solrj_collection on 127.0.0.1:31724_
[junit4] 2> 2593239 T7943 oasc.OverseerCollectionProcessor.createCollection Creating shard solrj_collection_shard2_replica2 as part of slice shard2 of collection solrj_collection on 127.0.0.1:31704_
[junit4] 2> 2593366 T7864 oasha.CoreAdminHandler.handleCreateAction core create command numShards=2&shard=shard1&name=solrj_collection_shard1_replica1&collection=solrj_collection&wt=javabin&collection.configName=conf1&action=CREATE&version=2&qt=/admin/cores
[junit4] 2> 2593366 T7899 oasha.CoreAdminHandler.handleCreateAction core create command numShards=2&shard=shard1&name=solrj_collection_shard1_replica2&collection=solrj_collection&wt=javabin&collection.configName=conf1&action=CREATE&version=2&qt=/admin/cores
[junit4] 2> 2593366 T7929 oasha.CoreAdminHandler.handleCreateAction core create command numShards=2&shard=shard2&name=solrj_collection_shard2_replica1&collection=solrj_collection&wt=javabin&collection.configName=conf1&action=CREATE&version=2&qt=/admin/cores
[junit4] 2> 2593367 T7884 oasha.CoreAdminHandler.handleCreateAction core create command numShards=2&shard=shard2&name=solrj_collection_shard2_replica2&collection=solrj_collection&wt=javabin&collection.configName=conf1&action=CREATE&version=2&qt=/admin/cores
[junit4] 2> 2593369 T7899 oasc.ZkController.publish publishing core=solrj_collection_shard1_replica2 state=down collection=solrj_collection
[junit4] 2> 2593369 T7864 oasc.ZkController.publish publishing core=solrj_collection_shard1_replica1 state=down collection=solrj_collection
[junit4] 2> 2593370 T7929 oasc.ZkController.publish publishing core=solrj_collection_shard2_replica1 state=down collection=solrj_collection
[junit4] 2> 2593370 T7899 oasc.ZkController.waitForCoreNodeName look for our core node name
[junit4] 2> 2593370 T7864 oasc.ZkController.waitForCoreNodeName look for our core node name
[junit4] 2> 2593370 T7880 oasc.DistributedQueue$LatchWatcher.process NodeChildrenChanged fired on path /overseer/queue state SyncConnected
[junit4] 2> 2593371 T7884 oasc.ZkController.publish publishing core=solrj_collection_shard2_replica2 state=down collection=solrj_collection
[junit4] 2> 2593371 T7929 oasc.ZkController.waitForCoreNodeName look for our core node name
[junit4] 2> 2593372 T7884 oasc.ZkController.waitForCoreNodeName look for our core node name
[junit4] 2> 2593373 T7872 oasc.Overseer$ClusterStateUpdater.updateState Update state numShards=2 message={
[junit4] 2> "numShards":"2",
[junit4] 2> "shard":"shard1",
[junit4] 2> "collection":"solrj_collection",
[junit4] 2> "roles":null,
[junit4] 2> "operation":"state",
[junit4] 2> "core":"solrj_collection_shard1_replica2",
[junit4] 2> "state":"down",
[junit4] 2> "node_name":"127.0.0.1:31710_",
[junit4] 2> "base_url":"https://127.0.0.1:31710"}
[junit4] 2> 2593375 T7872 oasc.Overseer$ClusterStateUpdater.updateState Update state numShards=2 message={
[junit4] 2> "numShards":"2",
[junit4] 2> "shard":"shard1",
[junit4] 2> "collection":"solrj_collection",
[junit4] 2> "roles":null,
[junit4] 2> "operation":"state",
[junit4] 2> "core":"solrj_collection_shard1_replica1",
[junit4] 2> "state":"down",
[junit4] 2> "node_name":"127.0.0.1:31695_",
[junit4] 2> "base_url":"https://127.0.0.1:31695"}
[junit4] 2> 2593377 T7880 oasc.DistributedQueue$LatchWatcher.process NodeChildrenChanged fired on path /overseer/queue state SyncConnected
[junit4] 2> 2593377 T7872 oasc.Overseer$ClusterStateUpdater.updateState Update state numShards=2 message={
[junit4] 2> "numShards":"2",
[junit4] 2> "shard":"shard2",
[junit4] 2> "collection":"solrj_collection",
[junit4] 2> "roles":null,
[junit4] 2> "operation":"state",
[junit4] 2> "core":"solrj_collection_shard2_replica1",
[junit4] 2> "state":"down",
[junit4] 2> "node_name":"127.0.0.1:31724_",
[junit4] 2> "base_url":"https://127.0.0.1:31724"}
[junit4] 2> 2593379 T7872 oasc.Overseer$ClusterStateUpdater.updateState Update state numShards=2 message={
[junit4] 2> "numShards":"2",
[junit4] 2> "shard":"shard2",
[junit4] 2> "collection":"solrj_collection",
[junit4] 2> "roles":null,
[junit4] 2> "operation":"state",
[junit4] 2> "core":"solrj_collection_shard2_replica2",
[junit4] 2> "state":"down",
[junit4] 2> "node_name":"127.0.0.1:31704_",
[junit4] 2> "base_url":"https://127.0.0.1:31704"}
[junit4] 2> 2593380 T7880 oasc.DistributedQueue$LatchWatcher.process NodeChildrenChanged fired on path /overseer/queue state SyncConnected
[junit4] 2> 2593381 T7940 oascc.ZkStateReader$2.process A cluster state change: WatchedEvent state:SyncConnected type:NodeDataChanged path:/clusterstate.json, has occurred - updating... (live nodes size: 5)
[junit4] 2> 2593381 T7881 oascc.ZkStateReader$2.process A cluster state change: WatchedEvent state:SyncConnected type:NodeDataChanged path:/clusterstate.json, has occurred - updating... (live nodes size: 5)
[junit4] 2> 2593381 T7895 oascc.ZkStateReader$2.process A cluster state change: WatchedEvent state:SyncConnected type:NodeDataChanged path:/clusterstate.json, has occurred - updating... (live nodes size: 5)
[junit4] 2> 2593381 T7925 oascc.ZkStateReader$2.process A cluster state change: WatchedEvent state:SyncConnected type:NodeDataChanged path:/clusterstate.json, has occurred - updating... (live nodes size: 5)
[junit4] 2> 2593381 T7910 oascc.ZkStateReader$2.process A cluster state change: WatchedEvent state:SyncConnected type:NodeDataChanged path:/clusterstate.json, has occurred - updating... (live nodes size: 5)
[junit4] 2> 2593381 T7880 oascc.ZkStateReader$2.process A cluster state change: WatchedEvent state:SyncConnected type:NodeDataChanged path:/clusterstate.json, has occurred - updating... (live nodes size: 5)
[junit4] 2> 2594371 T7899 oasc.ZkController.waitForShardId waiting to find shard id in clusterstate for solrj_collection_shard1_replica2
[junit4] 2> 2594371 T7864 oasc.ZkController.waitForShardId waiting to find shard id in clusterstate for solrj_collection_shard1_replica1
[junit4] 2> 2594372 T7899 oasc.ZkController.createCollectionZkNode Check for collection zkNode:solrj_collection
[junit4] 2> 2594372 T7884 oasc.ZkController.waitForShardId waiting to find shard id in clusterstate for solrj_collection_shard2_replica2
[junit4] 2> 2594373 T7899 oasc.ZkController.createCollectionZkNode Collection zkNode exists
[junit4] 2> 2594372 T7929 oasc.ZkController.waitForShardId waiting to find shard id in clusterstate for solrj_collection_shard2_replica1
[junit4] 2> 2594372 T7864 oasc.ZkController.createCollectionZkNode Check for collection zkNode:solrj_collection
[junit4] 2> 2594374 T7929 oasc.ZkController.createCollectionZkNode Check for collection zkNode:solrj_collection
[junit4] 2> 2594373 T7899 oascc.ZkStateReader.readConfigName Load collection config from:/collections/solrj_collection
[junit4] 2> 2594374 T7929 oasc.ZkController.createCollectionZkNode Collection zkNode exists
[junit4] 2> 2594373 T7884 oasc.ZkController.createCollectionZkNode Check for collection zkNode:solrj_collection
[junit4] 2> 2594375 T7899 oascc.ZkStateReader.readConfigName path=/collections/solrj_collection configName=conf1 specified config exists in ZooKeeper
[junit4] 2> 2594375 T7884 oasc.ZkController.createCollectionZkNode Collection zkNode exists
[junit4] 2> 2594375 T7929 oascc.ZkStateReader.readConfigName Load collection config from:/collections/solrj_collection
[junit4] 2> 2594374 T7864 oasc.ZkController.createCollectionZkNode Collection zkNode exists
[junit4] 2> 2594376 T7884 oascc.ZkStateReader.readConfigName Load collection config from:/collections/solrj_collection
[junit4] 2> 2594375 T7899 oasc.SolrResourceLoader.<init> new SolrResourceLoader for directory: '/usr/home/jenkins/jenkins-slave/workspace/Lucene-Solr-NightlyTests-5.x/solr/build/solr-core/test/J3/temp/solr.cloud.CollectionsAPIDistributedZkTest-6CFAFC4E7B581D4D-001/tempDir-004/solrj_collection_shard1_replica2/'
[junit4] 2> 2594377 T7929 oascc.ZkStateReader.readConfigName path=/collections/solrj_collection configName=conf1 specified config exists in ZooKeeper
[junit4] 2> 2594376 T7864 oascc.ZkStateReader.readConfigName Load collection config from:/collections/solrj_collection
[junit4] 2> 2594377 T7929 oasc.SolrResourceLoader.<init> new SolrResourceLoader for directory: '/usr/home/jenkins/jenkins-slave/workspace/Lucene-Solr-NightlyTests-5.x/solr/build/solr-core/test/J3/temp/solr.cloud.CollectionsAPIDistributedZkTest-6CFAFC4E7B581D4D-001/tempDir-006/solrj_collection_shard2_replica1/'
[junit4] 2> 2594377 T7884 oascc.ZkStateReader.readConfigName path=/collections/solrj_collection configName=conf1 specified config exists in ZooKeeper
[junit4] 2> 2594378 T7864 oascc.ZkStateReader.readConfigName path=/collections/solrj_collection configName=conf1 specified config exists in ZooKeeper
[junit4] 2> 2594378 T7884 oasc.SolrResourceLoader.<init> new SolrResourceLoader for directory: '../../../../../../../../../../../usr/home/jenkins/jenkins-slave/workspace/Lucene-Solr-NightlyTests-5.x/solr/build/solr-core/test/J3/temp/solr.cloud.CollectionsAPIDistributedZkTest-6CFAFC4E7B581D4D-001/tempDir-003/solrj_collection_shard2_replica2/'
[junit4] 2> 2594379 T7864 oasc.SolrResourceLoader.<init> new SolrResourceLoader for directory: '../../../../../../../../../../../usr/home/jenkins/jenkins-slave/workspace/Lucene-Solr-NightlyTests-5.x/solr/build/solr-core/test/J3/temp/solr.cloud.CollectionsAPIDistributedZkTest-6CFAFC4E7B581D4D-001/tempDir-002/solrj_collection_shard1_replica1/'
[junit4] 2> 2594454 T7899 oasc.SolrConfig.<init> Using Lucene MatchVersion: 5.0.0
[junit4] 2> 2594458 T7929 oasc.SolrConfig.<init> Using Lucene MatchVersion: 5.0.0
[junit4] 2> 2594463 T7884 oasc.SolrConfig.<init> Using Lucene MatchVersion: 5.0.0
[junit4] 2> 2594468 T7864 oasc.SolrConfig.<init> Using Lucene MatchVersion: 5.0.0
[junit4] 2> 2594514 T7899 oasc.SolrConfig.<init> Loaded SolrConfig: solrconfig.xml
[junit4] 2> 2594514 T7929 oasc.SolrConfig.<init> Loaded SolrConfig: solrconfig.xml
[junit4] 2> 2594519 T7884 oasc.SolrConfig.<init> Loaded SolrConfig: solrconfig.xml
[junit4] 2> 2594524 T7864 oasc.SolrConfig.<init> Loaded SolrConfig: solrconfig.xml
[junit4] 2> 2594525 T7864 oass.IndexSchema.readSchema Reading Solr Schema from /configs/conf1/schema.xml
[junit4] 2> 2594538 T7864 oass.IndexSchema.readSchema [solrj_collection_shard1_replica1] Schema name=test
[junit4] 2> 2594616 T7929 oass.IndexSchema.readSchema Reading Solr Schema from /configs/conf1/schema.xml
[junit4] 2> 2594616 T7899 oass.IndexSchema.readSchema Reading Solr Schema from /configs/conf1/schema.xml
[junit4] 2> 2594620 T7884 oass.IndexSchema.readSchema Reading Solr Schema from /configs/conf1/schema.xml
[junit4] 2> 2594632 T7929 oass.IndexSchema.readSchema [solrj_collection_shard2_replica1] Schema name=test
[junit4] 2> 2594632 T7899 oass.IndexSchema.readSchema [solrj_collection_shard1_replica2] Schema name=test
[junit4] 2> 2594634 T7884 oass.IndexSchema.readSchema [solrj_collection_shard2_replica2] Schema name=test
[junit4] 2> 2594968 T7864 oass.OpenExchangeRatesOrgProvider.init Initialized with rates=open-exchange-rates.json, refreshInterval=1440.
[junit4] 2> 2594980 T7864 oass.IndexSchema.readSchema default search field in schema is text
[junit4] 2> 2594983 T7864 oass.IndexSchema.readSchema unique key field: id
[junit4] 2> 2594993 T7864 oass.FileExchangeRateProvider.reload Reloading exchange rates from file currency.xml
[junit4] 2> 2594998 T7864 oass.FileExchangeRateProvider.reload Reloading exchange rates from file currency.xml
[junit4] 2> 2595003 T7864 oass.OpenExchangeRatesOrgProvider.reload Reloading exchange rates from open-exchange-rates.json
[junit4] 2> 2595004 T7864 oass.OpenExchangeRatesOrgProvider$OpenExchangeRates.<init> WARN Unknown key IMPORTANT NOTE
[junit4] 2> 2595006 T7864 oass.OpenExchangeRatesOrgProvider$OpenExchangeRates.<init> WARN Expected key, got STRING
[junit4] 2> 2595007 T7864 oass.OpenExchangeRatesOrgProvider.reload Reloading exchange rates from open-exchange-rates.json
[junit4] 2> 2595007 T7864 oass.OpenExchangeRatesOrgProvider$OpenExchangeRates.<init> WARN Unknown key IMPORTANT NOTE
[junit4] 2> 2595008 T7864 oass.OpenExchangeRatesOrgProvider$OpenExchangeRates.<init> WARN Expected key, got STRING
[junit4] 2> 2595008 T7864 oasc.CoreContainer.create Creating SolrCore 'solrj_collection_shard1_replica1' using configuration from collection solrj_collection
[junit4] 2> 2595008 T7864 oasc.SolrCore.initDirectoryFactory org.apache.solr.core.MockDirectoryFactory
[junit4] 2> 2595009 T7864 oasc.SolrCore.<init> [solrj_collection_shard1_replica1] Opening new SolrCore at ../../../../../../../../../../../usr/home/jenkins/jenkins-slave/workspace/Lucene-Solr-NightlyTests-5.x/solr/build/solr-core/test/J3/temp/solr.cloud.CollectionsAPIDistributedZkTest-6CFAFC4E7B581D4D-001/tempDir-002/solrj_collection_shard1_replica1/, dataDir=/usr/home/jenkins/jenkins-slave/workspace/Lucene-Solr-NightlyTests-5.x/solr/build/solr-core/test/J3/../../../../../../../../../../../usr/home/jenkins/jenkins-slave/workspace/Lucene-Solr-NightlyTests-5.x/solr/build/solr-core/test/J3/temp/solr.cloud.CollectionsAPIDistributedZkTest-6CFAFC4E7B581D4D-001/tempDir-002/solrj_collection_shard1_replica1/data/
[junit4] 2> 2595009 T7864 oasc.JmxMonitoredMap.<init> JMX monitoring is enabled. Adding Solr mbeans to JMX Server: com.sun.jmx.mbeanserver.JmxMBeanServer@3d5693f
[junit4] 2> 2595010 T7864 oasc.CachingDirectoryFactory.get return new directory for /usr/home/jenkins/jenkins-slave/workspace/Lucene-Solr-NightlyTests-5.x/solr/build/solr-core/test/J3/../../../../../../../../../../../usr/home/jenkins/jenkins-slave/workspace/Lucene-Solr-NightlyTests-5.x/solr/build/solr-core/test/J3/temp/solr.cloud.CollectionsAPIDistributedZkTest-6CFAFC4E7B581D4D-001/tempDir-002/solrj_collection_shard1_replica1/data
[junit4] 2> 2595011 T7864 oasc.SolrCore.getNewIndexDir New index directory detected: old=null new=/usr/home/jenkins/jenkins-slave/workspace/Lucene-Solr-NightlyTests-5.x/solr/build/solr-core/test/J3/../../../../../../../../../../../usr/home/jenkins/jenkins-slave/workspace/Lucene-Solr-NightlyTests-5.x/solr/build/solr-core/test/J3/temp/solr.cloud.CollectionsAPIDistributedZkTest-6CFAFC4E7B581D4D-001/tempDir-002/solrj_collection_shard1_replica1/data/index/
[junit4] 2> 2595011 T7864 oasc.SolrCore.initIndex WARN [solrj_collection_shard1_replica1] Solr index directory '/usr/home/jenkins/jenkins-slave/workspace/Lucene-Solr-NightlyTests-5.x/solr/build/solr-core/test/J3/../../../../../../../../../../../usr/home/jenkins/jenkins-slave/workspace/Lucene-Solr-NightlyTests-5.x/solr/build/solr-core/test/J3/temp/solr.cloud.CollectionsAPIDistributedZkTest-6CFAFC4E7B581D4D-001/tempDir-002/solrj_collection_shard1_replica1/data/index' doesn't exist. Creating new index...
[junit4] 2> 2595012 T7864 oasc.CachingDirectoryFactory.get return new directory for /usr/home/jenkins/jenkins-slave/workspace/Lucene-Solr-NightlyTests-5.x/solr/build/solr-core/test/J3/../../../../../../../../../../../usr/home/jenkins/jenkins-slave/workspace/Lucene-Solr-NightlyTests-5.x/solr/build/solr-core/test/J3/temp/solr.cloud.CollectionsAPIDistributedZkTest-6CFAFC4E7B581D4D-001/tempDir-002/solrj_collection_shard1_replica1/data/index
[junit4] 2> 2595012 T7864 oasu.RandomMergePolicy.<init> RandomMergePolicy wrapping class org.apache.lucene.index.LogDocMergePolicy: [LogDocMergePolicy: minMergeSize=1000, mergeFactor=46, maxMergeSize=9223372036854775807, maxMergeSizeForForcedMerge=9223372036854775807, calibrateSizeByDeletes=false, maxMergeDocs=2147483647, maxCFSSegmentSizeMB=8.796093022207999E12, noCFSRatio=1.0]
[junit4] 2> 2595013 T7864 oasc.SolrDeletionPolicy.onCommit SolrDeletionPolicy.onCommit: commits: num=1
[junit4] 2> commit{dir=MockDirectoryWrapper(RateLimitedDirectoryWrapper(RAMDirectory(id=lucene-2c413925))),segFN=segments_1,generation=1}
[junit4] 2> 2595014 T7864 oasc.SolrDeletionPolicy.updateCommits newest commit generation = 1
[junit4] 2> 2595027 T7864 oasup.UpdateRequestProcessorChain.init creating updateRequestProcessorChain "nodistrib"
[junit4] 2> 2595027 T7864 oasup.UpdateRequestProcessorChain.init creating updateRequestProcessorChain "dedupe"
[junit4] 2> 2595028 T7864 oasup.UpdateRequestProcessorChain.init inserting DistributedUpdateProcessorFactory into updateRequestProcessorChain "dedupe"
[junit4] 2> 2595028 T7864 oasup.UpdateRequestProcessorChain.init creating updateRequestProcessorChain "stored_sig"
[junit4] 2> 2595028 T7864 oasup.UpdateRequestProcessorChain.init inserting DistributedUpdateProcessorFactory into updateRequestProcessorChain "stored_sig"
[junit4] 2> 2595029 T7864 oasup.UpdateRequestProcessorChain.init creating updateRequestProcessorChain "distrib-dup-test-chain-explicit"
[junit4] 2> 2595029 T7864 oasup.UpdateRequestProcessorChain.init creating updateRequestProcessorChain "distrib-dup-test-chain-implicit"
[junit4] 2> 2595030 T7864 oasup.UpdateRequestProcessorChain.init inserting DistributedUpdateProcessorFactory into updateRequestProcessorChain "distrib-dup-test-chain-implicit"
[junit4] 2> 2595030 T7864 oasc.SolrCore.loadUpdateProcessorChains no updateRequestProcessorChain defined as default, creating implicit default
[junit4] 2> 2595031 T7864 oasc.RequestHandlers.initHandlersFromConfig created /update/json: org.apache.solr.handler.UpdateRequestHandler
[junit4] 2> 2595032 T7864 oasc.RequestHandlers.initHandlersFromConfig created /update/json/docs: org.apache.solr.handler.UpdateRequestHandler
[junit4] 2> 2595032 T7864 oasc.RequestHandlers.initHandlersFromConfig created /update/csv: org.apache.solr.handler.UpdateRequestHandler
[junit4] 2> 2595033 T7864 oasc.RequestHandlers.initHandlersFromConfig created standard: solr.StandardRequestHandler
[junit4] 2> 2595034 T7864 oasc.RequestHandlers.initHandlersFromConfig created /get: solr.RealTimeGetHandler
[junit4] 2> 2595034 T7864 oasc.RequestHandlers.initHandlersFromConfig adding lazy requestHandler: solr.ReplicationHandler
[junit4] 2> 2595035 T7864 oasc.RequestHandlers.initHandlersFromConfig created /replication: solr.ReplicationHandler
[junit4] 2> 2595035 T7864 oasc.RequestHandlers.initHandlersFromConfig created /update: solr.UpdateRequestHandler
[junit4] 2> 2595036 T7864 oasc.RequestHandlers.initHandlersFromConfig created /admin/: org.apache.solr.handler.admin.AdminHandlers
[junit4] 2> 2595036 T7864 oasc.RequestHandlers.initHandlersFromConfig created /admin/file: solr.admin.ShowFileRequestHandler
[junit4] 2> 2595037 T7864 oasc.RequestHandlers.initHandlersFromConfig created /admin/fileedit: solr.admin.EditFileRequestHandler
[junit4] 2> 2595060 T7864 oashl.XMLLoader.init xsltCacheLifetimeSeconds=60
[junit4] 2> 2595063 T7864 oashl.XMLLoader.init xsltCacheLifetimeSeconds=60
[junit4] 2> 2595065 T7864 oashl.XMLLoader.init xsltCacheLifetimeSeconds=60
[junit4] 2> 2595068 T7864 oashl.XMLLoader.init xsltCacheLifetimeSeconds=60
[junit4] 2> 2595069 T7899 oass.OpenExchangeRatesOrgProvider.init Initialized with rates=open-exchange-rates.json, refreshInterval=1440.
[junit4] 2> 2595071 T7884 oass.OpenExchangeRatesOrgProvider.init Initialized with rates=open-exchange-rates.json, refreshInterval=1440.
[junit4] 2> 2595071 T7929 oass.OpenExchangeRatesOrgProvider.init Initialized with rates=open-exchange-rates.json, refreshInterval=1440.
[junit4] 2> 2595075 T7864 oasu.CommitTracker.<init> Hard AutoCommit: disabled
[junit4] 2> 2595076 T7864 oasu.CommitTracker.<init> Soft AutoCommit: disabled
[junit4] 2> 2595076 T7899 oass.IndexSchema.readSchema default search field in schema is text
[junit4] 2> 2595076 T7864 oasu.RandomMergePolicy.<init> RandomMergePolicy wrapping class org.apache.lucene.index.LogDocMergePolicy: [LogDocMergePolicy: minMergeSize=1000, mergeFactor=38, maxMergeSize=9223372036854775807, maxMergeSizeForForcedMerge=9223372036854775807, calibrateSizeByDeletes=false, maxMergeDocs=2147483647, maxCFSSegmentSizeMB=8.796093022207999E12, noCFSRatio=1.0]
[junit4] 2> 2595077 T7864 oasc.SolrDeletionPolicy.onInit SolrDeletionPolicy.onInit: commits: num=1
[junit4] 2> commit{dir=MockDirectoryWrapper(RateLimitedDirectoryWrapper(RAMDirectory(id=lucene-2c413925))),segFN=segments_1,generation=1}
[junit4] 2> 2595078 T7864 oasc.SolrDeletionPolicy.updateCommits newest commit generation = 1
[junit4] 2> 2595078 T7884 oass.IndexSchema.readSchema default search field in schema is text
[junit4] 2> 2595078 T7864 oass.SolrIndexSearcher.<init> Opening Searcher@7badb491[solrj_collection_shard1_replica1] main
[junit4] 2> 2595079 T7929 oass.IndexSchema.readSchema default search field in schema is text
[junit4] 2> 2595079 T7864 oascc.ZkStateReader.readConfigName Load collection config from:/collections/solrj_collection
[junit4] 2> 2595080 T7899 oass.IndexSchema.readSchema unique key field: id
[junit4] 2> 2595080 T7864 oascc.ZkStateReader.readConfigName path=/collections/solrj_collection configName=conf1 specified config exists in ZooKeeper
[junit4] 2> 2595080 T7864 oasr.ManagedResourceStorage.newStorageIO Setting up ZooKeeper-based storage for the RestManager with znodeBase: /configs/conf1
[junit4] 2> 2595081 T7864 oasr.ManagedResourceStorage$ZooKeeperStorageIO.configure Configured ZooKeeperStorageIO with znodeBase: /configs/conf1
[junit4] 2> 2595081 T7864 oasr.RestManager.init Initializing RestManager with initArgs: {}
[junit4] 2> 2595081 T7884 oass.IndexSchema.readSchema unique key field: id
[junit4] 2> 2595081 T7864 oasr.ManagedResourceStorage.load Reading _rest_managed.json using ZooKeeperStorageIO:path=/configs/conf1
[junit4] 2> 2595082 T7929 oass.IndexSchema.readSchema unique key field: id
[junit4] 2> 2595082 T7864 oasr.ManagedResourceStorage$ZooKeeperStorageIO.openInputStream No data found for znode /configs/conf1/_rest_managed.json
[junit4] 2> 2595083 T7864 oasr.ManagedResourceStorage.load Loaded null at path _rest_managed.json using ZooKeeperStorageIO:path=/configs/conf1
[junit4] 2> 2595083 T7864 oascc.SolrZkClient.makePath makePath: /configs/conf1/_rest_managed.json
[junit4] 2> 2595085 T7864 oasr.ManagedResourceStorage$ZooKeeperStorageIO$1.close Wrote 38 bytes to new znode /configs/conf1/_rest_managed.json
[junit4] 2> 2595086 T7864 oasr.ManagedResourceStorage$JsonStorage.store Saved JSON object to path _rest_managed.json using ZooKeeperStorageIO:path=/configs/conf1
[junit4] 2> 2595086 T7864 oasr.RestManager.init Initializing 0 registered ManagedResources
[junit4] 2> 2595090 T7952 oasc.SolrCore.registerSearcher [solrj_collection_shard1_replica1] Registered new searcher Searcher@7badb491[solrj_collection_shard1_replica1] main{ExitableDirectoryReader(UninvertingDirectoryReader())}
[junit4] 2> 2595091 T7899 oass.FileExchangeRateProvider.reload Reloading exchange rates from file currency.xml
[junit4] 2> 2595093 T7884 oass.FileExchangeRateProvider.reload Reloading exchange rates from file currency.xml
[junit4] 2> 2595093 T7929 oass.FileExchangeRateProvider.reload Reloading exchange rates from file currency.xml
[junit4] 2> 2595093 T7864 oasc.CoreContainer.registerCore registering core: solrj_collection_shard1_replica1
[junit4] 2> 2595094 T7864 oasc.ZkController.register Register replica - core:solrj_collection_shard1_replica1 address:https://127.0.0.1:31695 collection:solrj_collection shard:shard1
[junit4] 2> 2595095 T7864 oascc.SolrZkClient.makePath makePath: /collections/solrj_collection/leader_elect/shard1/election
[junit4] 2> 2595096 T7899 oass.FileExchangeRateProvider.reload Reloading exchange rates from file currency.xml
[junit4] 2> 2595097 T7929 oass.FileExchangeRateProvider.reload Reloading exchange rates from file currency.xml
[junit4] 2> 2595097 T7884 oass.FileExchangeRateProvider.reload Reloading exchange rates from file currency.xml
[junit4] 2> 2595099 T7864 oasc.ShardLeaderElectionContext.runLeaderProcess Running the leader process for shard shard1
[junit4] 2> 2595100 T7880 oasc.DistributedQueue$LatchWatcher.process NodeChildrenChanged fired on path /overseer/queue state SyncConnected
[junit4] 2> 2595101 T7864 oasc.ShardLeaderElectionContext.waitForReplicasToComeUp Waiting until we see more replicas up for shard shard1: total=2 found=1 timeoutin=0ms
[junit4] 2> 2595101 T7864 oasc.ShardLeaderElectionContext.waitForReplicasToComeUp Was waiting for replicas to come up, but they are taking too long - assuming they won't come back till later
[junit4] 2> 2595101 T7899 oass.OpenExchangeRatesOrgProvider.reload Reloading exchange rates from open-exchange-rates.json
[junit4] 2> 2595101 T7864 oasc.ShardLeaderElectionContext.runLeaderProcess I may be the new leader - try and sync
[junit4] 2> ASYNC NEW_CORE C674 name=solrj_collection_shard1_replica1 org.apache.solr.core.SolrCore@7f80f2a3 url=https://127.0.0.1:31695/solrj_collection_shard1_replica1 node=127.0.0.1:31695_ C674_STATE=coll:solrj_collection core:solrj_collection_shard1_replica1 props:{core=solrj_collection_shard1_replica1, state=down, node_name=127.0.0.1:31695_, base_url=https://127.0.0.1:31695}
[junit4] 2> 2595102 T7864 C674 P31695 oasc.SyncStrategy.sync Sync replicas to https://127.0.0.1:31695/solrj_collection_shard1_replica1/
[junit4] 2> 2595102 T7899 oass.OpenExchangeRatesOrgProvider$OpenExchangeRates.<init> WARN Unknown key IMPORTANT NOTE
[junit4] 2> 2595102 T7884 oass.OpenExchangeRatesOrgProvider.reload Reloading exchange rates from open-exchange-rates.json
[junit4] 2> 2595102 T7929 oass.OpenExchangeRatesOrgProvider.reload Reloading exchange rates from open-exchange-rates.json
[junit4] 2> 2595103 T7899 oass.OpenExchangeRatesOrgProvider$OpenExchangeRates.<init> WARN Expected key, got STRING
[junit4] 2> 2595104 T7884 oass.OpenExchangeRatesOrgProvider$OpenExchangeRates.<init> WARN Unknown key IMPORTANT NOTE
[junit4] 2> 2595103 T7864 C674 P31695 oasu.PeerSync.sync PeerSync: core=solrj_collection_shard1_replica1 url=https://127.0.0.1:31695 START replicas=[https://127.0.0.1:31710/solrj_collection_shard1_replica2/] nUpdates=100
[junit4] 2> 2595104 T7880 oascc.ZkStateReader$2.process A cluster state change: WatchedEvent state:SyncConnected type:NodeDataChanged path:/clusterstate.json, has occurred - updating... (live nodes size: 5)
[junit4] 2> 2595105 T7925 oascc.ZkStateReader$2.process A cluster state change: WatchedEvent state:SyncConnected type:NodeDataChanged path:/clusterstate.json, has occurred - updating... (live nodes size: 5)
[junit4] 2> 2595104 T7940 oascc.ZkStateReader$2.process A cluster state change: WatchedEvent state:SyncConnected type:NodeDataChanged path:/clusterstate.json, has occurred - updating... (live nodes size: 5)
[junit4] 2> 2595104 T7910 oascc.ZkStateReader$2.process A cluster state change: WatchedEvent state:SyncConnected type:NodeDataChanged path:/clusterstate.json, has occurred - updating... (live nodes size: 5)
[junit4] 2> 2595105 T7895 oascc.ZkStateReader$2.process A cluster state change: WatchedEvent state:SyncConnected type:NodeDataChanged path:/clusterstate.json, has occurred - updating... (live nodes size: 5)
[junit4] 2> 2595104 T7881 oascc.ZkStateReader$2.process A cluster state change: WatchedEvent state:SyncConnected type:NodeDataChanged path:/clusterstate.json, has occurred - updating... (live nodes size: 5)
[junit4] 2> 2595104 T7884 oass.OpenExchangeRatesOrgProvider$OpenExchangeRates.<init> WARN Expected key, got STRING
[junit4] 2> 2595104 T7929 oass.OpenExchangeRatesOrgProvider$OpenExchangeRates.<init> WARN Unknown key IMPORTANT NOTE
[junit4] 2> 2595104 T7899 oass.OpenExchangeRatesOrgProvider.reload Reloading exchange rates from open-exchange-rates.json
[junit4] 2> 2595108 T7929 oass.OpenExchangeRatesOrgProvider$OpenExchangeRates.<init> WARN Expected key, got STRING
[junit4] 2> 2595108 T7884 oass.OpenExchangeRatesOrgProvider.reload Reloading exchange rates from open-exchange-rates.json
[junit4] 2> 2595105 T7864 C674 P31695 oasu.PeerSync.sync PeerSync: core=solrj_collection_shard1_replica1 url=https://127.0.0.1:31695 DONE. We have no versions. sync failed.
[junit4] 2> 2595110 T7884 oass.OpenExchangeRatesOrgProvider$OpenExchangeRates.<init> WARN Unknown key IMPORTANT NOTE
[junit4] 2> 2595110 T7864 C674 P31695 oasc.SyncStrategy.syncReplicas Leader's attempt to sync with shard failed, moving to the next candidate
[junit4] 2> 2595109 T7899 oass.OpenExchangeRatesOrgProvider$OpenExchangeRates.<init> WARN Unknown key IMPORTANT NOTE
[junit4] 2> 2595111 T7899 oass.OpenExchangeRatesOrgProvider$OpenExchangeRates.<init> WARN Expected key, got STRING
[junit4] 2> 2595109 T7929 oass.OpenExchangeRatesOrgProvider.reload Reloading exchange rates from open-exchange-rates.json
[junit4] 2> 2595111 T7899 oasc.CoreContainer.create Creating SolrCore 'solrj_collection_shard1_replica2' using configuration from collection solrj_collection
[junit4] 2> 2595111 T7864 oasc.ShardLeaderElectionContext.runLeaderProcess We failed sync, but we have no versions - we can't sync in that case - we were active before, so become leader anyway
[junit4] 2> 2595110 T7884 oass.OpenExchangeRatesOrgProvider$OpenExchangeRates.<init> WARN Expected key, got STRING
[junit4] 2> 2595112 T7864 oasc.ShardLeaderElectionContext.runLeaderProcess I am the new leader: https://127.0.0.1:31695/solrj_collection_shard1_replica1/ shard1
[junit4] 2> 2595112 T7929 oass.OpenExchangeRatesOrgProvider$OpenExchangeRates.<init> WARN Unknown key IMPORTANT NOTE
[junit4] 2> 2595113 T7929 oass.OpenExchangeRatesOrgProvider$OpenExchangeRates.<init> WARN Expected key, got STRING
[junit4] 2> 2595112 T7899 oasc.SolrCore.initDirectoryFactory org.apache.solr.core.MockDirectoryFactory
[junit4] 2> 2595114 T7929 oasc.CoreContainer.create Creating SolrCore 'solrj_collection_shard2_replica1' using configuration from collection solrj_collection
[junit4] 2> 2595113 T7864 oascc.SolrZkClient.makePath makePath: /collections/solrj_collection/leaders/shard1
[junit4] 2> 2595113 T7884 oasc.CoreContainer.create Creating SolrCore 'solrj_collection_shard2_replica2' using configuration from collection solrj_collection
[junit4] 2> 2595114 T7929 oasc.SolrCore.initDirectoryFactory org.apache.solr.core.MockDirectoryFactory
[junit4] 2> 2595114 T7899 oasc.SolrCore.<init> [solrj_collection_shard1_replica2] Opening new SolrCore at /usr/home/jenkins/jenkins-slave/workspace/Lucene-Solr-NightlyTests-5.x/solr/build/solr-core/test/J3/temp/solr.cloud.CollectionsAPIDistributedZkTest-6CFAFC4E7B581D4D-001/tempDir-004/solrj_collection_shard1_replica2/, dataDir=/usr/home/jenkins/jenkins-slave/workspace/Lucene-Solr-NightlyTests-5.x/solr/build/solr-core/test/J3/temp/solr.cloud.CollectionsAPIDistributedZkTest-6CFAFC4E7B581D4D-001/tempDir-004/solrj_collection_shard1_replica2/data/
[junit4] 2> 2595115 T7929 oasc.SolrCore.<init> [solrj_collection_shard2_replica1] Opening new SolrCore at /usr/home/jenkins/jenkins-slave/workspace/Lucene-Solr-NightlyTests-5.x/solr/build/solr-core/test/J3/temp/solr.cloud.CollectionsAPIDistributedZkTest-6CFAFC4E7B581D4D-001/tempDir-006/solrj_collection_shard2_replica1/, dataDir=/usr/home/jenkins/jenkins-slave/workspace/Lucene-Solr-NightlyTests-5.x/solr/build/solr-core/test/J3/temp/solr.cloud.CollectionsAPIDistributedZkTest-6CFAFC4E7B581D4D-001/tempDir-006/solrj_collection_shard2_replica1/data/
[junit4] 2> 2595115 T7884 oasc.SolrCore.initDirectoryFactory org.apache.solr.core.MockDirectoryFactory
[junit4] 2> 2595116 T7929 oasc.JmxMonitoredMap.<init> JMX monitoring is enabled. Adding Solr mbeans to JMX Server: com.sun.jmx.mbeanserver.JmxMBeanServer@3d5693f
[junit4] 2> 2595116 T7899 oasc.JmxMonitoredMap.<init> JMX monitoring is enabled. Adding Solr mbeans to JMX Server: com.sun.jmx.mbeanserver.JmxMBeanServer@3d5693f
[junit4] 2> 2595116 T7884 oasc.SolrCore.<init> [solrj_collection_shard2_replica2] Opening new SolrCore at ../../../../../../../../../../../usr/home/jenkins/jenkins-slave/workspace/Lucene-Solr-NightlyTests-5.x/solr/build/solr-core/test/J3/temp/solr.cloud.CollectionsAPIDistributedZkTest-6CFAFC4E7B581D4D-001/tempDir-003/solrj_collection_shard2_replica2/, dataDir=/usr/home/jenkins/jenkins-slave/workspace/Lucene-Solr-NightlyTests-5.x/solr/build/solr-core/test/J3/../../../../../../../../../../../usr/home/jenkins/jenkins-slave/workspace/Lucene-Solr-NightlyTests-5.x/solr/build/solr-core/test/J3/temp/solr.cloud.CollectionsAPIDistributedZkTest-6CFAFC4E7B581D4D-001/tempDir-003/solrj_collection_shard2_replica2/data/
[junit4] 2> 2595117 T7884 oasc.JmxMonitoredMap.<init> JMX monitoring is enabled. Adding Solr mbeans to JMX Server: com.sun.jmx.mbeanserver.JmxMBeanServer@3d5693f
[junit4] 2> 2595118 T7899 oasc.CachingDirectoryFactory.get return new directory for /usr/home/jenkins/jenkins-slave/workspace/Lucene-Solr-NightlyTests-5.x/solr/build/solr-core/test/J3/temp/solr.cloud.CollectionsAPIDistributedZkTest-6CFAFC4E7B581D4D-001/tempDir-004/solrj_collection_shard1_replica2/data
[junit4] 2> 2595118 T7880 oasc.DistributedQueue$LatchWatcher.process NodeChildrenChanged fired on path /overseer/queue state SyncConnected
[junit4] 2> 2595117 T7929 oasc.CachingDirectoryFactory.get return new directory for /usr/home/jenkins/jenkins-slave/workspace/Lucene-Solr-NightlyTests-5.x/solr/build/solr-core/test/J3/temp/solr.cloud.CollectionsAPIDistributedZkTest-6CFAFC4E7B581D4D-001/tempDir-006/solrj_collection_shard2_replica1/data
[junit4] 2> 2595118 T7884 oasc.CachingDirectoryFactory.get return new directory for /usr/home/jenkins/jenkins-slave/workspace/Lucene-Solr-NightlyTests-5.x/solr/build/solr-core/test/J3/../../../../../../../../../../../usr/home/jenkins/jenkins-slave/workspace/Lucene-Solr-NightlyTests-5.x/solr/build/solr-core/test/J3/temp/solr.cloud.CollectionsAPIDistributedZkTest-6CFAFC4E7B581D4D-001/tempDir-003/solrj_collection_shard2_replica2/data
[junit4] 2> 2595118 T7899 oasc.SolrCore.getNewIndexDir New index directory detected: old=null new=/usr/home/jenkins/jenkins-slave/workspace/Lucene-Solr-NightlyTests-5.x/solr/build/solr-core/test/J3/temp/solr.cloud.CollectionsAPIDistributedZkTest-6CFAFC4E7B581D4D-001/tempDir-004/solrj_collection_shard1_replica2/data/index/
[junit4] 2> 2595119 T7884 oasc.SolrCore.getNewIndexDir New index directory detected: old=null new=/usr/home/jenkins/jenkins-slave/workspace/Lucene-Solr-NightlyTests-5.x/solr/build/solr-core/test/J3/../../../../../../../../../../../usr/home/jenkins/jenkins-slave/workspace/Lucene-Solr-NightlyTests-5.x/solr/build/solr-core/test/J3/temp/solr.c
[...truncated too long message...]
onsAPIDistributedZkTest-6CFAFC4E7B581D4D-001/tempDir-006/solr.xml
[junit4] 2> 3517256 T8736 oass.SolrDispatchFilter.handleAdminRequest [admin] webapp=null path=/admin/cores params={numShards=6&shard=shard5&name=awholynewstresscollection_collection1_3_shard5_replica1&collection=awholynewstresscollection_collection1_3&wt=javabin&collection.configName=conf1&action=CREATE&version=2&qt=/admin/cores} status=0 QTime=784542
[junit4] 2> 3517256 T8736 oasc.SolrException.log ERROR null:org.eclipse.jetty.io.EofException
[junit4] 2> at org.eclipse.jetty.server.HttpOutput.write(HttpOutput.java:142)
[junit4] 2> at org.eclipse.jetty.server.HttpOutput.write(HttpOutput.java:107)
[junit4] 2> at org.apache.solr.common.util.FastOutputStream.flush(FastOutputStream.java:214)
[junit4] 2> at org.apache.solr.common.util.FastOutputStream.flushBuffer(FastOutputStream.java:207)
[junit4] 2> at org.apache.solr.common.util.JavaBinCodec.marshal(JavaBinCodec.java:98)
[junit4] 2> at org.apache.solr.response.BinaryResponseWriter.write(BinaryResponseWriter.java:52)
[junit4] 2> at org.apache.solr.response.QueryResponseWriterUtil.writeQueryResponse(QueryResponseWriterUtil.java:50)
[junit4] 2> at org.apache.solr.servlet.SolrDispatchFilter.writeResponse(SolrDispatchFilter.java:763)
[junit4] 2> at org.apache.solr.servlet.SolrDispatchFilter.handleAdminRequest(SolrDispatchFilter.java:743)
[junit4] 2> at org.apache.solr.servlet.SolrDispatchFilter.doFilter(SolrDispatchFilter.java:253)
[junit4] 2> at org.apache.solr.servlet.SolrDispatchFilter.doFilter(SolrDispatchFilter.java:202)
[junit4] 2> at org.eclipse.jetty.servlet.ServletHandler$CachedChain.doFilter(ServletHandler.java:1419)
[junit4] 2> at org.apache.solr.client.solrj.embedded.JettySolrRunner$DebugFilter.doFilter(JettySolrRunner.java:137)
[junit4] 2> at org.eclipse.jetty.servlet.ServletHandler$CachedChain.doFilter(ServletHandler.java:1419)
[junit4] 2> at org.eclipse.jetty.servlet.ServletHandler.doHandle(ServletHandler.java:455)
[junit4] 2> at org.eclipse.jetty.server.session.SessionHandler.doHandle(SessionHandler.java:229)
[junit4] 2> at org.eclipse.jetty.server.handler.ScopedHandler.handle(ScopedHandler.java:137)
[junit4] 2> at org.eclipse.jetty.server.handler.GzipHandler.handle(GzipHandler.java:301)
[junit4] 2> at org.eclipse.jetty.server.handler.ContextHandler.doHandle(ContextHandler.java:1077)
[junit4] 2> at org.eclipse.jetty.servlet.ServletHandler.doScope(ServletHandler.java:384)
[junit4] 2> at org.eclipse.jetty.server.session.SessionHandler.doScope(SessionHandler.java:193)
[junit4] 2> at org.eclipse.jetty.server.handler.ContextHandler.doScope(ContextHandler.java:1009)
[junit4] 2> at org.eclipse.jetty.server.handler.ScopedHandler.handle(ScopedHandler.java:135)
[junit4] 2> at org.eclipse.jetty.server.handler.HandlerWrapper.handle(HandlerWrapper.java:116)
[junit4] 2> at org.eclipse.jetty.server.Server.handle(Server.java:368)
[junit4] 2> at org.eclipse.jetty.server.AbstractHttpConnection.handleRequest(AbstractHttpConnection.java:489)
[junit4] 2> at org.eclipse.jetty.server.BlockingHttpConnection.handleRequest(BlockingHttpConnection.java:53)
[junit4] 2> at org.eclipse.jetty.server.AbstractHttpConnection.content(AbstractHttpConnection.java:953)
[junit4] 2> at org.eclipse.jetty.server.AbstractHttpConnection$RequestHandler.content(AbstractHttpConnection.java:1014)
[junit4] 2> at org.eclipse.jetty.http.HttpParser.parseNext(HttpParser.java:861)
[junit4] 2> at org.eclipse.jetty.http.HttpParser.parseAvailable(HttpParser.java:240)
[junit4] 2> at org.eclipse.jetty.server.BlockingHttpConnection.handle(BlockingHttpConnection.java:72)
[junit4] 2> at org.eclipse.jetty.server.bio.SocketConnector$ConnectorEndPoint.run(SocketConnector.java:264)
[junit4] 2> at org.eclipse.jetty.server.ssl.SslSocketConnector$SslConnectorEndPoint.run(SslSocketConnector.java:670)
[junit4] 2> at org.eclipse.jetty.util.thread.QueuedThreadPool.runJob(QueuedThreadPool.java:608)
[junit4] 2> at org.eclipse.jetty.util.thread.QueuedThreadPool$3.run(QueuedThreadPool.java:543)
[junit4] 2> at java.lang.Thread.run(Thread.java:745)
[junit4] 2>
[junit4] 2> 3518717 T7843 oas.SolrTestCaseJ4.tearDown ###Ending testDistribSearch
[junit4] 2> 3518721 T7843 oasc.ZkTestServer.send4LetterWord connecting to 127.0.0.1:31689 31689
[junit4] 2> 3519451 T8330 oasc.ZkTestServer.send4LetterWord connecting to 127.0.0.1:31689 31689
[junit4] 2> NOTE: download the large Jenkins line-docs file by running 'ant get-jenkins-line-docs' in the lucene directory.
[junit4] 2> NOTE: reproduce with: ant test -Dtestcase=CollectionsAPIDistributedZkTest -Dtests.method=testDistribSearch -Dtests.seed=6CFAFC4E7B581D4D -Dtests.multiplier=2 -Dtests.nightly=true -Dtests.slow=true -Dtests.linedocsfile=/home/jenkins/lucene-data/enwiki.random.lines.txt -Dtests.locale=th_TH_TH_#u-nu-thai -Dtests.timezone=Europe/Kiev -Dtests.asserts=true -Dtests.file.encoding=UTF-8
[junit4] ERROR 938s J3 | CollectionsAPIDistributedZkTest.testDistribSearch <<<
[junit4] > Throwable #1: org.apache.solr.client.solrj.impl.HttpSolrServer$RemoteSolrException: Error CREATEing SolrCore 'halfcollection_shard1_replica1': Unable to create core [halfcollection_shard1_replica1] Caused by: Could not get shard id for core: halfcollection_shard1_replica1
[junit4] > at __randomizedtesting.SeedInfo.seed([6CFAFC4E7B581D4D:ED1C72560C077D71]:0)
[junit4] > at org.apache.solr.client.solrj.impl.HttpSolrServer.executeMethod(HttpSolrServer.java:569)
[junit4] > at org.apache.solr.client.solrj.impl.HttpSolrServer.request(HttpSolrServer.java:215)
[junit4] > at org.apache.solr.client.solrj.impl.HttpSolrServer.request(HttpSolrServer.java:211)
[junit4] > at org.apache.solr.cloud.CollectionsAPIDistributedZkTest.testErrorHandling(CollectionsAPIDistributedZkTest.java:583)
[junit4] > at org.apache.solr.cloud.CollectionsAPIDistributedZkTest.doTest(CollectionsAPIDistributedZkTest.java:205)
[junit4] > at org.apache.solr.BaseDistributedSearchTestCase.testDistribSearch(BaseDistributedSearchTestCase.java:869)
[junit4] > at java.lang.Thread.run(Thread.java:745)
[junit4] 2> 3519476 T7843 oas.SolrTestCaseJ4.deleteCore ###deleteCore
[junit4] 2> NOTE: leaving temporary files on disk at: /usr/home/jenkins/jenkins-slave/workspace/Lucene-Solr-NightlyTests-5.x/solr/build/solr-core/test/J3/temp/solr.cloud.CollectionsAPIDistributedZkTest-6CFAFC4E7B581D4D-001
[junit4] 2> NOTE: test params are: codec=CheapBastard, sim=DefaultSimilarity, locale=th_TH_TH_#u-nu-thai, timezone=Europe/Kiev
[junit4] 2> NOTE: FreeBSD 9.1-RELEASE-p3 amd64/Oracle Corporation 1.7.0_65 (64-bit)/cpus=16,threads=1,free=144929136,total=438829056
[junit4] 2> NOTE: All tests run in this JVM: [DeleteReplicaTest, BadIndexSchemaTest, UnloadDistributedZkTest, TestSchemaSimilarityResource, RollingRestartTest, TestFreeTextSuggestions, OverriddenZkACLAndCredentialsProvidersTest, TestManagedSchema, LeaderElectionTest, TestManagedResourceStorage, TestSolrQueryParserResource, HdfsBasicDistributedZk2Test, TestOrdValues, TestFieldResource, TermVectorComponentTest, CoreAdminHandlerTest, CoreContainerCoreInitFailuresTest, TestCursorMarkWithoutUniqueKey, FieldMutatingUpdateProcessorTest, ResponseLogComponentTest, TestLRUCache, TestDocSet, TestManagedSchemaFieldResource, TestSort, TestInitQParser, TestCoreDiscovery, LeaderInitiatedRecoveryOnCommitTest, SpellCheckComponentTest, TestSerializedLuceneMatchVersion, TestPHPSerializedResponseWriter, BlockCacheTest, DeleteLastCustomShardedReplicaTest, TimeZoneUtilsTest, TestMergePolicyConfig, AddSchemaFieldsUpdateProcessorFactoryTest, StandardRequestHandlerTest, AsyncMigrateRouteKeyTest, SpellPossibilityIteratorTest, TestIntervalFaceting, RequestHandlersTest, DocValuesMultiTest, TestReplicationHandlerBackup, TriLevelCompositeIdRoutingTest, UniqFieldsUpdateProcessorFactoryTest, SearchHandlerTest, TestDistribDocBasedVersion, TestSolrXml, ZkCLITest, BadCopyFieldTest, CollectionsAPIDistributedZkTest]
[junit4] Completed on J3 in 937.63s, 1 test, 1 error <<< FAILURES!
[...truncated 48 lines...]
BUILD FAILED
/usr/home/jenkins/jenkins-slave/workspace/Lucene-Solr-NightlyTests-5.x/build.xml:532: The following error occurred while executing this line:
/usr/home/jenkins/jenkins-slave/workspace/Lucene-Solr-NightlyTests-5.x/build.xml:473: The following error occurred while executing this line:
/usr/home/jenkins/jenkins-slave/workspace/Lucene-Solr-NightlyTests-5.x/build.xml:61: The following error occurred while executing this line:
/usr/home/jenkins/jenkins-slave/workspace/Lucene-Solr-NightlyTests-5.x/extra-targets.xml:39: The following error occurred while executing this line:
/usr/home/jenkins/jenkins-slave/workspace/Lucene-Solr-NightlyTests-5.x/solr/build.xml:189: The following error occurred while executing this line:
/usr/home/jenkins/jenkins-slave/workspace/Lucene-Solr-NightlyTests-5.x/solr/common-build.xml:502: The following error occurred while executing this line:
/usr/home/jenkins/jenkins-slave/workspace/Lucene-Solr-NightlyTests-5.x/lucene/common-build.xml:1359: The following error occurred while executing this line:
/usr/home/jenkins/jenkins-slave/workspace/Lucene-Solr-NightlyTests-5.x/lucene/common-build.xml:966: There were test failures: 441 suites, 1804 tests, 1 error, 54 ignored (9 assumptions)
Total time: 229 minutes 35 seconds
Build step 'Invoke Ant' marked build as failure
Archiving artifacts
Sending artifact delta relative to Lucene-Solr-NightlyTests-5.x #654
Archived 5 artifacts
Archive block size is 32768
Received 0 blocks and 657922065 bytes
Compression is 0.0%
Took 1 min 57 sec
Recording test results
Email was triggered for: Failure
Sending email for trigger: Failure