You are viewing a plain text version of this content. The canonical link for it is here.
Posted to yarn-dev@hadoop.apache.org by Apache Jenkins Server <je...@builds.apache.org> on 2015/04/14 02:44:16 UTC
Failed: YARN-3318 PreCommit Build #7321
Jira: https://issues.apache.org/jira/browse/YARN-3318
Build: https://builds.apache.org/job/PreCommit-YARN-Build/7321/
###################################################################################
########################## LAST 60 LINES OF THE CONSOLE ###########################
[...truncated 3542 lines...]
{color:green}+1 javadoc{color}. There were no new javadoc warning messages.
{color:green}+1 eclipse:eclipse{color}. The patch built with eclipse:eclipse.
{color:red}-1 findbugs{color}. The patch appears to introduce 1 new Findbugs (version 2.0.3) warnings.
{color:green}+1 release audit{color}. The applied patch does not increase the total number of release audit warnings.
{color:green}+1 core tests{color}. The patch passed unit tests in hadoop-yarn-project/hadoop-yarn/hadoop-yarn-server/hadoop-yarn-server-resourcemanager.
Test results: https://builds.apache.org/job/PreCommit-YARN-Build/7321//testReport/
Findbugs warnings: https://builds.apache.org/job/PreCommit-YARN-Build/7321//artifact/patchprocess/newPatchFindbugsWarningshadoop-yarn-server-resourcemanager.html
Javac warnings: https://builds.apache.org/job/PreCommit-YARN-Build/7321//artifact/patchprocess/diffJavacWarnings.txt
Console output: https://builds.apache.org/job/PreCommit-YARN-Build/7321//console
This message is automatically generated.
======================================================================
======================================================================
Adding comment to Jira.
======================================================================
======================================================================
Comment added.
92ade5f701e6bd2ef0548eb824df8b8455df8e38 logged out
======================================================================
======================================================================
Finished build.
======================================================================
======================================================================
Build step 'Execute shell' marked build as failure
Archiving artifacts
Sending artifact delta relative to PreCommit-YARN-Build #7308
ERROR: Failed to archive {patchprocess/patchJavacWarnings.txt=patchprocess/patchJavacWarnings.txt, patchprocess/trunkJavacWarnings.txt=patchprocess/trunkJavacWarnings.txt, patchprocess/diffJavacWarnings.txt=patchprocess/diffJavacWarnings.txt, patchprocess/patchJavadocWarnings.txt=patchprocess/patchJavadocWarnings.txt, patchprocess/newPatchFindbugsWarningshadoop-yarn-server-resourcemanager.html=patchprocess/newPatchFindbugsWarningshadoop-yarn-server-resourcemanager.html, patchprocess/newPatchFindbugsWarningshadoop-yarn-server-resourcemanager.xml=patchprocess/newPatchFindbugsWarningshadoop-yarn-server-resourcemanager.xml, patchprocess/testrun_hadoop-yarn-server-resourcemanager.txt=patchprocess/testrun_hadoop-yarn-server-resourcemanager.txt, patchprocess/trunkJavadocWarnings.txt=patchprocess/trunkJavadocWarnings.txt, patchprocess/patchReleaseAuditOutput.txt=patchprocess/patchReleaseAuditOutput.txt, patchprocess/patchReleaseAuditWarnings.txt=patchprocess/patchReleaseAuditWarnings.txt, patchprocess/filteredPatchJavacWarnings.txt=patchprocess/filteredPatchJavacWarnings.txt, patchprocess/patchFindbugsWarningshadoop-yarn-server-resourcemanager.xml=patchprocess/patchFindbugsWarningshadoop-yarn-server-resourcemanager.xml, patchprocess/patchEclipseOutput.txt=patchprocess/patchEclipseOutput.txt, patchprocess/diffJavadocWarnings.txt=patchprocess/diffJavadocWarnings.txt, patchprocess/filteredTrunkJavacWarnings.txt=patchprocess/filteredTrunkJavacWarnings.txt, patchprocess/patchFindBugsOutputhadoop-yarn-server-resourcemanager.txt=patchprocess/patchFindBugsOutputhadoop-yarn-server-resourcemanager.txt} due to internal error; falling back to full archiving
java.lang.IllegalStateException: checksum mismatch after transfer (6577874794637500426 vs. 3743922678); /x1/jenkins/jenkins-home/jobs/PreCommit-YARN-Build/builds/2015-04-13_23-20-23/archive/patchprocess/patchJavadocWarnings.txt may be corrupted
at jsync.protocol.FileSequenceReader.read(FileSequenceReader.java:45)
at com.cloudbees.jenkins.plugins.jsync.archiver.JSyncArtifactManager.remoteSync(JSyncArtifactManager.java:145)
at com.cloudbees.jenkins.plugins.jsync.archiver.JSyncArtifactManager.archive(JSyncArtifactManager.java:68)
at hudson.tasks.ArtifactArchiver.perform(ArtifactArchiver.java:140)
at hudson.tasks.BuildStepMonitor$1.perform(BuildStepMonitor.java:20)
at hudson.model.AbstractBuild$AbstractBuildExecution.perform(AbstractBuild.java:756)
at hudson.model.AbstractBuild$AbstractBuildExecution.performAllBuildSteps(AbstractBuild.java:720)
at hudson.model.Build$BuildExecution.post2(Build.java:182)
at hudson.model.AbstractBuild$AbstractBuildExecution.post(AbstractBuild.java:669)
at hudson.model.Run.execute(Run.java:1731)
at hudson.model.FreeStyleBuild.run(FreeStyleBuild.java:43)
at hudson.model.ResourceController.execute(ResourceController.java:88)
at hudson.model.Executor.run(Executor.java:232)
[description-setter] Could not determine description.
Recording test results
Email was triggered for: Failure
Sending email for trigger: Failure
###################################################################################
############################## FAILED TESTS (if any) ##############################
All tests passed
Success: YARN-3451 PreCommit Build #7326
Posted by Apache Jenkins Server <je...@builds.apache.org>.
Jira: https://issues.apache.org/jira/browse/YARN-3451
Build: https://builds.apache.org/job/PreCommit-YARN-Build/7326/
###################################################################################
########################## LAST 60 LINES OF THE CONSOLE ###########################
[...truncated 4035 lines...]
{color:green}+1 overall{color}. Here are the results of testing the latest attachment
http://issues.apache.org/jira/secure/attachment/12725152/0001-YARN-3451.patch
against trunk revision b9b832a.
{color:green}+1 @author{color}. The patch does not contain any @author tags.
{color:green}+1 tests included{color}. The patch appears to include 3 new or modified test files.
{color:green}+1 javac{color}. The applied patch does not increase the total number of javac compiler warnings.
{color:green}+1 javadoc{color}. There were no new javadoc warning messages.
{color:green}+1 eclipse:eclipse{color}. The patch built with eclipse:eclipse.
{color:green}+1 findbugs{color}. The patch does not introduce any new Findbugs (version 2.0.3) warnings.
{color:green}+1 release audit{color}. The applied patch does not increase the total number of release audit warnings.
{color:green}+1 core tests{color}. The patch passed unit tests in hadoop-yarn-project/hadoop-yarn/hadoop-yarn-api hadoop-yarn-project/hadoop-yarn/hadoop-yarn-client hadoop-yarn-project/hadoop-yarn/hadoop-yarn-common hadoop-yarn-project/hadoop-yarn/hadoop-yarn-server/hadoop-yarn-server-common hadoop-yarn-project/hadoop-yarn/hadoop-yarn-server/hadoop-yarn-server-resourcemanager.
Test results: https://builds.apache.org/job/PreCommit-YARN-Build/7326//testReport/
Console output: https://builds.apache.org/job/PreCommit-YARN-Build/7326//console
This message is automatically generated.
======================================================================
======================================================================
Adding comment to Jira.
======================================================================
======================================================================
Comment added.
7f19578e98cade5b17532099ff3c624f5c5289b3 logged out
======================================================================
======================================================================
Finished build.
======================================================================
======================================================================
Archiving artifacts
Sending artifact delta relative to PreCommit-YARN-Build #7308
Archived 35 artifacts
Archive block size is 32768
Received 219 blocks and 2874482 bytes
Compression is 71.4%
Took 2 sec
Description set: YARN-3451
Recording test results
Email was triggered for: Success
Sending email for trigger: Success
###################################################################################
############################## FAILED TESTS (if any) ##############################
All tests passed
Failed: YARN-3366 PreCommit Build #7325
Posted by Apache Jenkins Server <je...@builds.apache.org>.
Jira: https://issues.apache.org/jira/browse/YARN-3366
Build: https://builds.apache.org/job/PreCommit-YARN-Build/7325/
###################################################################################
########################## LAST 60 LINES OF THE CONSOLE ###########################
[...truncated 3613 lines...]
{color:red}-1 overall{color}. Here are the results of testing the latest attachment
http://issues.apache.org/jira/secure/attachment/12725149/YARN-3366.005.patch
against trunk revision b9b832a.
{color:green}+1 @author{color}. The patch does not contain any @author tags.
{color:green}+1 tests included{color}. The patch appears to include 3 new or modified test files.
{color:green}+1 javac{color}. The applied patch does not increase the total number of javac compiler warnings.
{color:green}+1 javadoc{color}. There were no new javadoc warning messages.
{color:green}+1 eclipse:eclipse{color}. The patch built with eclipse:eclipse.
{color:green}+1 findbugs{color}. The patch does not introduce any new Findbugs (version 2.0.3) warnings.
{color:green}+1 release audit{color}. The applied patch does not increase the total number of release audit warnings.
{color:red}-1 core tests{color}. The patch failed these unit tests in hadoop-yarn-project/hadoop-yarn/hadoop-yarn-api hadoop-yarn-project/hadoop-yarn/hadoop-yarn-server/hadoop-yarn-server-nodemanager:
org.apache.hadoop.yarn.server.nodemanager.containermanager.localizer.TestResourceLocalizationService
Test results: https://builds.apache.org/job/PreCommit-YARN-Build/7325//testReport/
Console output: https://builds.apache.org/job/PreCommit-YARN-Build/7325//console
This message is automatically generated.
======================================================================
======================================================================
Adding comment to Jira.
======================================================================
======================================================================
Comment added.
9a346e16700dd9a0d0183cf04e6b58ff1ffed739 logged out
======================================================================
======================================================================
Finished build.
======================================================================
======================================================================
Build step 'Execute shell' marked build as failure
Archiving artifacts
Sending artifact delta relative to PreCommit-YARN-Build #7308
Archived 20 artifacts
Archive block size is 32768
Received 52 blocks and 7759732 bytes
Compression is 18.0%
Took 1.7 sec
[description-setter] Could not determine description.
Recording test results
Email was triggered for: Failure
Sending email for trigger: Failure
###################################################################################
############################## FAILED TESTS (if any) ##############################
1 tests failed.
FAILED: org.apache.hadoop.yarn.server.nodemanager.containermanager.localizer.TestResourceLocalizationService.testPublicResourceInitializesLocalDir
Error Message:
Unable to delete directory target/org.apache.hadoop.yarn.server.nodemanager.containermanager.localizer.TestResourceLocalizationService/1/filecache.
Stack Trace:
java.io.IOException: Unable to delete directory target/org.apache.hadoop.yarn.server.nodemanager.containermanager.localizer.TestResourceLocalizationService/1/filecache.
at org.apache.commons.io.FileUtils.deleteDirectory(FileUtils.java:1541)
at org.apache.commons.io.FileUtils.forceDelete(FileUtils.java:2270)
at org.apache.commons.io.FileUtils.cleanDirectory(FileUtils.java:1653)
at org.apache.commons.io.FileUtils.deleteDirectory(FileUtils.java:1535)
at org.apache.commons.io.FileUtils.forceDelete(FileUtils.java:2270)
at org.apache.commons.io.FileUtils.cleanDirectory(FileUtils.java:1653)
at org.apache.commons.io.FileUtils.deleteDirectory(FileUtils.java:1535)
at org.apache.hadoop.yarn.server.nodemanager.containermanager.localizer.TestResourceLocalizationService.cleanup(TestResourceLocalizationService.java:186)
Failed: YARN-3404 PreCommit Build #7324
Posted by Apache Jenkins Server <je...@builds.apache.org>.
Jira: https://issues.apache.org/jira/browse/YARN-3404
Build: https://builds.apache.org/job/PreCommit-YARN-Build/7324/
###################################################################################
########################## LAST 60 LINES OF THE CONSOLE ###########################
[...truncated 3289 lines...]
{color:red}-1 overall{color}. Here are the results of testing the latest attachment
http://issues.apache.org/jira/secure/attachment/12725143/YARN-3404.3.patch
against trunk revision b9b832a.
{color:green}+1 @author{color}. The patch does not contain any @author tags.
{color:red}-1 tests included{color}. The patch doesn't appear to include any new or modified tests.
Please justify why no new tests are needed for this patch.
Also please list what manual steps were performed to verify this patch.
{color:green}+1 javac{color}. The applied patch does not increase the total number of javac compiler warnings.
{color:green}+1 javadoc{color}. There were no new javadoc warning messages.
{color:green}+1 eclipse:eclipse{color}. The patch built with eclipse:eclipse.
{color:green}+1 findbugs{color}. The patch does not introduce any new Findbugs (version 2.0.3) warnings.
{color:green}+1 release audit{color}. The applied patch does not increase the total number of release audit warnings.
{color:green}+1 core tests{color}. The patch passed unit tests in hadoop-yarn-project/hadoop-yarn/hadoop-yarn-server/hadoop-yarn-server-common.
Test results: https://builds.apache.org/job/PreCommit-YARN-Build/7324//testReport/
Console output: https://builds.apache.org/job/PreCommit-YARN-Build/7324//console
This message is automatically generated.
======================================================================
======================================================================
Adding comment to Jira.
======================================================================
======================================================================
Comment added.
ba89a35a207d259e129aaccfaffb3617cd925bfb logged out
======================================================================
======================================================================
Finished build.
======================================================================
======================================================================
Build step 'Execute shell' marked build as failure
Archiving artifacts
Sending artifact delta relative to PreCommit-YARN-Build #7308
Archived 15 artifacts
Archive block size is 32768
Received 210 blocks and 2087988 bytes
Compression is 76.7%
Took 1.4 sec
[description-setter] Could not determine description.
Recording test results
Email was triggered for: Failure
Sending email for trigger: Failure
###################################################################################
############################## FAILED TESTS (if any) ##############################
All tests passed
Failed: YARN-3366 PreCommit Build #7323
Posted by Apache Jenkins Server <je...@builds.apache.org>.
Jira: https://issues.apache.org/jira/browse/YARN-3366
Build: https://builds.apache.org/job/PreCommit-YARN-Build/7323/
###################################################################################
########################## LAST 60 LINES OF THE CONSOLE ###########################
[...truncated 3599 lines...]
{color:red}-1 overall{color}. Here are the results of testing the latest attachment
http://issues.apache.org/jira/secure/attachment/12725133/YARN-3366.004.patch
against trunk revision 838b06a.
{color:green}+1 @author{color}. The patch does not contain any @author tags.
{color:green}+1 tests included{color}. The patch appears to include 3 new or modified test files.
{color:green}+1 javac{color}. The applied patch does not increase the total number of javac compiler warnings.
{color:green}+1 javadoc{color}. There were no new javadoc warning messages.
{color:green}+1 eclipse:eclipse{color}. The patch built with eclipse:eclipse.
{color:red}-1 findbugs{color}. The patch appears to introduce 3 new Findbugs (version 2.0.3) warnings.
{color:green}+1 release audit{color}. The applied patch does not increase the total number of release audit warnings.
{color:green}+1 core tests{color}. The patch passed unit tests in hadoop-yarn-project/hadoop-yarn/hadoop-yarn-api hadoop-yarn-project/hadoop-yarn/hadoop-yarn-server/hadoop-yarn-server-nodemanager.
Test results: https://builds.apache.org/job/PreCommit-YARN-Build/7323//testReport/
Findbugs warnings: https://builds.apache.org/job/PreCommit-YARN-Build/7323//artifact/patchprocess/newPatchFindbugsWarningshadoop-yarn-server-nodemanager.html
Console output: https://builds.apache.org/job/PreCommit-YARN-Build/7323//console
This message is automatically generated.
======================================================================
======================================================================
Adding comment to Jira.
======================================================================
======================================================================
Comment added.
df2144c385f821cfbd01b0ecaa208a33343f03f6 logged out
======================================================================
======================================================================
Finished build.
======================================================================
======================================================================
Build step 'Execute shell' marked build as failure
Archiving artifacts
Sending artifact delta relative to PreCommit-YARN-Build #7308
Archived 20 artifacts
Archive block size is 32768
Received 56 blocks and 7645776 bytes
Compression is 19.4%
Took 2.2 sec
[description-setter] Could not determine description.
Recording test results
Email was triggered for: Failure
Sending email for trigger: Failure
###################################################################################
############################## FAILED TESTS (if any) ##############################
All tests passed
Failed: YARN-3318 PreCommit Build #7322
Posted by Apache Jenkins Server <je...@builds.apache.org>.
Jira: https://issues.apache.org/jira/browse/YARN-3318
Build: https://builds.apache.org/job/PreCommit-YARN-Build/7322/
###################################################################################
########################## LAST 60 LINES OF THE CONSOLE ###########################
[...truncated 3201 lines...]
cat: /home/jenkins/jenkins-slave/workspace/PreCommit-YARN-Build/../patchprocess/testrun_hadoop-yarn-server-resourcemanager.txt: No such file or directory
awk: cannot open /home/jenkins/jenkins-slave/workspace/PreCommit-YARN-Build/../patchprocess/testrun_hadoop-yarn-server-resourcemanager.txt (No such file or directory)
/home/jenkins/jenkins-slave/workspace/PreCommit-YARN-Build
{color:red}-1 overall{color}. Here are the results of testing the latest attachment
http://issues.apache.org/jira/secure/attachment/12725121/YARN-3318.59.patch
against trunk revision 838b06a.
{color:green}+1 @author{color}. The patch does not contain any @author tags.
{color:green}+1 tests included{color}. The patch appears to include 2 new or modified test files.
{color:green}+1 javac{color}. The applied patch does not increase the total number of javac compiler warnings.
{color:green}+1 javadoc{color}. There were no new javadoc warning messages.
{color:green}+1 eclipse:eclipse{color}. The patch built with eclipse:eclipse.
{color:green}+1 findbugs{color}. The patch does not introduce any new Findbugs (version 2.0.3) warnings.
{color:green}+1 release audit{color}. The applied patch does not increase the total number of release audit warnings.
{color:red}-1 core tests{color}. The patch failed these unit tests in hadoop-yarn-project/hadoop-yarn/hadoop-yarn-server/hadoop-yarn-server-resourcemanager:
org.apache.hadoop.yarn.server.resourcemanager.TestClientRMService
Test results: https://builds.apache.org/job/PreCommit-YARN-Build/7322//testReport/
Console output: https://builds.apache.org/job/PreCommit-YARN-Build/7322//console
This message is automatically generated.
======================================================================
======================================================================
Adding comment to Jira.
======================================================================
======================================================================
Comment added.
823ddc88753c4f8740c68b562c0d56081b4ed224 logged out
======================================================================
======================================================================
Finished build.
======================================================================
======================================================================
Build step 'Execute shell' marked build as failure
Archiving artifacts
[description-setter] Could not determine description.
Recording test results
Email was triggered for: Failure
Sending email for trigger: Failure
###################################################################################
############################## FAILED TESTS (if any) ##############################
3 tests failed.
REGRESSION: org.apache.hadoop.yarn.server.resourcemanager.TestClientRMService.testGetNodeLabels
Error Message:
java.net.BindException: Problem binding to [0.0.0.0:8032] java.net.BindException: Address already in use; For more details see: http://wiki.apache.org/hadoop/BindException
Stack Trace:
org.apache.hadoop.yarn.exceptions.YarnRuntimeException: java.net.BindException: Problem binding to [0.0.0.0:8032] java.net.BindException: Address already in use; For more details see: http://wiki.apache.org/hadoop/BindException
at sun.nio.ch.Net.bind0(Native Method)
at sun.nio.ch.Net.bind(Net.java:444)
at sun.nio.ch.Net.bind(Net.java:436)
at sun.nio.ch.ServerSocketChannelImpl.bind(ServerSocketChannelImpl.java:214)
at sun.nio.ch.ServerSocketAdaptor.bind(ServerSocketAdaptor.java:74)
at org.apache.hadoop.ipc.Server.bind(Server.java:413)
at org.apache.hadoop.ipc.Server$Listener.<init>(Server.java:579)
at org.apache.hadoop.ipc.Server.<init>(Server.java:2308)
at org.apache.hadoop.ipc.RPC$Server.<init>(RPC.java:945)
at org.apache.hadoop.ipc.ProtobufRpcEngine$Server.<init>(ProtobufRpcEngine.java:534)
at org.apache.hadoop.ipc.ProtobufRpcEngine.getServer(ProtobufRpcEngine.java:509)
at org.apache.hadoop.ipc.RPC$Builder.build(RPC.java:787)
at org.apache.hadoop.yarn.factories.impl.pb.RpcServerFactoryPBImpl.createServer(RpcServerFactoryPBImpl.java:169)
at org.apache.hadoop.yarn.factories.impl.pb.RpcServerFactoryPBImpl.getServer(RpcServerFactoryPBImpl.java:132)
at org.apache.hadoop.yarn.ipc.HadoopYarnProtoRPC.getServer(HadoopYarnProtoRPC.java:65)
at org.apache.hadoop.yarn.ipc.YarnRPC.getServer(YarnRPC.java:54)
at org.apache.hadoop.yarn.server.resourcemanager.ClientRMService.serviceStart(ClientRMService.java:219)
at org.apache.hadoop.service.AbstractService.start(AbstractService.java:193)
at org.apache.hadoop.service.CompositeService.serviceStart(CompositeService.java:120)
at org.apache.hadoop.yarn.server.resourcemanager.ResourceManager$RMActiveServices.serviceStart(ResourceManager.java:584)
at org.apache.hadoop.service.AbstractService.start(AbstractService.java:193)
at org.apache.hadoop.yarn.server.resourcemanager.ResourceManager.startActiveServices(ResourceManager.java:994)
at org.apache.hadoop.yarn.server.resourcemanager.ResourceManager$1.run(ResourceManager.java:1035)
at org.apache.hadoop.yarn.server.resourcemanager.ResourceManager$1.run(ResourceManager.java:1031)
at java.security.AccessController.doPrivileged(Native Method)
at javax.security.auth.Subject.doAs(Subject.java:415)
at org.apache.hadoop.security.UserGroupInformation.doAs(UserGroupInformation.java:1669)
at org.apache.hadoop.yarn.server.resourcemanager.ResourceManager.transitionToActive(ResourceManager.java:1031)
at org.apache.hadoop.yarn.server.resourcemanager.ResourceManager.serviceStart(ResourceManager.java:1071)
at org.apache.hadoop.service.AbstractService.start(AbstractService.java:193)
at org.apache.hadoop.yarn.server.resourcemanager.TestClientRMService.testGetNodeLabels(TestClientRMService.java:1408)
REGRESSION: org.apache.hadoop.yarn.server.resourcemanager.TestClientRMService.testGetLabelsToNodes
Error Message:
java.net.BindException: Problem binding to [0.0.0.0:8032] java.net.BindException: Address already in use; For more details see: http://wiki.apache.org/hadoop/BindException
Stack Trace:
org.apache.hadoop.yarn.exceptions.YarnRuntimeException: java.net.BindException: Problem binding to [0.0.0.0:8032] java.net.BindException: Address already in use; For more details see: http://wiki.apache.org/hadoop/BindException
at sun.nio.ch.Net.bind0(Native Method)
at sun.nio.ch.Net.bind(Net.java:444)
at sun.nio.ch.Net.bind(Net.java:436)
at sun.nio.ch.ServerSocketChannelImpl.bind(ServerSocketChannelImpl.java:214)
at sun.nio.ch.ServerSocketAdaptor.bind(ServerSocketAdaptor.java:74)
at org.apache.hadoop.ipc.Server.bind(Server.java:413)
at org.apache.hadoop.ipc.Server$Listener.<init>(Server.java:579)
at org.apache.hadoop.ipc.Server.<init>(Server.java:2308)
at org.apache.hadoop.ipc.RPC$Server.<init>(RPC.java:945)
at org.apache.hadoop.ipc.ProtobufRpcEngine$Server.<init>(ProtobufRpcEngine.java:534)
at org.apache.hadoop.ipc.ProtobufRpcEngine.getServer(ProtobufRpcEngine.java:509)
at org.apache.hadoop.ipc.RPC$Builder.build(RPC.java:787)
at org.apache.hadoop.yarn.factories.impl.pb.RpcServerFactoryPBImpl.createServer(RpcServerFactoryPBImpl.java:169)
at org.apache.hadoop.yarn.factories.impl.pb.RpcServerFactoryPBImpl.getServer(RpcServerFactoryPBImpl.java:132)
at org.apache.hadoop.yarn.ipc.HadoopYarnProtoRPC.getServer(HadoopYarnProtoRPC.java:65)
at org.apache.hadoop.yarn.ipc.YarnRPC.getServer(YarnRPC.java:54)
at org.apache.hadoop.yarn.server.resourcemanager.ClientRMService.serviceStart(ClientRMService.java:219)
at org.apache.hadoop.service.AbstractService.start(AbstractService.java:193)
at org.apache.hadoop.service.CompositeService.serviceStart(CompositeService.java:120)
at org.apache.hadoop.yarn.server.resourcemanager.ResourceManager$RMActiveServices.serviceStart(ResourceManager.java:584)
at org.apache.hadoop.service.AbstractService.start(AbstractService.java:193)
at org.apache.hadoop.yarn.server.resourcemanager.ResourceManager.startActiveServices(ResourceManager.java:994)
at org.apache.hadoop.yarn.server.resourcemanager.ResourceManager$1.run(ResourceManager.java:1035)
at org.apache.hadoop.yarn.server.resourcemanager.ResourceManager$1.run(ResourceManager.java:1031)
at java.security.AccessController.doPrivileged(Native Method)
at javax.security.auth.Subject.doAs(Subject.java:415)
at org.apache.hadoop.security.UserGroupInformation.doAs(UserGroupInformation.java:1669)
at org.apache.hadoop.yarn.server.resourcemanager.ResourceManager.transitionToActive(ResourceManager.java:1031)
at org.apache.hadoop.yarn.server.resourcemanager.ResourceManager.serviceStart(ResourceManager.java:1071)
at org.apache.hadoop.service.AbstractService.start(AbstractService.java:193)
at org.apache.hadoop.yarn.server.resourcemanager.TestClientRMService.testGetLabelsToNodes(TestClientRMService.java:1458)
REGRESSION: org.apache.hadoop.yarn.server.resourcemanager.TestClientRMService.testGetClusterNodes
Error Message:
java.net.BindException: Problem binding to [0.0.0.0:8032] java.net.BindException: Address already in use; For more details see: http://wiki.apache.org/hadoop/BindException
Stack Trace:
org.apache.hadoop.yarn.exceptions.YarnRuntimeException: java.net.BindException: Problem binding to [0.0.0.0:8032] java.net.BindException: Address already in use; For more details see: http://wiki.apache.org/hadoop/BindException
at sun.nio.ch.Net.bind0(Native Method)
at sun.nio.ch.Net.bind(Net.java:444)
at sun.nio.ch.Net.bind(Net.java:436)
at sun.nio.ch.ServerSocketChannelImpl.bind(ServerSocketChannelImpl.java:214)
at sun.nio.ch.ServerSocketAdaptor.bind(ServerSocketAdaptor.java:74)
at org.apache.hadoop.ipc.Server.bind(Server.java:413)
at org.apache.hadoop.ipc.Server$Listener.<init>(Server.java:579)
at org.apache.hadoop.ipc.Server.<init>(Server.java:2308)
at org.apache.hadoop.ipc.RPC$Server.<init>(RPC.java:945)
at org.apache.hadoop.ipc.ProtobufRpcEngine$Server.<init>(ProtobufRpcEngine.java:534)
at org.apache.hadoop.ipc.ProtobufRpcEngine.getServer(ProtobufRpcEngine.java:509)
at org.apache.hadoop.ipc.RPC$Builder.build(RPC.java:787)
at org.apache.hadoop.yarn.factories.impl.pb.RpcServerFactoryPBImpl.createServer(RpcServerFactoryPBImpl.java:169)
at org.apache.hadoop.yarn.factories.impl.pb.RpcServerFactoryPBImpl.getServer(RpcServerFactoryPBImpl.java:132)
at org.apache.hadoop.yarn.ipc.HadoopYarnProtoRPC.getServer(HadoopYarnProtoRPC.java:65)
at org.apache.hadoop.yarn.ipc.YarnRPC.getServer(YarnRPC.java:54)
at org.apache.hadoop.yarn.server.resourcemanager.ClientRMService.serviceStart(ClientRMService.java:219)
at org.apache.hadoop.service.AbstractService.start(AbstractService.java:193)
at org.apache.hadoop.service.CompositeService.serviceStart(CompositeService.java:120)
at org.apache.hadoop.yarn.server.resourcemanager.ResourceManager$RMActiveServices.serviceStart(ResourceManager.java:584)
at org.apache.hadoop.service.AbstractService.start(AbstractService.java:193)
at org.apache.hadoop.yarn.server.resourcemanager.ResourceManager.startActiveServices(ResourceManager.java:994)
at org.apache.hadoop.yarn.server.resourcemanager.ResourceManager$1.run(ResourceManager.java:1035)
at org.apache.hadoop.yarn.server.resourcemanager.ResourceManager$1.run(ResourceManager.java:1031)
at java.security.AccessController.doPrivileged(Native Method)
at javax.security.auth.Subject.doAs(Subject.java:415)
at org.apache.hadoop.security.UserGroupInformation.doAs(UserGroupInformation.java:1669)
at org.apache.hadoop.yarn.server.resourcemanager.ResourceManager.transitionToActive(ResourceManager.java:1031)
at org.apache.hadoop.yarn.server.resourcemanager.ResourceManager.serviceStart(ResourceManager.java:1071)
at org.apache.hadoop.service.AbstractService.start(AbstractService.java:193)
at org.apache.hadoop.yarn.server.resourcemanager.TestClientRMService.testGetClusterNodes(TestClientRMService.java:201)