You are viewing a plain text version of this content. The canonical link for it is here.
Posted to builds@solr.apache.org by Policeman Jenkins Server via builds <bu...@solr.apache.org> on 2026/05/10 06:25:52 UTC
[JENKINS] Solr-main-macOS (64bit/hotspot/jdk-21.0.7) - Build # 9069 - Unstable!
Build: https://jenkins.thetaphi.de/job/Solr-main-macOS/9069/
Java: 64bit/hotspot/jdk-21.0.7 -XX:-UseCompressedOops -XX:+UseG1GC
4 tests failed.
FAILED: org.apache.solr.cloud.TestCloudConsistency.testOutOfSyncReplicasCannotBecomeLeaderAfterRestart
Error Message:
java.lang.Exception: Test abandoned because suite timeout was reached.
Stack Trace:
java.lang.Exception: Test abandoned because suite timeout was reached.
at __randomizedtesting.SeedInfo.seed([A21D65A8272B0F5C]:0)
FAILED: org.apache.solr.cloud.TestCloudConsistency.classMethod
Error Message:
java.lang.Exception: Suite timeout exceeded (>= 7200000 msec).
Stack Trace:
java.lang.Exception: Suite timeout exceeded (>= 7200000 msec).
at __randomizedtesting.SeedInfo.seed([A21D65A8272B0F5C]:0)
FAILED: org.apache.solr.cloud.TestCloudConsistency.testOutOfSyncReplicasCannotBecomeLeaderAfterRestart
Error Message:
java.lang.Exception: Test abandoned because suite timeout was reached.
Stack Trace:
java.lang.Exception: Test abandoned because suite timeout was reached.
at __randomizedtesting.SeedInfo.seed([A21D65A8272B0F5C]:0)
FAILED: org.apache.solr.cloud.TestCloudConsistency.classMethod
Error Message:
java.lang.Exception: Suite timeout exceeded (>= 7200000 msec).
Stack Trace:
java.lang.Exception: Suite timeout exceeded (>= 7200000 msec).
at __randomizedtesting.SeedInfo.seed([A21D65A8272B0F5C]:0)