You are viewing a plain text version of this content. The canonical link for it is here.
Posted to dev@sling.apache.org by "Stefan Seifert (Jira)" <ji...@apache.org> on 2024/06/28 16:02:00 UTC

[jira] [Closed] (SLING-12273) Build breaks on Java 21, Update to Parent 60

     [ https://issues.apache.org/jira/browse/SLING-12273?page=com.atlassian.jira.plugin.system.issuetabpanels:all-tabpanel ]

Stefan Seifert closed SLING-12273.
----------------------------------

> Build breaks on Java 21, Update to Parent 60
> --------------------------------------------
>
>                 Key: SLING-12273
>                 URL: https://issues.apache.org/jira/browse/SLING-12273
>             Project: Sling
>          Issue Type: Improvement
>          Components: Sling Models
>    Affects Versions: Models API 1.5.0
>            Reporter: Konrad Windszus
>            Assignee: Konrad Windszus
>            Priority: Major
>             Fix For: Models API 1.5.2
>
>
> The following error is emitted in during building with Maven (https://ci-builds.apache.org/blue/organizations/jenkins/Sling%2Fmodules%2Fsling-org-apache-sling-models-api/detail/master/212/pipeline/)
> {code}
> [INFO] --- invoker:3.3.0:run (integration-test) @ org.apache.sling.models.api ---
> [INFO] Building: validating-annotation-processor/pom.xml
> [INFO] run post-build script verify.groovy
> [INFO]   BUG! exception in phase 'semantic analysis' in source unit 'Script1.groovy' Unsupported class file major version 65
> [INFO]           validating-annotation-processor/pom.xml .......... FAILED (15.5 s)
> [INFO] -------------------------------------------------
> [INFO] Build Summary:
> [INFO]   Passed: 0, Failed: 1, Errors: 0, Skipped: 0
> [INFO] -------------------------------------------------
> [ERROR] The following builds failed:
> [ERROR] *  validating-annotation-processor/pom.xml
> [INFO] -------------------------------------------------
> [INFO] ------------------------------------------------------------------------
> [INFO] BUILD FAILURE
> [INFO] ------------------------------------------------------------------------
> [INFO] Total time:  51.891 s
> [INFO] Finished at: 2024-03-15T23:26:49Z
> [INFO] ------------------------------------------------------------------------
> [INFO] [jenkins-event-spy] Generated /home/jenkins/workspace/g-apache-sling-models-api_master/jdk_21_latest@tmp/withMaven74374c80/maven-spy-20240315-232556-91012999432982760308630.log
> [ERROR] Failed to execute goal org.apache.maven.plugins:maven-invoker-plugin:3.3.0:run (integration-test) on project org.apache.sling.models.api: 1 build failed. See console output above for details. -> [Help 1]
> org.apache.maven.lifecycle.LifecycleExecutionException: Failed to execute goal org.apache.maven.plugins:maven-invoker-plugin:3.3.0:run (integration-test) on project org.apache.sling.models.api: 1 build failed. See console output above for details.
>     at org.apache.maven.lifecycle.internal.MojoExecutor.doExecute2 (MojoExecutor.java:333)
>     at org.apache.maven.lifecycle.internal.MojoExecutor.doExecute (MojoExecutor.java:316)
>     at org.apache.maven.lifecycle.internal.MojoExecutor.execute (MojoExecutor.java:212)
>     at org.apache.maven.lifecycle.internal.MojoExecutor.execute (MojoExecutor.java:174)
>     at org.apache.maven.lifecycle.internal.MojoExecutor.access$000 (MojoExecutor.java:75)
>     at org.apache.maven.lifecycle.internal.MojoExecutor$1.run (MojoExecutor.java:162)
>     at org.apache.maven.plugin.DefaultMojosExecutionStrategy.execute (DefaultMojosExecutionStrategy.java:39)
>     at org.apache.maven.lifecycle.internal.MojoExecutor.execute (MojoExecutor.java:159)
>     at org.apache.maven.lifecycle.internal.LifecycleModuleBuilder.buildProject (LifecycleModuleBuilder.java:105)
>     at org.apache.maven.lifecycle.internal.LifecycleModuleBuilder.buildProject (LifecycleModuleBuilder.java:73)
>     at org.apache.maven.lifecycle.internal.builder.singlethreaded.SingleThreadedBuilder.build (SingleThreadedBuilder.java:53)
>     at org.apache.maven.lifecycle.internal.LifecycleStarter.execute (LifecycleStarter.java:118)
>     at org.apache.maven.DefaultMaven.doExecute (DefaultMaven.java:261)
>     at org.apache.maven.DefaultMaven.doExecute (DefaultMaven.java:173)
>     at org.apache.maven.DefaultMaven.execute (DefaultMaven.java:101)
>     at org.apache.maven.cli.MavenCli.execute (MavenCli.java:906)
>     at org.apache.maven.cli.MavenCli.doMain (MavenCli.java:283)
>     at org.apache.maven.cli.MavenCli.main (MavenCli.java:206)
>     at jdk.internal.reflect.DirectMethodHandleAccessor.invoke (DirectMethodHandleAccessor.java:103)
>     at java.lang.reflect.Method.invoke (Method.java:580)
>     at org.codehaus.plexus.classworlds.launcher.Launcher.launchEnhanced (Launcher.java:283)
>     at org.codehaus.plexus.classworlds.launcher.Launcher.launch (Launcher.java:226)
>     at org.codehaus.plexus.classworlds.launcher.Launcher.mainWithExitCode (Launcher.java:407)
>     at org.codehaus.plexus.classworlds.launcher.Launcher.main (Launcher.java:348)
> Caused by: org.apache.maven.plugin.MojoFailureException: 1 build failed. See console output above for details.
>     at org.apache.maven.plugins.invoker.InvokerSession.handleFailures (InvokerSession.java:285)
>     at org.apache.maven.plugins.invoker.InvokerMojo.processResults (InvokerMojo.java:81)
>     at org.apache.maven.plugins.invoker.AbstractInvokerMojo.execute (AbstractInvokerMojo.java:876)
>     at org.apache.maven.plugin.DefaultBuildPluginManager.executeMojo (DefaultBuildPluginManager.java:126)
>     at org.apache.maven.lifecycle.internal.MojoExecutor.doExecute2 (MojoExecutor.java:328)
>     at org.apache.maven.lifecycle.internal.MojoExecutor.doExecute (MojoExecutor.java:316)
>     at org.apache.maven.lifecycle.internal.MojoExecutor.execute (MojoExecutor.java:212)
>     at org.apache.maven.lifecycle.internal.MojoExecutor.execute (MojoExecutor.java:174)
>     at org.apache.maven.lifecycle.internal.MojoExecutor.access$000 (MojoExecutor.java:75)
>     at org.apache.maven.lifecycle.internal.MojoExecutor$1.run (MojoExecutor.java:162)
>     at org.apache.maven.plugin.DefaultMojosExecutionStrategy.execute (DefaultMojosExecutionStrategy.java:39)
>     at org.apache.maven.lifecycle.internal.MojoExecutor.execute (MojoExecutor.java:159)
>     at org.apache.maven.lifecycle.internal.LifecycleModuleBuilder.buildProject (LifecycleModuleBuilder.java:105)
>     at org.apache.maven.lifecycle.internal.LifecycleModuleBuilder.buildProject (LifecycleModuleBuilder.java:73)
>     at org.apache.maven.lifecycle.internal.builder.singlethreaded.SingleThreadedBuilder.build (SingleThreadedBuilder.java:53)
>     at org.apache.maven.lifecycle.internal.LifecycleStarter.execute (LifecycleStarter.java:118)
>     at org.apache.maven.DefaultMaven.doExecute (DefaultMaven.java:261)
>     at org.apache.maven.DefaultMaven.doExecute (DefaultMaven.java:173)
>     at org.apache.maven.DefaultMaven.execute (DefaultMaven.java:101)
>     at org.apache.maven.cli.MavenCli.execute (MavenCli.java:906)
>     at org.apache.maven.cli.MavenCli.doMain (MavenCli.java:283)
>     at org.apache.maven.cli.MavenCli.main (MavenCli.java:206)
>     at jdk.internal.reflect.DirectMethodHandleAccessor.invoke (DirectMethodHandleAccessor.java:103)
>     at java.lang.reflect.Method.invoke (Method.java:580)
>     at org.codehaus.plexus.classworlds.launcher.Launcher.launchEnhanced (Launcher.java:283)
>     at org.codehaus.plexus.classworlds.launcher.Launcher.launch (Launcher.java:226)
>     at org.codehaus.plexus.classworlds.launcher.Launcher.mainWithExitCode (Launcher.java:407)
>     at org.codehaus.plexus.classworlds.launcher.Launcher.main (Launcher.java:348)
> [ERROR] 
> [ERROR] Re-run Maven using the -X switch to enable full debug logging.
> [ERROR] 
> [ERROR] For more information about the errors and possible solutions, please read the following articles:
> [ERROR] [Help 1] http://cwiki.apache.org/confluence/display/MAVEN/MojoFailureException
> script returned exit code 1
> {code}
> This requires a newer version of the maven-invoker-plugin.



--
This message was sent by Atlassian Jira
(v8.20.10#820010)