You are viewing a plain text version of this content. The canonical link for it is here.
Posted to dev@zookeeper.apache.org by Apache Jenkins Server <je...@builds.apache.org> on 2011/12/12 09:02:03 UTC
ZooKeeper_branch34_solaris - Build # 46 - Still Failing
See https://builds.apache.org/job/ZooKeeper_branch34_solaris/46/
###################################################################################
########################## LAST 60 LINES OF THE CONSOLE ###########################
[...truncated 131986 lines...]
[junit] 2011-12-12 08:00:12,061 [myid:] - INFO [main:JMXEnv@105] - expect:InMemoryDataTree
[junit] 2011-12-12 08:00:12,062 [myid:] - INFO [main:JMXEnv@108] - found:InMemoryDataTree org.apache.ZooKeeperService:name0=StandaloneServer_port-1,name1=InMemoryDataTree
[junit] 2011-12-12 08:00:12,062 [myid:] - INFO [main:JMXEnv@105] - expect:StandaloneServer_port
[junit] 2011-12-12 08:00:12,063 [myid:] - INFO [main:JMXEnv@108] - found:StandaloneServer_port org.apache.ZooKeeperService:name0=StandaloneServer_port-1
[junit] 2011-12-12 08:00:12,063 [myid:] - INFO [main:ClientBase@435] - STOPPING server
[junit] 2011-12-12 08:00:12,065 [myid:] - INFO [main:ZooKeeperServer@420] - shutting down
[junit] 2011-12-12 08:00:12,066 [myid:] - INFO [main:SessionTrackerImpl@220] - Shutting down
[junit] 2011-12-12 08:00:12,066 [myid:] - INFO [main:PrepRequestProcessor@733] - Shutting down
[junit] 2011-12-12 08:00:12,067 [myid:] - INFO [main:SyncRequestProcessor@173] - Shutting down
[junit] 2011-12-12 08:00:12,067 [myid:] - INFO [ProcessThread(sid:0 cport:-1)::PrepRequestProcessor@135] - PrepRequestProcessor exited loop!
[junit] 2011-12-12 08:00:12,068 [myid:] - INFO [SyncThread:0:SyncRequestProcessor@155] - SyncRequestProcessor exited!
[junit] 2011-12-12 08:00:12,068 [myid:] - INFO [main:FinalRequestProcessor@423] - shutdown of request processor complete
[junit] 2011-12-12 08:00:12,069 [myid:] - INFO [main:ClientBase@227] - connecting to 127.0.0.1 11221
[junit] 2011-12-12 08:00:12,070 [myid:] - INFO [main:JMXEnv@133] - ensureOnly:[]
[junit] 2011-12-12 08:00:12,072 [myid:] - INFO [main:ClientBase@428] - STARTING server
[junit] 2011-12-12 08:00:12,072 [myid:] - INFO [main:ZooKeeperServer@168] - Created server with tickTime 3000 minSessionTimeout 6000 maxSessionTimeout 60000 datadir /zonestorage/hudson_solaris/home/hudson/hudson-slave/workspace/ZooKeeper_branch34_solaris/trunk/build/test/tmp/test8188688466996257561.junit.dir/version-2 snapdir /zonestorage/hudson_solaris/home/hudson/hudson-slave/workspace/ZooKeeper_branch34_solaris/trunk/build/test/tmp/test8188688466996257561.junit.dir/version-2
[junit] 2011-12-12 08:00:12,073 [myid:] - INFO [main:NIOServerCnxnFactory@110] - binding to port 0.0.0.0/0.0.0.0:11221
[junit] 2011-12-12 08:00:12,075 [myid:] - INFO [main:FileSnap@83] - Reading snapshot /zonestorage/hudson_solaris/home/hudson/hudson-slave/workspace/ZooKeeper_branch34_solaris/trunk/build/test/tmp/test8188688466996257561.junit.dir/version-2/snapshot.b
[junit] 2011-12-12 08:00:12,077 [myid:] - INFO [main:FileTxnSnapLog@236] - Snapshotting: b
[junit] 2011-12-12 08:00:12,079 [myid:] - INFO [main:ClientBase@227] - connecting to 127.0.0.1 11221
[junit] 2011-12-12 08:00:12,080 [myid:] - INFO [NIOServerCxn.Factory:0.0.0.0/0.0.0.0:11221:NIOServerCnxnFactory@213] - Accepted socket connection from /127.0.0.1:33522
[junit] 2011-12-12 08:00:12,080 [myid:] - INFO [NIOServerCxn.Factory:0.0.0.0/0.0.0.0:11221:NIOServerCnxn@820] - Processing stat command from /127.0.0.1:33522
[junit] 2011-12-12 08:00:12,081 [myid:] - INFO [Thread-5:NIOServerCnxn$StatCommand@655] - Stat command output
[junit] 2011-12-12 08:00:12,081 [myid:] - INFO [Thread-5:NIOServerCnxn@1000] - Closed socket connection for client /127.0.0.1:33522 (no session established for client)
[junit] 2011-12-12 08:00:12,082 [myid:] - INFO [main:JMXEnv@133] - ensureOnly:[InMemoryDataTree, StandaloneServer_port]
[junit] 2011-12-12 08:00:12,083 [myid:] - INFO [main:JMXEnv@105] - expect:InMemoryDataTree
[junit] 2011-12-12 08:00:12,084 [myid:] - INFO [main:JMXEnv@108] - found:InMemoryDataTree org.apache.ZooKeeperService:name0=StandaloneServer_port-1,name1=InMemoryDataTree
[junit] 2011-12-12 08:00:12,085 [myid:] - INFO [main:JMXEnv@105] - expect:StandaloneServer_port
[junit] 2011-12-12 08:00:12,085 [myid:] - INFO [main:JMXEnv@108] - found:StandaloneServer_port org.apache.ZooKeeperService:name0=StandaloneServer_port-1
[junit] 2011-12-12 08:00:12,086 [myid:] - INFO [main:JUnit4ZKTestRunner$LoggedInvokeMethod@57] - FINISHED TEST METHOD testQuota
[junit] 2011-12-12 08:00:12,086 [myid:] - INFO [main:ClientBase@465] - tearDown starting
[junit] 2011-12-12 08:00:12,151 [myid:] - INFO [main:ZooKeeper@679] - Session: 0x134314941860000 closed
[junit] 2011-12-12 08:00:12,152 [myid:] - INFO [main:ClientBase@435] - STOPPING server
[junit] 2011-12-12 08:00:12,151 [myid:] - INFO [main-EventThread:ClientCnxn$EventThread@511] - EventThread shut down
[junit] 2011-12-12 08:00:12,153 [myid:] - INFO [main:ZooKeeperServer@420] - shutting down
[junit] 2011-12-12 08:00:12,154 [myid:] - INFO [main:SessionTrackerImpl@220] - Shutting down
[junit] 2011-12-12 08:00:12,155 [myid:] - INFO [main:PrepRequestProcessor@733] - Shutting down
[junit] 2011-12-12 08:00:12,155 [myid:] - INFO [main:SyncRequestProcessor@173] - Shutting down
[junit] 2011-12-12 08:00:12,155 [myid:] - INFO [ProcessThread(sid:0 cport:-1)::PrepRequestProcessor@135] - PrepRequestProcessor exited loop!
[junit] 2011-12-12 08:00:12,156 [myid:] - INFO [SyncThread:0:SyncRequestProcessor@155] - SyncRequestProcessor exited!
[junit] 2011-12-12 08:00:12,158 [myid:] - INFO [main:FinalRequestProcessor@423] - shutdown of request processor complete
[junit] 2011-12-12 08:00:12,159 [myid:] - INFO [main:ClientBase@227] - connecting to 127.0.0.1 11221
[junit] 2011-12-12 08:00:12,160 [myid:] - INFO [main:JMXEnv@133] - ensureOnly:[]
[junit] 2011-12-12 08:00:12,164 [myid:] - INFO [main:ClientBase@493] - fdcount after test is: 42 at start it was 28
[junit] 2011-12-12 08:00:12,165 [myid:] - INFO [main:ClientBase@495] - sleeping for 20 secs
[junit] 2011-12-12 08:00:12,166 [myid:] - INFO [main:ZKTestCase$1@60] - SUCCEEDED testQuota
[junit] 2011-12-12 08:00:12,167 [myid:] - INFO [main:ZKTestCase$1@55] - FINISHED testQuota
[junit] Tests run: 1, Failures: 0, Errors: 0, Time elapsed: 0.983 sec
BUILD FAILED
/zonestorage/hudson_solaris/home/hudson/hudson-slave/workspace/ZooKeeper_branch34_solaris/trunk/build.xml:1199: Tests failed!
Total time: 20 minutes 36 seconds
Build step 'Invoke Ant' marked build as failure
[locks-and-latches] Releasing all the locks
[locks-and-latches] All the locks released
Recording test results
Email was triggered for: Failure
Sending email for trigger: Failure
###################################################################################
############################## FAILED TESTS (if any) ##############################
1 tests failed.
REGRESSION: org.apache.zookeeper.test.ZkDatabaseCorruptionTest.testCorruption
Error Message:
KeeperErrorCode = ConnectionLoss for /0-0
Stack Trace:
org.apache.zookeeper.KeeperException$ConnectionLossException: KeeperErrorCode = ConnectionLoss for /0-0
at org.apache.zookeeper.KeeperException.create(KeeperException.java:99)
at org.apache.zookeeper.KeeperException.create(KeeperException.java:51)
at org.apache.zookeeper.ZooKeeper.create(ZooKeeper.java:778)
at org.apache.zookeeper.test.ZkDatabaseCorruptionTest.testCorruption(ZkDatabaseCorruptionTest.java:83)
at org.apache.zookeeper.JUnit4ZKTestRunner$LoggedInvokeMethod.evaluate(JUnit4ZKTestRunner.java:52)
ZooKeeper_branch34_solaris - Build # 47 - Still Failing
Posted by Apache Jenkins Server <je...@builds.apache.org>.
See https://builds.apache.org/job/ZooKeeper_branch34_solaris/47/
###################################################################################
########################## LAST 60 LINES OF THE CONSOLE ###########################
[...truncated 135182 lines...]
[junit] 2011-12-13 08:19:57,371 [myid:] - INFO [main:JMXEnv@105] - expect:InMemoryDataTree
[junit] 2011-12-13 08:19:57,371 [myid:] - INFO [main:JMXEnv@108] - found:InMemoryDataTree org.apache.ZooKeeperService:name0=StandaloneServer_port-1,name1=InMemoryDataTree
[junit] 2011-12-13 08:19:57,371 [myid:] - INFO [main:JMXEnv@105] - expect:StandaloneServer_port
[junit] 2011-12-13 08:19:57,372 [myid:] - INFO [main:JMXEnv@108] - found:StandaloneServer_port org.apache.ZooKeeperService:name0=StandaloneServer_port-1
[junit] 2011-12-13 08:19:57,373 [myid:] - INFO [main:ClientBase@435] - STOPPING server
[junit] 2011-12-13 08:19:57,373 [myid:] - INFO [main:ZooKeeperServer@420] - shutting down
[junit] 2011-12-13 08:19:57,374 [myid:] - INFO [main:SessionTrackerImpl@220] - Shutting down
[junit] 2011-12-13 08:19:57,375 [myid:] - INFO [main:PrepRequestProcessor@733] - Shutting down
[junit] 2011-12-13 08:19:57,375 [myid:] - INFO [main:SyncRequestProcessor@173] - Shutting down
[junit] 2011-12-13 08:19:57,375 [myid:] - INFO [ProcessThread(sid:0 cport:-1)::PrepRequestProcessor@135] - PrepRequestProcessor exited loop!
[junit] 2011-12-13 08:19:57,376 [myid:] - INFO [SyncThread:0:SyncRequestProcessor@155] - SyncRequestProcessor exited!
[junit] 2011-12-13 08:19:57,377 [myid:] - INFO [main:FinalRequestProcessor@423] - shutdown of request processor complete
[junit] 2011-12-13 08:19:57,378 [myid:] - INFO [main:ClientBase@227] - connecting to 127.0.0.1 11221
[junit] 2011-12-13 08:19:57,379 [myid:] - INFO [main:JMXEnv@133] - ensureOnly:[]
[junit] 2011-12-13 08:19:57,380 [myid:] - INFO [main:ClientBase@428] - STARTING server
[junit] 2011-12-13 08:19:57,381 [myid:] - INFO [main:ZooKeeperServer@168] - Created server with tickTime 3000 minSessionTimeout 6000 maxSessionTimeout 60000 datadir /zonestorage/hudson_solaris/home/hudson/hudson-slave/workspace/ZooKeeper_branch34_solaris/trunk/build/test/tmp/test309724259935923256.junit.dir/version-2 snapdir /zonestorage/hudson_solaris/home/hudson/hudson-slave/workspace/ZooKeeper_branch34_solaris/trunk/build/test/tmp/test309724259935923256.junit.dir/version-2
[junit] 2011-12-13 08:19:57,382 [myid:] - INFO [main:NIOServerCnxnFactory@110] - binding to port 0.0.0.0/0.0.0.0:11221
[junit] 2011-12-13 08:19:57,383 [myid:] - INFO [main:FileSnap@83] - Reading snapshot /zonestorage/hudson_solaris/home/hudson/hudson-slave/workspace/ZooKeeper_branch34_solaris/trunk/build/test/tmp/test309724259935923256.junit.dir/version-2/snapshot.b
[junit] 2011-12-13 08:19:57,385 [myid:] - INFO [main:FileTxnSnapLog@236] - Snapshotting: b
[junit] 2011-12-13 08:19:57,387 [myid:] - INFO [main:ClientBase@227] - connecting to 127.0.0.1 11221
[junit] 2011-12-13 08:19:57,388 [myid:] - INFO [NIOServerCxn.Factory:0.0.0.0/0.0.0.0:11221:NIOServerCnxnFactory@213] - Accepted socket connection from /127.0.0.1:46441
[junit] 2011-12-13 08:19:57,389 [myid:] - INFO [NIOServerCxn.Factory:0.0.0.0/0.0.0.0:11221:NIOServerCnxn@820] - Processing stat command from /127.0.0.1:46441
[junit] 2011-12-13 08:19:57,390 [myid:] - INFO [Thread-5:NIOServerCnxn$StatCommand@655] - Stat command output
[junit] 2011-12-13 08:19:57,390 [myid:] - INFO [Thread-5:NIOServerCnxn@1000] - Closed socket connection for client /127.0.0.1:46441 (no session established for client)
[junit] 2011-12-13 08:19:57,391 [myid:] - INFO [main:JMXEnv@133] - ensureOnly:[InMemoryDataTree, StandaloneServer_port]
[junit] 2011-12-13 08:19:57,392 [myid:] - INFO [main:JMXEnv@105] - expect:InMemoryDataTree
[junit] 2011-12-13 08:19:57,393 [myid:] - INFO [main:JMXEnv@108] - found:InMemoryDataTree org.apache.ZooKeeperService:name0=StandaloneServer_port-1,name1=InMemoryDataTree
[junit] 2011-12-13 08:19:57,393 [myid:] - INFO [main:JMXEnv@105] - expect:StandaloneServer_port
[junit] 2011-12-13 08:19:57,394 [myid:] - INFO [main:JMXEnv@108] - found:StandaloneServer_port org.apache.ZooKeeperService:name0=StandaloneServer_port-1
[junit] 2011-12-13 08:19:57,394 [myid:] - INFO [main:JUnit4ZKTestRunner$LoggedInvokeMethod@57] - FINISHED TEST METHOD testQuota
[junit] 2011-12-13 08:19:57,395 [myid:] - INFO [main:ClientBase@465] - tearDown starting
[junit] 2011-12-13 08:19:57,450 [myid:] - INFO [main:ZooKeeper@679] - Session: 0x1343681b49f0000 closed
[junit] 2011-12-13 08:19:57,450 [myid:] - INFO [main-EventThread:ClientCnxn$EventThread@511] - EventThread shut down
[junit] 2011-12-13 08:19:57,451 [myid:] - INFO [main:ClientBase@435] - STOPPING server
[junit] 2011-12-13 08:19:57,452 [myid:] - INFO [main:ZooKeeperServer@420] - shutting down
[junit] 2011-12-13 08:19:57,453 [myid:] - INFO [main:SessionTrackerImpl@220] - Shutting down
[junit] 2011-12-13 08:19:57,453 [myid:] - INFO [main:PrepRequestProcessor@733] - Shutting down
[junit] 2011-12-13 08:19:57,454 [myid:] - INFO [main:SyncRequestProcessor@173] - Shutting down
[junit] 2011-12-13 08:19:57,454 [myid:] - INFO [ProcessThread(sid:0 cport:-1)::PrepRequestProcessor@135] - PrepRequestProcessor exited loop!
[junit] 2011-12-13 08:19:57,454 [myid:] - INFO [SyncThread:0:SyncRequestProcessor@155] - SyncRequestProcessor exited!
[junit] 2011-12-13 08:19:57,455 [myid:] - INFO [main:FinalRequestProcessor@423] - shutdown of request processor complete
[junit] 2011-12-13 08:19:57,456 [myid:] - INFO [main:ClientBase@227] - connecting to 127.0.0.1 11221
[junit] 2011-12-13 08:19:57,457 [myid:] - INFO [main:JMXEnv@133] - ensureOnly:[]
[junit] 2011-12-13 08:19:57,460 [myid:] - INFO [main:ClientBase@493] - fdcount after test is: 42 at start it was 28
[junit] 2011-12-13 08:19:57,461 [myid:] - INFO [main:ClientBase@495] - sleeping for 20 secs
[junit] 2011-12-13 08:19:57,462 [myid:] - INFO [main:ZKTestCase$1@60] - SUCCEEDED testQuota
[junit] 2011-12-13 08:19:57,462 [myid:] - INFO [main:ZKTestCase$1@55] - FINISHED testQuota
[junit] Tests run: 1, Failures: 0, Errors: 0, Time elapsed: 0.714 sec
BUILD FAILED
/zonestorage/hudson_solaris/home/hudson/hudson-slave/workspace/ZooKeeper_branch34_solaris/trunk/build.xml:1199: Tests failed!
Total time: 24 minutes 8 seconds
Build step 'Invoke Ant' marked build as failure
[locks-and-latches] Releasing all the locks
[locks-and-latches] All the locks released
Recording test results
Email was triggered for: Failure
Sending email for trigger: Failure
###################################################################################
############################## FAILED TESTS (if any) ##############################
1 tests failed.
REGRESSION: org.apache.zookeeper.test.LETest.testLE
Error Message:
Threads didn't join
Stack Trace:
junit.framework.AssertionFailedError: Threads didn't join
at org.apache.zookeeper.test.LETest.testLE(LETest.java:122)
at org.apache.zookeeper.JUnit4ZKTestRunner$LoggedInvokeMethod.evaluate(JUnit4ZKTestRunner.java:52)