You are viewing a plain text version of this content. The canonical link for it is here.
Posted to dev@kafka.apache.org by Apache Jenkins Server <je...@builds.apache.org> on 2019/06/20 00:10:44 UTC
Build failed in Jenkins: kafka-2.2-jdk8 #140
See <https://builds.apache.org/job/kafka-2.2-jdk8/140/display/redirect?page=changes>
Changes:
[jason] KAFKA-8564; Fix NPE on deleted partition dir when no segments remain
------------------------------------------
[...truncated 2.75 MB...]
kafka.controller.PartitionLeaderElectionAlgorithmsTest > testOfflinePartitionLeaderElectionLastIsrOfflineUncleanLeaderElectionEnabled STARTED
kafka.controller.PartitionLeaderElectionAlgorithmsTest > testOfflinePartitionLeaderElectionLastIsrOfflineUncleanLeaderElectionEnabled PASSED
kafka.controller.PartitionLeaderElectionAlgorithmsTest > testPreferredReplicaPartitionLeaderElectionPreferredReplicaNotInIsrNotLive STARTED
kafka.controller.PartitionLeaderElectionAlgorithmsTest > testPreferredReplicaPartitionLeaderElectionPreferredReplicaNotInIsrNotLive PASSED
kafka.controller.PartitionLeaderElectionAlgorithmsTest > testOfflinePartitionLeaderElectionLastIsrOfflineUncleanLeaderElectionDisabled STARTED
kafka.controller.PartitionLeaderElectionAlgorithmsTest > testOfflinePartitionLeaderElectionLastIsrOfflineUncleanLeaderElectionDisabled PASSED
kafka.controller.PartitionStateMachineTest > testNonexistentPartitionToNewPartitionTransition STARTED
kafka.controller.PartitionStateMachineTest > testNonexistentPartitionToNewPartitionTransition PASSED
kafka.controller.PartitionStateMachineTest > testNewPartitionToOnlinePartitionTransitionErrorCodeFromCreateStates STARTED
kafka.controller.PartitionStateMachineTest > testNewPartitionToOnlinePartitionTransitionErrorCodeFromCreateStates PASSED
kafka.controller.PartitionStateMachineTest > testOfflinePartitionToNonexistentPartitionTransition STARTED
kafka.controller.PartitionStateMachineTest > testOfflinePartitionToNonexistentPartitionTransition PASSED
kafka.controller.PartitionStateMachineTest > testOnlinePartitionToOfflineTransition STARTED
kafka.controller.PartitionStateMachineTest > testOnlinePartitionToOfflineTransition PASSED
kafka.controller.PartitionStateMachineTest > testNewPartitionToOfflinePartitionTransition STARTED
kafka.controller.PartitionStateMachineTest > testNewPartitionToOfflinePartitionTransition PASSED
kafka.controller.PartitionStateMachineTest > testUpdatingOfflinePartitionsCount STARTED
kafka.controller.PartitionStateMachineTest > testUpdatingOfflinePartitionsCount PASSED
kafka.controller.PartitionStateMachineTest > testInvalidNonexistentPartitionToOnlinePartitionTransition STARTED
kafka.controller.PartitionStateMachineTest > testInvalidNonexistentPartitionToOnlinePartitionTransition PASSED
kafka.controller.PartitionStateMachineTest > testInvalidNonexistentPartitionToOfflinePartitionTransition STARTED
kafka.controller.PartitionStateMachineTest > testInvalidNonexistentPartitionToOfflinePartitionTransition PASSED
kafka.controller.PartitionStateMachineTest > testOnlinePartitionToOnlineTransition STARTED
kafka.controller.PartitionStateMachineTest > testOnlinePartitionToOnlineTransition PASSED
kafka.controller.PartitionStateMachineTest > testNewPartitionToOnlinePartitionTransitionZkUtilsExceptionFromCreateStates STARTED
kafka.controller.PartitionStateMachineTest > testNewPartitionToOnlinePartitionTransitionZkUtilsExceptionFromCreateStates PASSED
kafka.controller.PartitionStateMachineTest > testInvalidNewPartitionToNonexistentPartitionTransition STARTED
kafka.controller.PartitionStateMachineTest > testInvalidNewPartitionToNonexistentPartitionTransition PASSED
kafka.controller.PartitionStateMachineTest > testNewPartitionToOnlinePartitionTransition STARTED
kafka.controller.PartitionStateMachineTest > testNewPartitionToOnlinePartitionTransition PASSED
kafka.controller.PartitionStateMachineTest > testInvalidOnlinePartitionToNewPartitionTransition STARTED
kafka.controller.PartitionStateMachineTest > testInvalidOnlinePartitionToNewPartitionTransition PASSED
kafka.controller.PartitionStateMachineTest > testUpdatingOfflinePartitionsCountDuringTopicDeletion STARTED
kafka.controller.PartitionStateMachineTest > testUpdatingOfflinePartitionsCountDuringTopicDeletion PASSED
kafka.controller.PartitionStateMachineTest > testOfflinePartitionToOnlinePartitionTransitionErrorCodeFromStateLookup STARTED
kafka.controller.PartitionStateMachineTest > testOfflinePartitionToOnlinePartitionTransitionErrorCodeFromStateLookup PASSED
kafka.controller.PartitionStateMachineTest > testOnlinePartitionToOnlineTransitionForControlledShutdown STARTED
kafka.controller.PartitionStateMachineTest > testOnlinePartitionToOnlineTransitionForControlledShutdown PASSED
kafka.controller.PartitionStateMachineTest > testOfflinePartitionToOnlinePartitionTransitionZkUtilsExceptionFromStateLookup STARTED
kafka.controller.PartitionStateMachineTest > testOfflinePartitionToOnlinePartitionTransitionZkUtilsExceptionFromStateLookup PASSED
kafka.controller.PartitionStateMachineTest > testNoOfflinePartitionsChangeForTopicsBeingDeleted STARTED
kafka.controller.PartitionStateMachineTest > testNoOfflinePartitionsChangeForTopicsBeingDeleted PASSED
kafka.controller.PartitionStateMachineTest > testInvalidOnlinePartitionToNonexistentPartitionTransition STARTED
kafka.controller.PartitionStateMachineTest > testInvalidOnlinePartitionToNonexistentPartitionTransition PASSED
kafka.controller.PartitionStateMachineTest > testInvalidOfflinePartitionToNewPartitionTransition STARTED
kafka.controller.PartitionStateMachineTest > testInvalidOfflinePartitionToNewPartitionTransition PASSED
kafka.controller.PartitionStateMachineTest > testOfflinePartitionToOnlinePartitionTransition STARTED
kafka.controller.PartitionStateMachineTest > testOfflinePartitionToOnlinePartitionTransition PASSED
kafka.controller.ControllerFailoverTest > testHandleIllegalStateException STARTED
kafka.controller.ControllerFailoverTest > testHandleIllegalStateException PASSED
kafka.controller.ControllerIntegrationTest > testControllerDetectsBouncedBrokers STARTED
kafka.controller.ControllerIntegrationTest > testControllerDetectsBouncedBrokers PASSED
kafka.controller.ControllerIntegrationTest > testControlledShutdown STARTED
kafka.controller.ControllerIntegrationTest > testControlledShutdown PASSED
kafka.controller.ControllerIntegrationTest > testPartitionReassignmentWithOfflineReplicaHaltingProgress STARTED
kafka.controller.ControllerIntegrationTest > testPartitionReassignmentWithOfflineReplicaHaltingProgress PASSED
kafka.controller.ControllerIntegrationTest > testControllerEpochPersistsWhenAllBrokersDown STARTED
kafka.controller.ControllerIntegrationTest > testControllerEpochPersistsWhenAllBrokersDown PASSED
kafka.controller.ControllerIntegrationTest > testTopicCreationWithOfflineReplica STARTED
kafka.controller.ControllerIntegrationTest > testTopicCreationWithOfflineReplica PASSED
kafka.controller.ControllerIntegrationTest > testPartitionReassignmentResumesAfterReplicaComesOnline STARTED
kafka.controller.ControllerIntegrationTest > testPartitionReassignmentResumesAfterReplicaComesOnline PASSED
kafka.controller.ControllerIntegrationTest > testLeaderAndIsrWhenEntireIsrOfflineAndUncleanLeaderElectionDisabled STARTED
kafka.controller.ControllerIntegrationTest > testLeaderAndIsrWhenEntireIsrOfflineAndUncleanLeaderElectionDisabled PASSED
kafka.controller.ControllerIntegrationTest > testTopicPartitionExpansionWithOfflineReplica STARTED
kafka.controller.ControllerIntegrationTest > testTopicPartitionExpansionWithOfflineReplica PASSED
kafka.controller.ControllerIntegrationTest > testPreferredReplicaLeaderElectionWithOfflinePreferredReplica STARTED
kafka.controller.ControllerIntegrationTest > testPreferredReplicaLeaderElectionWithOfflinePreferredReplica PASSED
kafka.controller.ControllerIntegrationTest > testMetadataPropagationOnControlPlane STARTED
kafka.controller.ControllerIntegrationTest > testMetadataPropagationOnControlPlane PASSED
kafka.controller.ControllerIntegrationTest > testAutoPreferredReplicaLeaderElection STARTED
kafka.controller.ControllerIntegrationTest > testAutoPreferredReplicaLeaderElection PASSED
kafka.controller.ControllerIntegrationTest > testTopicCreation STARTED
kafka.controller.ControllerIntegrationTest > testTopicCreation PASSED
kafka.controller.ControllerIntegrationTest > testControllerMoveOnTopicDeletion STARTED
kafka.controller.ControllerIntegrationTest > testControllerMoveOnTopicDeletion PASSED
kafka.controller.ControllerIntegrationTest > testPartitionReassignment STARTED
kafka.controller.ControllerIntegrationTest > testPartitionReassignment PASSED
kafka.controller.ControllerIntegrationTest > testTopicPartitionExpansion STARTED
kafka.controller.ControllerIntegrationTest > testTopicPartitionExpansion PASSED
kafka.controller.ControllerIntegrationTest > testControllerMoveIncrementsControllerEpoch STARTED
kafka.controller.ControllerIntegrationTest > testControllerMoveIncrementsControllerEpoch PASSED
kafka.controller.ControllerIntegrationTest > testLeaderAndIsrWhenEntireIsrOfflineAndUncleanLeaderElectionEnabled STARTED
kafka.controller.ControllerIntegrationTest > testLeaderAndIsrWhenEntireIsrOfflineAndUncleanLeaderElectionEnabled PASSED
kafka.controller.ControllerIntegrationTest > testControllerMoveOnPartitionReassignment STARTED
kafka.controller.ControllerIntegrationTest > testControllerMoveOnPartitionReassignment PASSED
kafka.controller.ControllerIntegrationTest > testControllerMoveOnTopicCreation STARTED
kafka.controller.ControllerIntegrationTest > testControllerMoveOnTopicCreation PASSED
kafka.controller.ControllerIntegrationTest > testControllerRejectControlledShutdownRequestWithStaleBrokerEpoch STARTED
kafka.controller.ControllerIntegrationTest > testControllerRejectControlledShutdownRequestWithStaleBrokerEpoch PASSED
kafka.controller.ControllerIntegrationTest > testBackToBackPreferredReplicaLeaderElections STARTED
kafka.controller.ControllerIntegrationTest > testBackToBackPreferredReplicaLeaderElections PASSED
kafka.controller.ControllerIntegrationTest > testEmptyCluster STARTED
kafka.controller.ControllerIntegrationTest > testEmptyCluster PASSED
kafka.controller.ControllerIntegrationTest > testControllerMoveOnPreferredReplicaElection STARTED
kafka.controller.ControllerIntegrationTest > testControllerMoveOnPreferredReplicaElection PASSED
kafka.controller.ControllerIntegrationTest > testPreferredReplicaLeaderElection STARTED
kafka.controller.ControllerIntegrationTest > testPreferredReplicaLeaderElection PASSED
kafka.controller.ControllerIntegrationTest > testMetadataPropagationOnBrokerChange STARTED
kafka.controller.ControllerIntegrationTest > testMetadataPropagationOnBrokerChange PASSED
kafka.controller.ControllerEventManagerTest > testEventThatThrowsException STARTED
kafka.controller.ControllerEventManagerTest > testEventThatThrowsException PASSED
kafka.controller.ControllerEventManagerTest > testSuccessfulEvent STARTED
kafka.controller.ControllerEventManagerTest > testSuccessfulEvent PASSED
unit.kafka.utils.ThrottlerTest > testThrottleDesiredRate STARTED
unit.kafka.utils.ThrottlerTest > testThrottleDesiredRate PASSED
2282 tests completed, 1 failed, 4 skipped
> Task :kafka-2.2-jdk8:core:test FAILED
> Task :testScala_2_12 FAILED
FAILURE: Build failed with an exception.
* What went wrong:
Execution failed for task ':kafka-2.2-jdk8:core:test'.
> There were failing tests. See the report at: file://<https://builds.apache.org/job/kafka-2.2-jdk8/ws/core/build/reports/tests/test/index.html>
* Try:
Run with --stacktrace option to get the stack trace. Run with --info or --debug option to get more log output. Run with --scan to get full insights.
* Get more help at https://help.gradle.org
Deprecated Gradle features were used in this build, making it incompatible with Gradle 6.0.
Use '--warning-mode all' to show the individual deprecation warnings.
See https://docs.gradle.org/5.1.1/userguide/command_line_interface.html#sec:command_line_warnings
BUILD FAILED in 4h 6m 7s
139 actionable tasks: 114 executed, 25 up-to-date
Build step 'Execute shell' marked build as failure
[FINDBUGS] Collecting findbugs analysis files...
Setting GRADLE_4_8_1_HOME=/home/jenkins/tools/gradle/4.8.1
[FINDBUGS] Searching for all files in <https://builds.apache.org/job/kafka-2.2-jdk8/ws/> that match the pattern **/build/reports/findbugs/*.xml
[FINDBUGS] No files found. Configuration error?
Setting GRADLE_4_8_1_HOME=/home/jenkins/tools/gradle/4.8.1
No credentials specified
Setting GRADLE_4_8_1_HOME=/home/jenkins/tools/gradle/4.8.1
<Git Blamer> Using GitBlamer to create author and commit information for all warnings.
<Git Blamer> GIT_COMMIT=73ab486fa0245354514b690e29a673dbac359bcb, workspace=<https://builds.apache.org/job/kafka-2.2-jdk8/ws/>
[FINDBUGS] Computing warning deltas based on reference build #139
Recording test results
Setting GRADLE_4_8_1_HOME=/home/jenkins/tools/gradle/4.8.1
Setting GRADLE_4_8_1_HOME=/home/jenkins/tools/gradle/4.8.1
Jenkins build is back to normal : kafka-2.2-jdk8 #143
Posted by Apache Jenkins Server <je...@builds.apache.org>.
See <https://builds.apache.org/job/kafka-2.2-jdk8/143/display/redirect?page=changes>
Build failed in Jenkins: kafka-2.2-jdk8 #142
Posted by Apache Jenkins Server <je...@builds.apache.org>.
See <https://builds.apache.org/job/kafka-2.2-jdk8/142/display/redirect?page=changes>
Changes:
[manikumar] MINOR: Add missing Alter Operation to Topic supported operations list in
------------------------------------------
[...truncated 2.75 MB...]
kafka.admin.TopicCommandWithAdminClientTest > testAlterWithInvalidPartitionCount PASSED
kafka.admin.TopicCommandWithAdminClientTest > testCreate STARTED
kafka.admin.TopicCommandWithAdminClientTest > testCreate PASSED
kafka.admin.TopicCommandWithAdminClientTest > testConfigOptWithBootstrapServers STARTED
kafka.admin.TopicCommandWithAdminClientTest > testConfigOptWithBootstrapServers PASSED
kafka.admin.TopicCommandWithAdminClientTest > testAlterWithUnspecifiedPartitionCount STARTED
kafka.admin.TopicCommandWithAdminClientTest > testAlterWithUnspecifiedPartitionCount PASSED
kafka.admin.TopicCommandWithAdminClientTest > testDeleteIfExists STARTED
kafka.admin.TopicCommandWithAdminClientTest > testDeleteIfExists PASSED
kafka.admin.TopicCommandWithAdminClientTest > testDescribe STARTED
kafka.admin.TopicCommandWithAdminClientTest > testDescribe PASSED
kafka.admin.TopicCommandWithAdminClientTest > testAlterAssignment STARTED
kafka.admin.TopicCommandWithAdminClientTest > testAlterAssignment PASSED
kafka.admin.DelegationTokenCommandTest > testDelegationTokenRequests STARTED
kafka.admin.DelegationTokenCommandTest > testDelegationTokenRequests PASSED
kafka.admin.DescribeConsumerGroupTest > testDescribeMembersOfNonExistingGroup STARTED
kafka.admin.DescribeConsumerGroupTest > testDescribeMembersOfNonExistingGroup PASSED
kafka.admin.DescribeConsumerGroupTest > testDescribeStateOfExistingGroup STARTED
kafka.admin.DescribeConsumerGroupTest > testDescribeStateOfExistingGroup PASSED
kafka.admin.DescribeConsumerGroupTest > testDescribeExistingGroup STARTED
kafka.admin.DescribeConsumerGroupTest > testDescribeExistingGroup PASSED
kafka.admin.DescribeConsumerGroupTest > testDescribeStateWithConsumersWithoutAssignedPartitions STARTED
kafka.admin.DescribeConsumerGroupTest > testDescribeStateWithConsumersWithoutAssignedPartitions PASSED
kafka.admin.DescribeConsumerGroupTest > testDescribeWithMultipleSubActions STARTED
kafka.admin.DescribeConsumerGroupTest > testDescribeWithMultipleSubActions PASSED
kafka.admin.DescribeConsumerGroupTest > testDescribeGroupOffsetsWithShortInitializationTimeout STARTED
kafka.admin.DescribeConsumerGroupTest > testDescribeGroupOffsetsWithShortInitializationTimeout PASSED
kafka.admin.DescribeConsumerGroupTest > testDescribeOffsetsOfExistingGroupWithNoMembers STARTED
kafka.admin.DescribeConsumerGroupTest > testDescribeOffsetsOfExistingGroupWithNoMembers PASSED
kafka.admin.DescribeConsumerGroupTest > testDescribeGroupMembersWithShortInitializationTimeout STARTED
kafka.admin.DescribeConsumerGroupTest > testDescribeGroupMembersWithShortInitializationTimeout PASSED
kafka.admin.DescribeConsumerGroupTest > testDescribeMembersOfExistingGroup STARTED
kafka.admin.DescribeConsumerGroupTest > testDescribeMembersOfExistingGroup PASSED
kafka.admin.DescribeConsumerGroupTest > testDescribeOffsetsOfExistingGroup STARTED
kafka.admin.DescribeConsumerGroupTest > testDescribeOffsetsOfExistingGroup PASSED
kafka.admin.DescribeConsumerGroupTest > testDescribeOffsetsWithConsumersWithoutAssignedPartitions STARTED
kafka.admin.DescribeConsumerGroupTest > testDescribeOffsetsWithConsumersWithoutAssignedPartitions PASSED
kafka.admin.DescribeConsumerGroupTest > testDescribeWithMultiPartitionTopicAndMultipleConsumers STARTED
kafka.admin.DescribeConsumerGroupTest > testDescribeWithMultiPartitionTopicAndMultipleConsumers PASSED
kafka.admin.DescribeConsumerGroupTest > testDescribeSimpleConsumerGroup STARTED
kafka.admin.DescribeConsumerGroupTest > testDescribeSimpleConsumerGroup PASSED
kafka.admin.DescribeConsumerGroupTest > testDescribeStateOfNonExistingGroup STARTED
kafka.admin.DescribeConsumerGroupTest > testDescribeStateOfNonExistingGroup PASSED
kafka.admin.DescribeConsumerGroupTest > testDescribeMembersWithConsumersWithoutAssignedPartitions STARTED
kafka.admin.DescribeConsumerGroupTest > testDescribeMembersWithConsumersWithoutAssignedPartitions PASSED
kafka.admin.DescribeConsumerGroupTest > testDescribeMembersOfExistingGroupWithNoMembers STARTED
kafka.admin.DescribeConsumerGroupTest > testDescribeMembersOfExistingGroupWithNoMembers PASSED
kafka.admin.DescribeConsumerGroupTest > testDescribeWithUnrecognizedNewConsumerOption STARTED
kafka.admin.DescribeConsumerGroupTest > testDescribeWithUnrecognizedNewConsumerOption PASSED
kafka.admin.DescribeConsumerGroupTest > testDescribeGroupStateWithShortInitializationTimeout STARTED
kafka.admin.DescribeConsumerGroupTest > testDescribeGroupStateWithShortInitializationTimeout PASSED
kafka.admin.DescribeConsumerGroupTest > testDescribeMembersWithMultiPartitionTopicAndMultipleConsumers STARTED
kafka.admin.DescribeConsumerGroupTest > testDescribeMembersWithMultiPartitionTopicAndMultipleConsumers PASSED
kafka.admin.DescribeConsumerGroupTest > testDescribeNonOffsetCommitGroup STARTED
kafka.admin.DescribeConsumerGroupTest > testDescribeNonOffsetCommitGroup PASSED
kafka.admin.DescribeConsumerGroupTest > testDescribeNonExistingGroup STARTED
kafka.admin.DescribeConsumerGroupTest > testDescribeNonExistingGroup PASSED
kafka.admin.DescribeConsumerGroupTest > testDescribeStateWithMultiPartitionTopicAndMultipleConsumers STARTED
kafka.admin.DescribeConsumerGroupTest > testDescribeStateWithMultiPartitionTopicAndMultipleConsumers PASSED
kafka.admin.DescribeConsumerGroupTest > testDescribeStateOfExistingGroupWithRoundRobinAssignor STARTED
kafka.admin.DescribeConsumerGroupTest > testDescribeStateOfExistingGroupWithRoundRobinAssignor PASSED
kafka.admin.DescribeConsumerGroupTest > testDescribeOffsetsOfNonExistingGroup STARTED
kafka.admin.DescribeConsumerGroupTest > testDescribeOffsetsOfNonExistingGroup PASSED
kafka.admin.DescribeConsumerGroupTest > testDescribeExistingGroupWithNoMembers STARTED
kafka.admin.DescribeConsumerGroupTest > testDescribeExistingGroupWithNoMembers PASSED
kafka.admin.DescribeConsumerGroupTest > testDescribeWithConsumersWithoutAssignedPartitions STARTED
kafka.admin.DescribeConsumerGroupTest > testDescribeWithConsumersWithoutAssignedPartitions PASSED
kafka.admin.DescribeConsumerGroupTest > testDescribeGroupWithShortInitializationTimeout STARTED
kafka.admin.DescribeConsumerGroupTest > testDescribeGroupWithShortInitializationTimeout PASSED
kafka.admin.DescribeConsumerGroupTest > testDescribeOffsetsWithMultiPartitionTopicAndMultipleConsumers STARTED
kafka.admin.DescribeConsumerGroupTest > testDescribeOffsetsWithMultiPartitionTopicAndMultipleConsumers PASSED
kafka.admin.DescribeConsumerGroupTest > testDescribeStateOfExistingGroupWithNoMembers STARTED
kafka.admin.DescribeConsumerGroupTest > testDescribeStateOfExistingGroupWithNoMembers PASSED
kafka.admin.AdminZkClientTest > testMockedConcurrentTopicCreation STARTED
kafka.admin.AdminZkClientTest > testMockedConcurrentTopicCreation PASSED
kafka.admin.AdminZkClientTest > testGetBrokerMetadatas STARTED
kafka.admin.AdminZkClientTest > testGetBrokerMetadatas PASSED
kafka.admin.AdminZkClientTest > testBootstrapClientIdConfig STARTED
kafka.admin.AdminZkClientTest > testBootstrapClientIdConfig PASSED
kafka.admin.AdminZkClientTest > testTopicConfigChange STARTED
kafka.admin.AdminZkClientTest > testTopicConfigChange PASSED
kafka.admin.AdminZkClientTest > testManualReplicaAssignment STARTED
kafka.admin.AdminZkClientTest > testManualReplicaAssignment PASSED
kafka.admin.AdminZkClientTest > testConcurrentTopicCreation STARTED
kafka.admin.AdminZkClientTest > testConcurrentTopicCreation PASSED
kafka.admin.AdminZkClientTest > shouldPropagateDynamicBrokerConfigs STARTED
kafka.admin.AdminZkClientTest > shouldPropagateDynamicBrokerConfigs PASSED
kafka.admin.AdminZkClientTest > testTopicCreationWithCollision STARTED
kafka.admin.AdminZkClientTest > testTopicCreationWithCollision PASSED
kafka.admin.AdminZkClientTest > testTopicCreationInZK STARTED
kafka.admin.AdminZkClientTest > testTopicCreationInZK PASSED
kafka.admin.AclCommandTest > testAclCliWithAuthorizer STARTED
kafka.admin.AclCommandTest > testAclCliWithAuthorizer PASSED
kafka.admin.AclCommandTest > testInvalidAuthorizerProperty STARTED
kafka.admin.AclCommandTest > testInvalidAuthorizerProperty PASSED
kafka.admin.AclCommandTest > testAclsOnPrefixedResourcesWithAdminAPI STARTED
kafka.admin.AclCommandTest > testAclsOnPrefixedResourcesWithAdminAPI PASSED
kafka.admin.AclCommandTest > testPatternTypes STARTED
kafka.admin.AclCommandTest > testPatternTypes PASSED
kafka.admin.AclCommandTest > testProducerConsumerCliWithAdminAPI STARTED
kafka.admin.AclCommandTest > testProducerConsumerCliWithAdminAPI PASSED
kafka.admin.AclCommandTest > testAclsOnPrefixedResourcesWithAuthorizer STARTED
kafka.admin.AclCommandTest > testAclsOnPrefixedResourcesWithAuthorizer PASSED
kafka.admin.AclCommandTest > testProducerConsumerCliWithAuthorizer STARTED
kafka.admin.AclCommandTest > testProducerConsumerCliWithAuthorizer PASSED
kafka.admin.AclCommandTest > testAclCliWithAdminAPI STARTED
kafka.admin.AclCommandTest > testAclCliWithAdminAPI PASSED
unit.kafka.utils.ThrottlerTest > testThrottleDesiredRate STARTED
unit.kafka.utils.ThrottlerTest > testThrottleDesiredRate PASSED
FAILURE: Build failed with an exception.
* What went wrong:
Execution failed for task ':kafka-2.2-jdk8:core:test'.
> There were failing tests. See the report at: file://<https://builds.apache.org/job/kafka-2.2-jdk8/ws/core/build/reports/tests/test/index.html>
* Try:
Run with --stacktrace option to get the stack trace. Run with --info or --debug option to get more log output. Run with --scan to get full insights.
* Get more help at https://help.gradle.org
Deprecated Gradle features were used in this build, making it incompatible with Gradle 6.0.
Use '--warning-mode all' to show the individual deprecation warnings.
See https://docs.gradle.org/5.1.1/userguide/command_line_interface.html#sec:command_line_warnings
BUILD FAILED in 4h 51m 37s
139 actionable tasks: 114 executed, 25 up-to-date
Build step 'Execute shell' marked build as failure
[FINDBUGS] Collecting findbugs analysis files...
Setting GRADLE_4_8_1_HOME=/home/jenkins/tools/gradle/4.8.1
[FINDBUGS] Searching for all files in <https://builds.apache.org/job/kafka-2.2-jdk8/ws/> that match the pattern **/build/reports/findbugs/*.xml
[FINDBUGS] No files found. Configuration error?
Setting GRADLE_4_8_1_HOME=/home/jenkins/tools/gradle/4.8.1
No credentials specified
Setting GRADLE_4_8_1_HOME=/home/jenkins/tools/gradle/4.8.1
<Git Blamer> Using GitBlamer to create author and commit information for all warnings.
<Git Blamer> GIT_COMMIT=72c74e06bb578d24df809c6be56a9c8452305c86, workspace=<https://builds.apache.org/job/kafka-2.2-jdk8/ws/>
[FINDBUGS] Computing warning deltas based on reference build #139
Recording test results
Setting GRADLE_4_8_1_HOME=/home/jenkins/tools/gradle/4.8.1
Setting GRADLE_4_8_1_HOME=/home/jenkins/tools/gradle/4.8.1
Build failed in Jenkins: kafka-2.2-jdk8 #141
Posted by Apache Jenkins Server <je...@builds.apache.org>.
See <https://builds.apache.org/job/kafka-2.2-jdk8/141/display/redirect?page=changes>
Changes:
[jason] KAFKA-8570; Grow buffer to hold down converted records if it was
------------------------------------------
[...truncated 2.75 MB...]
kafka.controller.PartitionLeaderElectionAlgorithmsTest > testReassignPartitionLeaderElectionWithEmptyIsr PASSED
kafka.controller.PartitionLeaderElectionAlgorithmsTest > testControlledShutdownPartitionLeaderElectionAllIsrSimultaneouslyShutdown STARTED
kafka.controller.PartitionLeaderElectionAlgorithmsTest > testControlledShutdownPartitionLeaderElectionAllIsrSimultaneouslyShutdown PASSED
kafka.controller.PartitionLeaderElectionAlgorithmsTest > testOfflinePartitionLeaderElectionLastIsrOfflineUncleanLeaderElectionEnabled STARTED
kafka.controller.PartitionLeaderElectionAlgorithmsTest > testOfflinePartitionLeaderElectionLastIsrOfflineUncleanLeaderElectionEnabled PASSED
kafka.controller.PartitionLeaderElectionAlgorithmsTest > testPreferredReplicaPartitionLeaderElectionPreferredReplicaNotInIsrNotLive STARTED
kafka.controller.PartitionLeaderElectionAlgorithmsTest > testPreferredReplicaPartitionLeaderElectionPreferredReplicaNotInIsrNotLive PASSED
kafka.controller.PartitionLeaderElectionAlgorithmsTest > testOfflinePartitionLeaderElectionLastIsrOfflineUncleanLeaderElectionDisabled STARTED
kafka.controller.PartitionLeaderElectionAlgorithmsTest > testOfflinePartitionLeaderElectionLastIsrOfflineUncleanLeaderElectionDisabled PASSED
kafka.controller.PartitionStateMachineTest > testNonexistentPartitionToNewPartitionTransition STARTED
kafka.controller.PartitionStateMachineTest > testNonexistentPartitionToNewPartitionTransition PASSED
kafka.controller.PartitionStateMachineTest > testNewPartitionToOnlinePartitionTransitionErrorCodeFromCreateStates STARTED
kafka.controller.PartitionStateMachineTest > testNewPartitionToOnlinePartitionTransitionErrorCodeFromCreateStates PASSED
kafka.controller.PartitionStateMachineTest > testOfflinePartitionToNonexistentPartitionTransition STARTED
kafka.controller.PartitionStateMachineTest > testOfflinePartitionToNonexistentPartitionTransition PASSED
kafka.controller.PartitionStateMachineTest > testOnlinePartitionToOfflineTransition STARTED
kafka.controller.PartitionStateMachineTest > testOnlinePartitionToOfflineTransition PASSED
kafka.controller.PartitionStateMachineTest > testNewPartitionToOfflinePartitionTransition STARTED
kafka.controller.PartitionStateMachineTest > testNewPartitionToOfflinePartitionTransition PASSED
kafka.controller.PartitionStateMachineTest > testUpdatingOfflinePartitionsCount STARTED
kafka.controller.PartitionStateMachineTest > testUpdatingOfflinePartitionsCount PASSED
kafka.controller.PartitionStateMachineTest > testInvalidNonexistentPartitionToOnlinePartitionTransition STARTED
kafka.controller.PartitionStateMachineTest > testInvalidNonexistentPartitionToOnlinePartitionTransition PASSED
kafka.controller.PartitionStateMachineTest > testInvalidNonexistentPartitionToOfflinePartitionTransition STARTED
kafka.controller.PartitionStateMachineTest > testInvalidNonexistentPartitionToOfflinePartitionTransition PASSED
kafka.controller.PartitionStateMachineTest > testOnlinePartitionToOnlineTransition STARTED
kafka.controller.PartitionStateMachineTest > testOnlinePartitionToOnlineTransition PASSED
kafka.controller.PartitionStateMachineTest > testNewPartitionToOnlinePartitionTransitionZkUtilsExceptionFromCreateStates STARTED
kafka.controller.PartitionStateMachineTest > testNewPartitionToOnlinePartitionTransitionZkUtilsExceptionFromCreateStates PASSED
kafka.controller.PartitionStateMachineTest > testInvalidNewPartitionToNonexistentPartitionTransition STARTED
kafka.controller.PartitionStateMachineTest > testInvalidNewPartitionToNonexistentPartitionTransition PASSED
kafka.controller.PartitionStateMachineTest > testNewPartitionToOnlinePartitionTransition STARTED
kafka.controller.PartitionStateMachineTest > testNewPartitionToOnlinePartitionTransition PASSED
kafka.controller.PartitionStateMachineTest > testInvalidOnlinePartitionToNewPartitionTransition STARTED
kafka.controller.PartitionStateMachineTest > testInvalidOnlinePartitionToNewPartitionTransition PASSED
kafka.controller.PartitionStateMachineTest > testUpdatingOfflinePartitionsCountDuringTopicDeletion STARTED
kafka.controller.PartitionStateMachineTest > testUpdatingOfflinePartitionsCountDuringTopicDeletion PASSED
kafka.controller.PartitionStateMachineTest > testOfflinePartitionToOnlinePartitionTransitionErrorCodeFromStateLookup STARTED
kafka.controller.PartitionStateMachineTest > testOfflinePartitionToOnlinePartitionTransitionErrorCodeFromStateLookup PASSED
kafka.controller.PartitionStateMachineTest > testOnlinePartitionToOnlineTransitionForControlledShutdown STARTED
kafka.controller.PartitionStateMachineTest > testOnlinePartitionToOnlineTransitionForControlledShutdown PASSED
kafka.controller.PartitionStateMachineTest > testOfflinePartitionToOnlinePartitionTransitionZkUtilsExceptionFromStateLookup STARTED
kafka.controller.PartitionStateMachineTest > testOfflinePartitionToOnlinePartitionTransitionZkUtilsExceptionFromStateLookup PASSED
kafka.controller.PartitionStateMachineTest > testNoOfflinePartitionsChangeForTopicsBeingDeleted STARTED
kafka.controller.PartitionStateMachineTest > testNoOfflinePartitionsChangeForTopicsBeingDeleted PASSED
kafka.controller.PartitionStateMachineTest > testInvalidOnlinePartitionToNonexistentPartitionTransition STARTED
kafka.controller.PartitionStateMachineTest > testInvalidOnlinePartitionToNonexistentPartitionTransition PASSED
kafka.controller.PartitionStateMachineTest > testInvalidOfflinePartitionToNewPartitionTransition STARTED
kafka.controller.PartitionStateMachineTest > testInvalidOfflinePartitionToNewPartitionTransition PASSED
kafka.controller.PartitionStateMachineTest > testOfflinePartitionToOnlinePartitionTransition STARTED
kafka.controller.PartitionStateMachineTest > testOfflinePartitionToOnlinePartitionTransition PASSED
kafka.controller.ControllerFailoverTest > testHandleIllegalStateException STARTED
kafka.controller.ControllerFailoverTest > testHandleIllegalStateException PASSED
kafka.controller.ControllerIntegrationTest > testControllerDetectsBouncedBrokers STARTED
kafka.controller.ControllerIntegrationTest > testControllerDetectsBouncedBrokers PASSED
kafka.controller.ControllerIntegrationTest > testControlledShutdown STARTED
kafka.controller.ControllerIntegrationTest > testControlledShutdown PASSED
kafka.controller.ControllerIntegrationTest > testPartitionReassignmentWithOfflineReplicaHaltingProgress STARTED
kafka.controller.ControllerIntegrationTest > testPartitionReassignmentWithOfflineReplicaHaltingProgress PASSED
kafka.controller.ControllerIntegrationTest > testControllerEpochPersistsWhenAllBrokersDown STARTED
kafka.controller.ControllerIntegrationTest > testControllerEpochPersistsWhenAllBrokersDown PASSED
kafka.controller.ControllerIntegrationTest > testTopicCreationWithOfflineReplica STARTED
kafka.controller.ControllerIntegrationTest > testTopicCreationWithOfflineReplica PASSED
kafka.controller.ControllerIntegrationTest > testPartitionReassignmentResumesAfterReplicaComesOnline STARTED
kafka.controller.ControllerIntegrationTest > testPartitionReassignmentResumesAfterReplicaComesOnline PASSED
kafka.controller.ControllerIntegrationTest > testLeaderAndIsrWhenEntireIsrOfflineAndUncleanLeaderElectionDisabled STARTED
kafka.controller.ControllerIntegrationTest > testLeaderAndIsrWhenEntireIsrOfflineAndUncleanLeaderElectionDisabled PASSED
kafka.controller.ControllerIntegrationTest > testTopicPartitionExpansionWithOfflineReplica STARTED
kafka.controller.ControllerIntegrationTest > testTopicPartitionExpansionWithOfflineReplica PASSED
kafka.controller.ControllerIntegrationTest > testPreferredReplicaLeaderElectionWithOfflinePreferredReplica STARTED
kafka.controller.ControllerIntegrationTest > testPreferredReplicaLeaderElectionWithOfflinePreferredReplica PASSED
kafka.controller.ControllerIntegrationTest > testMetadataPropagationOnControlPlane STARTED
kafka.controller.ControllerIntegrationTest > testMetadataPropagationOnControlPlane PASSED
kafka.controller.ControllerIntegrationTest > testAutoPreferredReplicaLeaderElection STARTED
kafka.controller.ControllerIntegrationTest > testAutoPreferredReplicaLeaderElection PASSED
kafka.controller.ControllerIntegrationTest > testTopicCreation STARTED
kafka.controller.ControllerIntegrationTest > testTopicCreation PASSED
kafka.controller.ControllerIntegrationTest > testControllerMoveOnTopicDeletion STARTED
kafka.controller.ControllerIntegrationTest > testControllerMoveOnTopicDeletion PASSED
kafka.controller.ControllerIntegrationTest > testPartitionReassignment STARTED
kafka.controller.ControllerIntegrationTest > testPartitionReassignment PASSED
kafka.controller.ControllerIntegrationTest > testTopicPartitionExpansion STARTED
kafka.controller.ControllerIntegrationTest > testTopicPartitionExpansion PASSED
kafka.controller.ControllerIntegrationTest > testControllerMoveIncrementsControllerEpoch STARTED
kafka.controller.ControllerIntegrationTest > testControllerMoveIncrementsControllerEpoch PASSED
kafka.controller.ControllerIntegrationTest > testLeaderAndIsrWhenEntireIsrOfflineAndUncleanLeaderElectionEnabled STARTED
kafka.controller.ControllerIntegrationTest > testLeaderAndIsrWhenEntireIsrOfflineAndUncleanLeaderElectionEnabled PASSED
kafka.controller.ControllerIntegrationTest > testControllerMoveOnPartitionReassignment STARTED
kafka.controller.ControllerIntegrationTest > testControllerMoveOnPartitionReassignment PASSED
kafka.controller.ControllerIntegrationTest > testControllerMoveOnTopicCreation STARTED
kafka.controller.ControllerIntegrationTest > testControllerMoveOnTopicCreation PASSED
kafka.controller.ControllerIntegrationTest > testControllerRejectControlledShutdownRequestWithStaleBrokerEpoch STARTED
kafka.controller.ControllerIntegrationTest > testControllerRejectControlledShutdownRequestWithStaleBrokerEpoch PASSED
kafka.controller.ControllerIntegrationTest > testBackToBackPreferredReplicaLeaderElections STARTED
kafka.controller.ControllerIntegrationTest > testBackToBackPreferredReplicaLeaderElections PASSED
kafka.controller.ControllerIntegrationTest > testEmptyCluster STARTED
kafka.controller.ControllerIntegrationTest > testEmptyCluster PASSED
kafka.controller.ControllerIntegrationTest > testControllerMoveOnPreferredReplicaElection STARTED
kafka.controller.ControllerIntegrationTest > testControllerMoveOnPreferredReplicaElection PASSED
kafka.controller.ControllerIntegrationTest > testPreferredReplicaLeaderElection STARTED
kafka.controller.ControllerIntegrationTest > testPreferredReplicaLeaderElection PASSED
kafka.controller.ControllerIntegrationTest > testMetadataPropagationOnBrokerChange STARTED
kafka.controller.ControllerIntegrationTest > testMetadataPropagationOnBrokerChange PASSED
kafka.controller.ControllerEventManagerTest > testEventThatThrowsException STARTED
kafka.controller.ControllerEventManagerTest > testEventThatThrowsException PASSED
kafka.controller.ControllerEventManagerTest > testSuccessfulEvent STARTED
kafka.controller.ControllerEventManagerTest > testSuccessfulEvent PASSED
unit.kafka.utils.ThrottlerTest > testThrottleDesiredRate STARTED
unit.kafka.utils.ThrottlerTest > testThrottleDesiredRate PASSED
FAILURE: Build failed with an exception.
* What went wrong:
Execution failed for task ':kafka-2.2-jdk8:core:test'.
> There were failing tests. See the report at: file://<https://builds.apache.org/job/kafka-2.2-jdk8/ws/core/build/reports/tests/test/index.html>
* Try:
Run with --stacktrace option to get the stack trace. Run with --info or --debug option to get more log output. Run with --scan to get full insights.
* Get more help at https://help.gradle.org
Deprecated Gradle features were used in this build, making it incompatible with Gradle 6.0.
Use '--warning-mode all' to show the individual deprecation warnings.
See https://docs.gradle.org/5.1.1/userguide/command_line_interface.html#sec:command_line_warnings
BUILD FAILED in 4h 17m 42s
139 actionable tasks: 114 executed, 25 up-to-date
Build step 'Execute shell' marked build as failure
[FINDBUGS] Collecting findbugs analysis files...
Setting GRADLE_4_8_1_HOME=/home/jenkins/tools/gradle/4.8.1
[FINDBUGS] Searching for all files in <https://builds.apache.org/job/kafka-2.2-jdk8/ws/> that match the pattern **/build/reports/findbugs/*.xml
[FINDBUGS] No files found. Configuration error?
Setting GRADLE_4_8_1_HOME=/home/jenkins/tools/gradle/4.8.1
No credentials specified
Setting GRADLE_4_8_1_HOME=/home/jenkins/tools/gradle/4.8.1
<Git Blamer> Using GitBlamer to create author and commit information for all warnings.
<Git Blamer> GIT_COMMIT=a297722cb138f34c4589b9da3b7f5dca6ea7a027, workspace=<https://builds.apache.org/job/kafka-2.2-jdk8/ws/>
[FINDBUGS] Computing warning deltas based on reference build #139
Recording test results
Setting GRADLE_4_8_1_HOME=/home/jenkins/tools/gradle/4.8.1
Setting GRADLE_4_8_1_HOME=/home/jenkins/tools/gradle/4.8.1