You are viewing a plain text version of this content. The canonical link for it is here.
Posted to dev@kafka.apache.org by Apache Jenkins Server <je...@builds.apache.org> on 2015/11/03 23:38:52 UTC
Build failed in Jenkins: kafka-trunk-jdk7 #752
See <https://builds.apache.org/job/kafka-trunk-jdk7/752/changes>
Changes:
[wangguoz] KAFKA-2441: SSL/TLS in official docs
------------------------------------------
Started by an SCM change
[EnvInject] - Loading node environment variables.
Building remotely on ubuntu-2 (docker Ubuntu ubuntu) in workspace <https://builds.apache.org/job/kafka-trunk-jdk7/ws/>
> git rev-parse --is-inside-work-tree # timeout=10
Fetching changes from the remote Git repository
> git config remote.origin.url https://git-wip-us.apache.org/repos/asf/kafka.git # timeout=10
Fetching upstream changes from https://git-wip-us.apache.org/repos/asf/kafka.git
> git --version # timeout=10
> git -c core.askpass=true fetch --tags --progress https://git-wip-us.apache.org/repos/asf/kafka.git +refs/heads/*:refs/remotes/origin/*
> git rev-parse refs/remotes/origin/trunk^{commit} # timeout=10
> git rev-parse refs/remotes/origin/origin/trunk^{commit} # timeout=10
Checking out Revision f413143eddd713dc5f03d53fdeb10e4e7f3738b1 (refs/remotes/origin/trunk)
> git config core.sparsecheckout # timeout=10
> git checkout -f f413143eddd713dc5f03d53fdeb10e4e7f3738b1
> git rev-list 5aa5f19d38eda33f32e170e14bcd4fd0d2835fc0 # timeout=10
Setting GRADLE_2_4_RC_2_HOME=/home/jenkins/jenkins-slave/tools/hudson.plugins.gradle.GradleInstallation/Gradle_2.4-rc-2
Setting JDK_1_7U51_HOME=/home/jenkins/jenkins-slave/tools/hudson.model.JDK/jdk-1.7u51
[kafka-trunk-jdk7] $ /bin/bash -xe /tmp/hudson2610007731056502514.sh
+ /home/jenkins/jenkins-slave/tools/hudson.plugins.gradle.GradleInstallation/Gradle_2.4-rc-2/bin/gradle
To honour the JVM settings for this build a new JVM will be forked. Please consider using the daemon: http://gradle.org/docs/2.4-rc-2/userguide/gradle_daemon.html.
Building project 'core' with Scala version 2.10.5
:downloadWrapper UP-TO-DATE
BUILD SUCCESSFUL
Total time: 18.122 secs
Setting GRADLE_2_4_RC_2_HOME=/home/jenkins/jenkins-slave/tools/hudson.plugins.gradle.GradleInstallation/Gradle_2.4-rc-2
Setting JDK_1_7U51_HOME=/home/jenkins/jenkins-slave/tools/hudson.model.JDK/jdk-1.7u51
[kafka-trunk-jdk7] $ /bin/bash -xe /tmp/hudson439311800793931039.sh
+ ./gradlew -Dorg.gradle.project.maxParallelForks=1 clean jarAll docsJarAll testAll
To honour the JVM settings for this build a new JVM will be forked. Please consider using the daemon: https://docs.gradle.org/2.8/userguide/gradle_daemon.html.
Building project 'core' with Scala version 2.10.5
:clean UP-TO-DATE
:clients:clean UP-TO-DATE
:contrib:clean UP-TO-DATE
:copycat:clean UP-TO-DATE
:core:clean UP-TO-DATE
:examples:clean UP-TO-DATE
:log4j-appender:clean UP-TO-DATE
:streams:clean UP-TO-DATE
:tools:clean UP-TO-DATE
:contrib:hadoop-consumer:clean UP-TO-DATE
:contrib:hadoop-producer:clean UP-TO-DATE
:copycat:api:clean UP-TO-DATE
:copycat:file:clean UP-TO-DATE
:copycat:json:clean UP-TO-DATE
:copycat:runtime:clean UP-TO-DATE
:jar_core_2_10_5
Building project 'core' with Scala version 2.10.5
:kafka-trunk-jdk7:clients:compileJava
:jar_core_2_10_5 FAILED
FAILURE: Build failed with an exception.
* What went wrong:
Failed to capture snapshot of input files for task 'compileJava' during up-to-date check. See stacktrace for details.
> Could not add entry '<https://builds.apache.org/job/kafka-trunk-jdk7/ws/clients/src/main/java/org/apache/kafka/common/security/kerberos/KerberosShortNamer.java'> to cache fileHashes.bin (<https://builds.apache.org/job/kafka-trunk-jdk7/ws/.gradle/2.8/taskArtifacts/fileHashes.bin).>
* Try:
Run with --stacktrace option to get the stack trace. Run with --info or --debug option to get more log output.
BUILD FAILED
Total time: 17.758 secs
Build step 'Execute shell' marked build as failure
Recording test results
Setting GRADLE_2_4_RC_2_HOME=/home/jenkins/jenkins-slave/tools/hudson.plugins.gradle.GradleInstallation/Gradle_2.4-rc-2
Setting JDK_1_7U51_HOME=/home/jenkins/jenkins-slave/tools/hudson.model.JDK/jdk-1.7u51
ERROR: Publisher 'Publish JUnit test result report' failed: No test report files were found. Configuration error?
Setting GRADLE_2_4_RC_2_HOME=/home/jenkins/jenkins-slave/tools/hudson.plugins.gradle.GradleInstallation/Gradle_2.4-rc-2
Setting JDK_1_7U51_HOME=/home/jenkins/jenkins-slave/tools/hudson.model.JDK/jdk-1.7u51
Jenkins build is back to normal : kafka-trunk-jdk7 #763
Posted by Apache Jenkins Server <je...@builds.apache.org>.
See <https://builds.apache.org/job/kafka-trunk-jdk7/763/changes>
Build failed in Jenkins: kafka-trunk-jdk7 #762
Posted by Apache Jenkins Server <je...@builds.apache.org>.
See <https://builds.apache.org/job/kafka-trunk-jdk7/762/changes>
Changes:
[wangguoz] KAFKA-2741: Make SourceTaskContext and SinkTaskContext interfaces and
[wangguoz] KAFKA-2743: Make forwarded task reconfiguration requests asynchronous on
[wangguoz] KAFKA-2738: Replica FetcherThread should connect to leader endpoint
------------------------------------------
Started by an SCM change
[EnvInject] - Loading node environment variables.
Building remotely on H11 (Ubuntu ubuntu) in workspace <https://builds.apache.org/job/kafka-trunk-jdk7/ws/>
> git rev-parse --is-inside-work-tree # timeout=10
Fetching changes from the remote Git repository
> git config remote.origin.url https://git-wip-us.apache.org/repos/asf/kafka.git # timeout=10
Fetching upstream changes from https://git-wip-us.apache.org/repos/asf/kafka.git
> git --version # timeout=10
> git -c core.askpass=true fetch --tags --progress https://git-wip-us.apache.org/repos/asf/kafka.git +refs/heads/*:refs/remotes/origin/*
> git rev-parse refs/remotes/origin/trunk^{commit} # timeout=10
> git rev-parse refs/remotes/origin/origin/trunk^{commit} # timeout=10
Checking out Revision d23785ff2df136090e3c80a3a6df5cb85443924b (refs/remotes/origin/trunk)
> git config core.sparsecheckout # timeout=10
> git checkout -f d23785ff2df136090e3c80a3a6df5cb85443924b
> git rev-list 4a9e7607b9e563195556873b6ec9b74561cedfbb # timeout=10
Setting GRADLE_2_4_RC_2_HOME=/home/jenkins/jenkins-slave/tools/hudson.plugins.gradle.GradleInstallation/Gradle_2.4-rc-2
Setting JDK_1_7U51_HOME=/home/jenkins/jenkins-slave/tools/hudson.model.JDK/jdk-1.7u51
[kafka-trunk-jdk7] $ /bin/bash -xe /tmp/hudson1309989162686262698.sh
+ /home/jenkins/jenkins-slave/tools/hudson.plugins.gradle.GradleInstallation/Gradle_2.4-rc-2/bin/gradle
To honour the JVM settings for this build a new JVM will be forked. Please consider using the daemon: http://gradle.org/docs/2.4-rc-2/userguide/gradle_daemon.html.
Building project 'core' with Scala version 2.10.5
:downloadWrapper UP-TO-DATE
BUILD SUCCESSFUL
Total time: 15.259 secs
Setting GRADLE_2_4_RC_2_HOME=/home/jenkins/jenkins-slave/tools/hudson.plugins.gradle.GradleInstallation/Gradle_2.4-rc-2
Setting JDK_1_7U51_HOME=/home/jenkins/jenkins-slave/tools/hudson.model.JDK/jdk-1.7u51
[kafka-trunk-jdk7] $ /bin/bash -xe /tmp/hudson9089906433601971858.sh
+ ./gradlew -Dorg.gradle.project.maxParallelForks=1 clean jarAll docsJarAll testAll
To honour the JVM settings for this build a new JVM will be forked. Please consider using the daemon: https://docs.gradle.org/2.8/userguide/gradle_daemon.html.
Building project 'core' with Scala version 2.10.5
:clean UP-TO-DATE
:clients:clean UP-TO-DATE
:contrib:clean UP-TO-DATE
:copycat:clean UP-TO-DATE
:core:clean UP-TO-DATE
:examples:clean UP-TO-DATE
:log4j-appender:clean UP-TO-DATE
:streams:clean UP-TO-DATE
:tools:clean UP-TO-DATE
:contrib:hadoop-consumer:clean UP-TO-DATE
:contrib:hadoop-producer:clean UP-TO-DATE
:copycat:api:clean UP-TO-DATE
:copycat:file:clean UP-TO-DATE
:copycat:json:clean UP-TO-DATE
:copycat:runtime:clean UP-TO-DATE
:jar_core_2_10_5
Building project 'core' with Scala version 2.10.5
:kafka-trunk-jdk7:clients:compileJava
:jar_core_2_10_5 FAILED
FAILURE: Build failed with an exception.
* What went wrong:
Failed to capture snapshot of input files for task 'compileJava' during up-to-date check. See stacktrace for details.
> Could not add entry '<https://builds.apache.org/job/kafka-trunk-jdk7/ws/clients/src/main/java/org/apache/kafka/common/errors/GroupAuthorizationException.java'> to cache fileHashes.bin (<https://builds.apache.org/job/kafka-trunk-jdk7/ws/.gradle/2.8/taskArtifacts/fileHashes.bin).>
* Try:
Run with --stacktrace option to get the stack trace. Run with --info or --debug option to get more log output.
BUILD FAILED
Total time: 15.43 secs
Build step 'Execute shell' marked build as failure
Recording test results
Setting GRADLE_2_4_RC_2_HOME=/home/jenkins/jenkins-slave/tools/hudson.plugins.gradle.GradleInstallation/Gradle_2.4-rc-2
Setting JDK_1_7U51_HOME=/home/jenkins/jenkins-slave/tools/hudson.model.JDK/jdk-1.7u51
ERROR: Publisher 'Publish JUnit test result report' failed: No test report files were found. Configuration error?
Setting GRADLE_2_4_RC_2_HOME=/home/jenkins/jenkins-slave/tools/hudson.plugins.gradle.GradleInstallation/Gradle_2.4-rc-2
Setting JDK_1_7U51_HOME=/home/jenkins/jenkins-slave/tools/hudson.model.JDK/jdk-1.7u51
Build failed in Jenkins: kafka-trunk-jdk7 #761
Posted by Apache Jenkins Server <je...@builds.apache.org>.
See <https://builds.apache.org/job/kafka-trunk-jdk7/761/changes>
Changes:
[wangguoz] KAFKA-2742: Fix SourceTaskOffsetCommitter to handle removal of commit
------------------------------------------
[...truncated 123 lines...]
:kafka-trunk-jdk7:clients:determineCommitId UP-TO-DATE
:kafka-trunk-jdk7:clients:createVersionFile
:kafka-trunk-jdk7:clients:jar UP-TO-DATE
:kafka-trunk-jdk7:core:compileJava UP-TO-DATE
:kafka-trunk-jdk7:core:compileScala
<https://builds.apache.org/job/kafka-trunk-jdk7/ws/core/src/main/scala/kafka/api/OffsetCommitRequest.scala>:78: value DEFAULT_TIMESTAMP in object OffsetCommitRequest is deprecated: see corresponding Javadoc for more information.
org.apache.kafka.common.requests.OffsetCommitRequest.DEFAULT_TIMESTAMP
^
<https://builds.apache.org/job/kafka-trunk-jdk7/ws/core/src/main/scala/kafka/common/OffsetMetadataAndError.scala>:36: value DEFAULT_TIMESTAMP in object OffsetCommitRequest is deprecated: see corresponding Javadoc for more information.
commitTimestamp: Long = org.apache.kafka.common.requests.OffsetCommitRequest.DEFAULT_TIMESTAMP,
^
<https://builds.apache.org/job/kafka-trunk-jdk7/ws/core/src/main/scala/kafka/common/OffsetMetadataAndError.scala>:37: value DEFAULT_TIMESTAMP in object OffsetCommitRequest is deprecated: see corresponding Javadoc for more information.
expireTimestamp: Long = org.apache.kafka.common.requests.OffsetCommitRequest.DEFAULT_TIMESTAMP) {
^
<https://builds.apache.org/job/kafka-trunk-jdk7/ws/core/src/main/scala/kafka/coordinator/GroupMetadataManager.scala>:392: value DEFAULT_TIMESTAMP in object OffsetCommitRequest is deprecated: see corresponding Javadoc for more information.
if (value.expireTimestamp == org.apache.kafka.common.requests.OffsetCommitRequest.DEFAULT_TIMESTAMP)
^
<https://builds.apache.org/job/kafka-trunk-jdk7/ws/core/src/main/scala/kafka/server/KafkaApis.scala>:273: value DEFAULT_TIMESTAMP in object OffsetCommitRequest is deprecated: see corresponding Javadoc for more information.
if (offsetAndMetadata.commitTimestamp == org.apache.kafka.common.requests.OffsetCommitRequest.DEFAULT_TIMESTAMP)
^
<https://builds.apache.org/job/kafka-trunk-jdk7/ws/core/src/main/scala/kafka/server/KafkaServer.scala>:293: a pure expression does nothing in statement position; you may be omitting necessary parentheses
ControllerStats.uncleanLeaderElectionRate
^
<https://builds.apache.org/job/kafka-trunk-jdk7/ws/core/src/main/scala/kafka/server/KafkaServer.scala>:294: a pure expression does nothing in statement position; you may be omitting necessary parentheses
ControllerStats.leaderElectionTimer
^
<https://builds.apache.org/job/kafka-trunk-jdk7/ws/core/src/main/scala/kafka/tools/ConsoleProducer.scala>:115: value METADATA_FETCH_TIMEOUT_CONFIG in object ProducerConfig is deprecated: see corresponding Javadoc for more information.
props.put(ProducerConfig.METADATA_FETCH_TIMEOUT_CONFIG, config.metadataFetchTimeoutMs.toString)
^
<https://builds.apache.org/job/kafka-trunk-jdk7/ws/core/src/main/scala/kafka/tools/ConsoleProducer.scala>:117: value TIMEOUT_CONFIG in object ProducerConfig is deprecated: see corresponding Javadoc for more information.
props.put(ProducerConfig.TIMEOUT_CONFIG, config.requestTimeoutMs.toString)
^
<https://builds.apache.org/job/kafka-trunk-jdk7/ws/core/src/main/scala/kafka/tools/ConsoleProducer.scala>:121: value BLOCK_ON_BUFFER_FULL_CONFIG in object ProducerConfig is deprecated: see corresponding Javadoc for more information.
props.put(ProducerConfig.BLOCK_ON_BUFFER_FULL_CONFIG, "false")
^
<https://builds.apache.org/job/kafka-trunk-jdk7/ws/core/src/main/scala/kafka/tools/EndToEndLatency.scala>:75: value BLOCK_ON_BUFFER_FULL_CONFIG in object ProducerConfig is deprecated: see corresponding Javadoc for more information.
producerProps.put(ProducerConfig.BLOCK_ON_BUFFER_FULL_CONFIG, "true")
^
<https://builds.apache.org/job/kafka-trunk-jdk7/ws/core/src/main/scala/kafka/tools/MirrorMaker.scala>:194: value BLOCK_ON_BUFFER_FULL_CONFIG in object ProducerConfig is deprecated: see corresponding Javadoc for more information.
maybeSetDefaultProperty(producerProps, ProducerConfig.BLOCK_ON_BUFFER_FULL_CONFIG, "true")
^
<https://builds.apache.org/job/kafka-trunk-jdk7/ws/core/src/main/scala/kafka/admin/AclCommand.scala>:234: method readLine in class DeprecatedConsole is deprecated: Use the method in scala.io.StdIn
Console.readLine().equalsIgnoreCase("y")
^
<https://builds.apache.org/job/kafka-trunk-jdk7/ws/core/src/main/scala/kafka/admin/TopicCommand.scala>:353: method readLine in class DeprecatedConsole is deprecated: Use the method in scala.io.StdIn
if (!Console.readLine().equalsIgnoreCase("y")) {
^
<https://builds.apache.org/job/kafka-trunk-jdk7/ws/core/src/main/scala/kafka/controller/ControllerChannelManager.scala>:389: class BrokerEndPoint in object UpdateMetadataRequest is deprecated: see corresponding Javadoc for more information.
new UpdateMetadataRequest.BrokerEndPoint(brokerEndPoint.id, brokerEndPoint.host, brokerEndPoint.port)
^
<https://builds.apache.org/job/kafka-trunk-jdk7/ws/core/src/main/scala/kafka/controller/ControllerChannelManager.scala>:391: constructor UpdateMetadataRequest in class UpdateMetadataRequest is deprecated: see corresponding Javadoc for more information.
new UpdateMetadataRequest(controllerId, controllerEpoch, liveBrokers.asJava, partitionStates.asJava)
^
<https://builds.apache.org/job/kafka-trunk-jdk7/ws/core/src/main/scala/kafka/network/BlockingChannel.scala>:129: method readFromReadableChannel in class NetworkReceive is deprecated: see corresponding Javadoc for more information.
response.readFromReadableChannel(channel)
^
<https://builds.apache.org/job/kafka-trunk-jdk7/ws/core/src/main/scala/kafka/coordinator/GroupCoordinator.scala>:665: Reference to uninitialized value NoState
val EmptyGroup = GroupSummary(NoState, NoProtocolType, NoProtocol, NoMembers)
^
<https://builds.apache.org/job/kafka-trunk-jdk7/ws/core/src/main/scala/kafka/coordinator/GroupCoordinator.scala>:665: Reference to uninitialized value NoProtocolType
val EmptyGroup = GroupSummary(NoState, NoProtocolType, NoProtocol, NoMembers)
^
<https://builds.apache.org/job/kafka-trunk-jdk7/ws/core/src/main/scala/kafka/coordinator/GroupCoordinator.scala>:665: Reference to uninitialized value NoProtocol
val EmptyGroup = GroupSummary(NoState, NoProtocolType, NoProtocol, NoMembers)
^
<https://builds.apache.org/job/kafka-trunk-jdk7/ws/core/src/main/scala/kafka/coordinator/GroupCoordinator.scala>:665: Reference to uninitialized value NoMembers
val EmptyGroup = GroupSummary(NoState, NoProtocolType, NoProtocol, NoMembers)
^
<https://builds.apache.org/job/kafka-trunk-jdk7/ws/core/src/main/scala/kafka/coordinator/GroupCoordinator.scala>:666: Reference to uninitialized value NoProtocolType
val DeadGroup = GroupSummary(Dead.toString, NoProtocolType, NoProtocol, NoMembers)
^
<https://builds.apache.org/job/kafka-trunk-jdk7/ws/core/src/main/scala/kafka/coordinator/GroupCoordinator.scala>:666: Reference to uninitialized value NoProtocol
val DeadGroup = GroupSummary(Dead.toString, NoProtocolType, NoProtocol, NoMembers)
^
<https://builds.apache.org/job/kafka-trunk-jdk7/ws/core/src/main/scala/kafka/coordinator/GroupCoordinator.scala>:666: Reference to uninitialized value NoMembers
val DeadGroup = GroupSummary(Dead.toString, NoProtocolType, NoProtocol, NoMembers)
^
there were 15 feature warnings; re-run with -feature for details
25 warnings found
:kafka-trunk-jdk7:core:processResources UP-TO-DATE
:kafka-trunk-jdk7:core:classes
:kafka-trunk-jdk7:clients:compileTestJava UP-TO-DATE
:kafka-trunk-jdk7:clients:processTestResources UP-TO-DATE
:kafka-trunk-jdk7:clients:testClasses UP-TO-DATE
:kafka-trunk-jdk7:core:copyDependantLibs
:kafka-trunk-jdk7:core:copyDependantTestLibs
:kafka-trunk-jdk7:core:jar
:clients:compileJava UP-TO-DATE
:clients:processResources UP-TO-DATE
:clients:classes UP-TO-DATE
:clients:determineCommitId UP-TO-DATE
:clients:createVersionFile
:clients:jar UP-TO-DATE
:core:compileJava UP-TO-DATE
:core:compileScala
<https://builds.apache.org/job/kafka-trunk-jdk7/ws/core/src/main/scala/kafka/api/OffsetCommitRequest.scala>:78: value DEFAULT_TIMESTAMP in object OffsetCommitRequest is deprecated: see corresponding Javadoc for more information.
org.apache.kafka.common.requests.OffsetCommitRequest.DEFAULT_TIMESTAMP
^
<https://builds.apache.org/job/kafka-trunk-jdk7/ws/core/src/main/scala/kafka/common/OffsetMetadataAndError.scala>:36: value DEFAULT_TIMESTAMP in object OffsetCommitRequest is deprecated: see corresponding Javadoc for more information.
commitTimestamp: Long = org.apache.kafka.common.requests.OffsetCommitRequest.DEFAULT_TIMESTAMP,
^
<https://builds.apache.org/job/kafka-trunk-jdk7/ws/core/src/main/scala/kafka/common/OffsetMetadataAndError.scala>:37: value DEFAULT_TIMESTAMP in object OffsetCommitRequest is deprecated: see corresponding Javadoc for more information.
expireTimestamp: Long = org.apache.kafka.common.requests.OffsetCommitRequest.DEFAULT_TIMESTAMP) {
^
<https://builds.apache.org/job/kafka-trunk-jdk7/ws/core/src/main/scala/kafka/coordinator/GroupMetadataManager.scala>:392: value DEFAULT_TIMESTAMP in object OffsetCommitRequest is deprecated: see corresponding Javadoc for more information.
if (value.expireTimestamp == org.apache.kafka.common.requests.OffsetCommitRequest.DEFAULT_TIMESTAMP)
^
<https://builds.apache.org/job/kafka-trunk-jdk7/ws/core/src/main/scala/kafka/server/KafkaApis.scala>:273: value DEFAULT_TIMESTAMP in object OffsetCommitRequest is deprecated: see corresponding Javadoc for more information.
if (offsetAndMetadata.commitTimestamp == org.apache.kafka.common.requests.OffsetCommitRequest.DEFAULT_TIMESTAMP)
^
<https://builds.apache.org/job/kafka-trunk-jdk7/ws/core/src/main/scala/kafka/server/KafkaServer.scala>:293: a pure expression does nothing in statement position; you may be omitting necessary parentheses
ControllerStats.uncleanLeaderElectionRate
^
<https://builds.apache.org/job/kafka-trunk-jdk7/ws/core/src/main/scala/kafka/server/KafkaServer.scala>:294: a pure expression does nothing in statement position; you may be omitting necessary parentheses
ControllerStats.leaderElectionTimer
^
<https://builds.apache.org/job/kafka-trunk-jdk7/ws/core/src/main/scala/kafka/tools/ConsoleProducer.scala>:115: value METADATA_FETCH_TIMEOUT_CONFIG in object ProducerConfig is deprecated: see corresponding Javadoc for more information.
props.put(ProducerConfig.METADATA_FETCH_TIMEOUT_CONFIG, config.metadataFetchTimeoutMs.toString)
^
<https://builds.apache.org/job/kafka-trunk-jdk7/ws/core/src/main/scala/kafka/tools/ConsoleProducer.scala>:117: value TIMEOUT_CONFIG in object ProducerConfig is deprecated: see corresponding Javadoc for more information.
props.put(ProducerConfig.TIMEOUT_CONFIG, config.requestTimeoutMs.toString)
^
<https://builds.apache.org/job/kafka-trunk-jdk7/ws/core/src/main/scala/kafka/tools/ConsoleProducer.scala>:121: value BLOCK_ON_BUFFER_FULL_CONFIG in object ProducerConfig is deprecated: see corresponding Javadoc for more information.
props.put(ProducerConfig.BLOCK_ON_BUFFER_FULL_CONFIG, "false")
^
<https://builds.apache.org/job/kafka-trunk-jdk7/ws/core/src/main/scala/kafka/tools/EndToEndLatency.scala>:75: value BLOCK_ON_BUFFER_FULL_CONFIG in object ProducerConfig is deprecated: see corresponding Javadoc for more information.
producerProps.put(ProducerConfig.BLOCK_ON_BUFFER_FULL_CONFIG, "true")
^
<https://builds.apache.org/job/kafka-trunk-jdk7/ws/core/src/main/scala/kafka/tools/MirrorMaker.scala>:194: value BLOCK_ON_BUFFER_FULL_CONFIG in object ProducerConfig is deprecated: see corresponding Javadoc for more information.
maybeSetDefaultProperty(producerProps, ProducerConfig.BLOCK_ON_BUFFER_FULL_CONFIG, "true")
^
<https://builds.apache.org/job/kafka-trunk-jdk7/ws/core/src/main/scala/kafka/controller/ControllerChannelManager.scala>:389: class BrokerEndPoint in object UpdateMetadataRequest is deprecated: see corresponding Javadoc for more information.
new UpdateMetadataRequest.BrokerEndPoint(brokerEndPoint.id, brokerEndPoint.host, brokerEndPoint.port)
^
<https://builds.apache.org/job/kafka-trunk-jdk7/ws/core/src/main/scala/kafka/controller/ControllerChannelManager.scala>:391: constructor UpdateMetadataRequest in class UpdateMetadataRequest is deprecated: see corresponding Javadoc for more information.
new UpdateMetadataRequest(controllerId, controllerEpoch, liveBrokers.asJava, partitionStates.asJava)
^
<https://builds.apache.org/job/kafka-trunk-jdk7/ws/core/src/main/scala/kafka/network/BlockingChannel.scala>:129: method readFromReadableChannel in class NetworkReceive is deprecated: see corresponding Javadoc for more information.
response.readFromReadableChannel(channel)
^
there were 15 feature warning(s); re-run with -feature for details
16 warnings found
:core:processResources UP-TO-DATE
:core:classes
:clients:compileTestJava UP-TO-DATE
:clients:processTestResources UP-TO-DATE
:clients:testClasses UP-TO-DATE
:core:copyDependantLibs UP-TO-DATE
:core:copyDependantTestLibs
:core:jar UP-TO-DATE
:examples:compileJava
:examples:processResources UP-TO-DATE
:examples:classes
:examples:jar
:log4j-appender:compileJava
:log4j-appender:processResources UP-TO-DATE
:log4j-appender:classes
:log4j-appender:jar
:streams:compileJavaNote: Some input files use unchecked or unsafe operations.
Note: Recompile with -Xlint:unchecked for details.
:streams:processResources UP-TO-DATE
:streams:classes
:clients:javadoc
:clients:javadocJar
:clients:srcJar
:clients:testJar
:clients:signArchives SKIPPED
:streams:copyDependantLibs
:streams:jar
:tools:compileJava
:tools:processResources UP-TO-DATE
:tools:classes
:tools:copyDependantLibs
:tools:jar
:contrib:hadoop-consumer:compileJavaNote: Some input files use or override a deprecated API.
Note: Recompile with -Xlint:deprecation for details.
Note: Some input files use unchecked or unsafe operations.
Note: Recompile with -Xlint:unchecked for details.
:contrib:hadoop-consumer:processResources UP-TO-DATE
:contrib:hadoop-consumer:classes
:contrib:hadoop-consumer:jar
:contrib:hadoop-producer:compileJava
:contrib:hadoop-producer:processResources UP-TO-DATE
:contrib:hadoop-producer:classes
:contrib:hadoop-producer:jar
:copycat:api:compileJavaNote: <https://builds.apache.org/job/kafka-trunk-jdk7/ws/copycat/api/src/main/java/org/apache/kafka/copycat/data/Struct.java> uses unchecked or unsafe operations.
Note: Recompile with -Xlint:unchecked for details.
:copycat:api:processResources UP-TO-DATE
:copycat:api:classes
:copycat:api:copyDependantLibs
:copycat:api:jar
:copycat:file:compileJava
:copycat:file:processResources UP-TO-DATE
:copycat:file:classes
:copycat:file:copyDependantLibs
:copycat:file:jar
:copycat:json:compileJavaNote: <https://builds.apache.org/job/kafka-trunk-jdk7/ws/copycat/json/src/main/java/org/apache/kafka/copycat/json/JsonConverter.java> uses or overrides a deprecated API.
Note: Recompile with -Xlint:deprecation for details.
:copycat:json:processResources UP-TO-DATE
:copycat:json:classes
:copycat:json:copyDependantLibs
:copycat:json:jar
:copycat:runtime:compileJavaNote: Some input files use unchecked or unsafe operations.
Note: Recompile with -Xlint:unchecked for details.
:copycat:runtime:processResources UP-TO-DATE
:copycat:runtime:classes
:copycat:runtime:copyDependantLibs
:copycat:runtime:jar
:jarAll
:docsJar_2_10_5
Building project 'core' with Scala version 2.10.5
:kafka-trunk-jdk7:clients:compileJava UP-TO-DATE
:kafka-trunk-jdk7:clients:processResources UP-TO-DATE
:kafka-trunk-jdk7:clients:classes UP-TO-DATE
:kafka-trunk-jdk7:clients:determineCommitId UP-TO-DATE
:kafka-trunk-jdk7:clients:createVersionFile
:kafka-trunk-jdk7:clients:jar UP-TO-DATE
:kafka-trunk-jdk7:clients:javadoc UP-TO-DATE
:kafka-trunk-jdk7:core:compileJava UP-TO-DATE
:kafka-trunk-jdk7:core:compileScala UP-TO-DATE
:kafka-trunk-jdk7:core:processResources UP-TO-DATE
:kafka-trunk-jdk7:core:classes UP-TO-DATE
:kafka-trunk-jdk7:core:javadoc
:docsJar_2_10_5 FAILED
FAILURE: Build failed with an exception.
* What went wrong:
Could not read entry ':core:javadoc' from cache taskArtifacts.bin (<https://builds.apache.org/job/kafka-trunk-jdk7/ws/.gradle/2.8/taskArtifacts/taskArtifacts.bin).>
> java.io.EOFException (no error message)
* Try:
Run with --stacktrace option to get the stack trace. Run with --info or --debug option to get more log output.
BUILD FAILED
Total time: 4 mins 7.304 secs
Build step 'Execute shell' marked build as failure
Recording test results
Setting GRADLE_2_4_RC_2_HOME=/home/jenkins/jenkins-slave/tools/hudson.plugins.gradle.GradleInstallation/Gradle_2.4-rc-2
Setting JDK_1_7U51_HOME=/home/jenkins/jenkins-slave/tools/hudson.model.JDK/jdk-1.7u51
ERROR: Publisher 'Publish JUnit test result report' failed: No test report files were found. Configuration error?
Setting GRADLE_2_4_RC_2_HOME=/home/jenkins/jenkins-slave/tools/hudson.plugins.gradle.GradleInstallation/Gradle_2.4-rc-2
Setting JDK_1_7U51_HOME=/home/jenkins/jenkins-slave/tools/hudson.model.JDK/jdk-1.7u51
Build failed in Jenkins: kafka-trunk-jdk7 #760
Posted by Apache Jenkins Server <je...@builds.apache.org>.
See <https://builds.apache.org/job/kafka-trunk-jdk7/760/changes>
Changes:
[wangguoz] MINOR: add test case for fetching from a compacted topic
------------------------------------------
Started by an SCM change
[EnvInject] - Loading node environment variables.
Building remotely on H11 (Ubuntu ubuntu) in workspace <https://builds.apache.org/job/kafka-trunk-jdk7/ws/>
> git rev-parse --is-inside-work-tree # timeout=10
Fetching changes from the remote Git repository
> git config remote.origin.url https://git-wip-us.apache.org/repos/asf/kafka.git # timeout=10
Fetching upstream changes from https://git-wip-us.apache.org/repos/asf/kafka.git
> git --version # timeout=10
> git -c core.askpass=true fetch --tags --progress https://git-wip-us.apache.org/repos/asf/kafka.git +refs/heads/*:refs/remotes/origin/*
> git rev-parse refs/remotes/origin/trunk^{commit} # timeout=10
> git rev-parse refs/remotes/origin/origin/trunk^{commit} # timeout=10
Checking out Revision 68f42210a1c8ce64846ffdc2cdbecc6fa5b87739 (refs/remotes/origin/trunk)
> git config core.sparsecheckout # timeout=10
> git checkout -f 68f42210a1c8ce64846ffdc2cdbecc6fa5b87739
> git rev-list ef5d168cc8f10ad4f0efe9df4cbe849a4b35496e # timeout=10
Setting GRADLE_2_4_RC_2_HOME=/home/jenkins/jenkins-slave/tools/hudson.plugins.gradle.GradleInstallation/Gradle_2.4-rc-2
Setting JDK_1_7U51_HOME=/home/jenkins/jenkins-slave/tools/hudson.model.JDK/jdk-1.7u51
[kafka-trunk-jdk7] $ /bin/bash -xe /tmp/hudson3022832669781397908.sh
+ /home/jenkins/jenkins-slave/tools/hudson.plugins.gradle.GradleInstallation/Gradle_2.4-rc-2/bin/gradle
To honour the JVM settings for this build a new JVM will be forked. Please consider using the daemon: http://gradle.org/docs/2.4-rc-2/userguide/gradle_daemon.html.
Building project 'core' with Scala version 2.10.5
:downloadWrapper UP-TO-DATE
BUILD SUCCESSFUL
Total time: 12.148 secs
Setting GRADLE_2_4_RC_2_HOME=/home/jenkins/jenkins-slave/tools/hudson.plugins.gradle.GradleInstallation/Gradle_2.4-rc-2
Setting JDK_1_7U51_HOME=/home/jenkins/jenkins-slave/tools/hudson.model.JDK/jdk-1.7u51
[kafka-trunk-jdk7] $ /bin/bash -xe /tmp/hudson6853820461572021559.sh
+ ./gradlew -Dorg.gradle.project.maxParallelForks=1 clean jarAll docsJarAll testAll
To honour the JVM settings for this build a new JVM will be forked. Please consider using the daemon: https://docs.gradle.org/2.8/userguide/gradle_daemon.html.
Building project 'core' with Scala version 2.10.5
:clean UP-TO-DATE
:clients:clean UP-TO-DATE
:contrib:clean UP-TO-DATE
:copycat:clean UP-TO-DATE
:core:clean UP-TO-DATE
:examples:clean UP-TO-DATE
:log4j-appender:clean UP-TO-DATE
:streams:clean UP-TO-DATE
:tools:clean UP-TO-DATE
:contrib:hadoop-consumer:clean UP-TO-DATE
:contrib:hadoop-producer:clean UP-TO-DATE
:copycat:api:clean UP-TO-DATE
:copycat:file:clean UP-TO-DATE
:copycat:json:clean UP-TO-DATE
:copycat:runtime:clean UP-TO-DATE
:jar_core_2_10_5
Building project 'core' with Scala version 2.10.5
:kafka-trunk-jdk7:clients:compileJava
:jar_core_2_10_5 FAILED
FAILURE: Build failed with an exception.
* What went wrong:
Failed to capture snapshot of input files for task 'compileJava' during up-to-date check. See stacktrace for details.
> Could not add entry '<https://builds.apache.org/job/kafka-trunk-jdk7/ws/clients/src/main/java/org/apache/kafka/common/errors/GroupAuthorizationException.java'> to cache fileHashes.bin (<https://builds.apache.org/job/kafka-trunk-jdk7/ws/.gradle/2.8/taskArtifacts/fileHashes.bin).>
* Try:
Run with --stacktrace option to get the stack trace. Run with --info or --debug option to get more log output.
BUILD FAILED
Total time: 13.349 secs
Build step 'Execute shell' marked build as failure
Recording test results
Setting GRADLE_2_4_RC_2_HOME=/home/jenkins/jenkins-slave/tools/hudson.plugins.gradle.GradleInstallation/Gradle_2.4-rc-2
Setting JDK_1_7U51_HOME=/home/jenkins/jenkins-slave/tools/hudson.model.JDK/jdk-1.7u51
ERROR: Publisher 'Publish JUnit test result report' failed: No test report files were found. Configuration error?
Setting GRADLE_2_4_RC_2_HOME=/home/jenkins/jenkins-slave/tools/hudson.plugins.gradle.GradleInstallation/Gradle_2.4-rc-2
Setting JDK_1_7U51_HOME=/home/jenkins/jenkins-slave/tools/hudson.model.JDK/jdk-1.7u51
Build failed in Jenkins: kafka-trunk-jdk7 #759
Posted by Apache Jenkins Server <je...@builds.apache.org>.
See <https://builds.apache.org/job/kafka-trunk-jdk7/759/changes>
Changes:
[wangguoz] HOTFIX: Fix incorrect version used for group metadata version
[wangguoz] KAFKA-2697: client-side support for leave group
------------------------------------------
[...truncated 3178 lines...]
at kafka.integration.SaslSslTopicMetadataTest.kafka$api$SaslTestHarness$$super$tearDown(SaslSslTopicMetadataTest.scala:25)
at kafka.api.SaslTestHarness$class.tearDown(SaslTestHarness.scala:73)
at kafka.integration.SaslSslTopicMetadataTest.tearDown(SaslSslTopicMetadataTest.scala:25)
kafka.integration.SaslSslTopicMetadataTest > testAliveBrokersListWithNoTopicsAfterNewBrokerStartup PASSED
kafka.integration.SaslSslTopicMetadataTest > testBasicTopicMetadata PASSED
kafka.integration.SaslSslTopicMetadataTest > testTopicMetadataRequest FAILED
org.apache.kafka.common.KafkaException: File /tmp/kafka4620736078055821718.tmpcannot be read.
at org.apache.kafka.common.security.JaasUtils.isZkSecurityEnabled(JaasUtils.java:95)
at kafka.zk.ZooKeeperTestHarness$class.setUp(ZooKeeperTestHarness.scala:67)
at kafka.integration.BaseTopicMetadataTest.setUp(BaseTopicMetadataTest.scala:48)
at kafka.integration.SaslSslTopicMetadataTest.kafka$api$SaslTestHarness$$super$setUp(SaslSslTopicMetadataTest.scala:25)
at kafka.api.SaslTestHarness$class.setUp(SaslTestHarness.scala:38)
at kafka.integration.SaslSslTopicMetadataTest.setUp(SaslSslTopicMetadataTest.scala:25)
java.lang.NullPointerException
at kafka.integration.BaseTopicMetadataTest.tearDown(BaseTopicMetadataTest.scala:63)
at kafka.integration.SaslSslTopicMetadataTest.kafka$api$SaslTestHarness$$super$tearDown(SaslSslTopicMetadataTest.scala:25)
at kafka.api.SaslTestHarness$class.tearDown(SaslTestHarness.scala:73)
at kafka.integration.SaslSslTopicMetadataTest.tearDown(SaslSslTopicMetadataTest.scala:25)
kafka.integration.SaslSslTopicMetadataTest > testAliveBrokersListWithNoTopicsAfterABrokerShutdown PASSED
kafka.integration.SslTopicMetadataTest > testIsrAfterBrokerShutDownAndJoinsBack PASSED
kafka.integration.SslTopicMetadataTest > testAutoCreateTopicWithCollision PASSED
kafka.integration.SslTopicMetadataTest > testAliveBrokerListWithNoTopics PASSED
kafka.integration.SslTopicMetadataTest > testAutoCreateTopic PASSED
kafka.integration.SslTopicMetadataTest > testGetAllTopicMetadata PASSED
kafka.integration.SslTopicMetadataTest > testAliveBrokersListWithNoTopicsAfterNewBrokerStartup PASSED
kafka.integration.SslTopicMetadataTest > testBasicTopicMetadata PASSED
kafka.integration.SslTopicMetadataTest > testTopicMetadataRequest PASSED
kafka.integration.SslTopicMetadataTest > testAliveBrokersListWithNoTopicsAfterABrokerShutdown PASSED
kafka.integration.AutoOffsetResetTest > testResetToLatestWhenOffsetTooLow PASSED
kafka.integration.AutoOffsetResetTest > testResetToEarliestWhenOffsetTooLow PASSED
kafka.integration.AutoOffsetResetTest > testResetToEarliestWhenOffsetTooHigh PASSED
kafka.integration.AutoOffsetResetTest > testResetToLatestWhenOffsetTooHigh PASSED
kafka.integration.SaslPlaintextTopicMetadataTest > testIsrAfterBrokerShutDownAndJoinsBack PASSED
kafka.integration.SaslPlaintextTopicMetadataTest > testAutoCreateTopicWithCollision PASSED
kafka.integration.SaslPlaintextTopicMetadataTest > testAliveBrokerListWithNoTopics PASSED
kafka.integration.SaslPlaintextTopicMetadataTest > testAutoCreateTopic PASSED
kafka.integration.SaslPlaintextTopicMetadataTest > testGetAllTopicMetadata PASSED
kafka.integration.SaslPlaintextTopicMetadataTest > testAliveBrokersListWithNoTopicsAfterNewBrokerStartup PASSED
kafka.integration.SaslPlaintextTopicMetadataTest > testBasicTopicMetadata PASSED
kafka.integration.SaslPlaintextTopicMetadataTest > testTopicMetadataRequest PASSED
kafka.integration.SaslPlaintextTopicMetadataTest > testAliveBrokersListWithNoTopicsAfterABrokerShutdown PASSED
kafka.metrics.KafkaTimerTest > testKafkaTimer PASSED
kafka.utils.UtilsTest > testAbs PASSED
kafka.utils.UtilsTest > testReplaceSuffix PASSED
kafka.utils.UtilsTest > testDoublyLinkedList PASSED
kafka.utils.UtilsTest > testCircularIterator PASSED
kafka.utils.UtilsTest > testReadBytes PASSED
kafka.utils.UtilsTest > testCsvList PASSED
kafka.utils.UtilsTest > testReadInt PASSED
kafka.utils.UtilsTest > testCsvMap PASSED
kafka.utils.UtilsTest > testInLock PASSED
kafka.utils.UtilsTest > testSwallow PASSED
kafka.utils.SchedulerTest > testMockSchedulerNonPeriodicTask PASSED
kafka.utils.SchedulerTest > testMockSchedulerPeriodicTask PASSED
kafka.utils.SchedulerTest > testNonPeriodicTask PASSED
kafka.utils.SchedulerTest > testRestart PASSED
kafka.utils.SchedulerTest > testReentrantTaskInMockScheduler PASSED
kafka.utils.SchedulerTest > testPeriodicTask PASSED
kafka.utils.ByteBoundedBlockingQueueTest > testByteBoundedBlockingQueue PASSED
kafka.utils.CommandLineUtilsTest > testParseEmptyArg PASSED
kafka.utils.CommandLineUtilsTest > testParseSingleArg PASSED
kafka.utils.CommandLineUtilsTest > testParseArgs PASSED
kafka.utils.IteratorTemplateTest > testIterator PASSED
kafka.utils.ReplicationUtilsTest > testUpdateLeaderAndIsr PASSED
kafka.utils.ReplicationUtilsTest > testGetLeaderIsrAndEpochForPartition PASSED
kafka.utils.JsonTest > testJsonEncoding PASSED
kafka.utils.timer.TimerTaskListTest > testAll PASSED
kafka.utils.timer.TimerTest > testAlreadyExpiredTask PASSED
kafka.utils.timer.TimerTest > testTaskExpiration PASSED
kafka.message.MessageCompressionTest > testSimpleCompressDecompress PASSED
kafka.message.MessageWriterTest > testWithNoCompressionAttribute PASSED
kafka.message.MessageWriterTest > testWithCompressionAttribute PASSED
kafka.message.MessageWriterTest > testBufferingOutputStream PASSED
kafka.message.MessageWriterTest > testWithKey PASSED
kafka.message.MessageTest > testChecksum PASSED
kafka.message.MessageTest > testIsHashable PASSED
kafka.message.MessageTest > testFieldValues PASSED
kafka.message.MessageTest > testEquality PASSED
kafka.message.ByteBufferMessageSetTest > testOffsetAssignment PASSED
kafka.message.ByteBufferMessageSetTest > testValidBytes PASSED
kafka.message.ByteBufferMessageSetTest > testValidBytesWithCompression PASSED
kafka.message.ByteBufferMessageSetTest > testIteratorIsConsistent PASSED
kafka.message.ByteBufferMessageSetTest > testWrittenEqualsRead PASSED
kafka.message.ByteBufferMessageSetTest > testWriteTo PASSED
kafka.message.ByteBufferMessageSetTest > testEquals PASSED
kafka.message.ByteBufferMessageSetTest > testSizeInBytes PASSED
kafka.message.ByteBufferMessageSetTest > testIterator PASSED
kafka.tools.ConsoleProducerTest > testParseKeyProp PASSED
kafka.tools.ConsoleProducerTest > testValidConfigsOldProducer PASSED
kafka.tools.ConsoleProducerTest > testInvalidConfigs PASSED
kafka.tools.ConsoleProducerTest > testValidConfigsNewProducer PASSED
kafka.network.SocketServerTest > testMaxConnectionsPerIp PASSED
kafka.network.SocketServerTest > simpleRequest PASSED
kafka.network.SocketServerTest > testSessionPrincipal PASSED
kafka.network.SocketServerTest > testSocketsCloseOnShutdown PASSED
kafka.network.SocketServerTest > testMaxConnectionsPerIPOverrides PASSED
kafka.network.SocketServerTest > testSslSocketServer PASSED
kafka.network.SocketServerTest > tooBigRequestIsRejected PASSED
kafka.zk.ZKPathTest > testCreatePersistentSequentialThrowsException PASSED
kafka.zk.ZKPathTest > testCreatePersistentSequentialExists PASSED
kafka.zk.ZKPathTest > testCreateEphemeralPathExists PASSED
kafka.zk.ZKPathTest > testCreatePersistentPath PASSED
kafka.zk.ZKPathTest > testMakeSurePersistsPathExistsThrowsException PASSED
kafka.zk.ZKPathTest > testCreateEphemeralPathThrowsException PASSED
kafka.zk.ZKPathTest > testCreatePersistentPathThrowsException PASSED
kafka.zk.ZKPathTest > testMakeSurePersistsPathExists PASSED
kafka.zk.ZKEphemeralTest > testOverlappingSessions[0] PASSED
kafka.zk.ZKEphemeralTest > testEphemeralNodeCleanup[0] PASSED
kafka.zk.ZKEphemeralTest > testZkWatchedEphemeral[0] PASSED
kafka.zk.ZKEphemeralTest > testSameSession[0] PASSED
kafka.zk.ZKEphemeralTest > testOverlappingSessions[1] PASSED
kafka.zk.ZKEphemeralTest > testEphemeralNodeCleanup[1] PASSED
kafka.zk.ZKEphemeralTest > testZkWatchedEphemeral[1] PASSED
kafka.zk.ZKEphemeralTest > testSameSession[1] PASSED
kafka.common.ConfigTest > testInvalidGroupIds PASSED
kafka.common.ConfigTest > testInvalidClientIds PASSED
kafka.common.TopicTest > testInvalidTopicNames PASSED
kafka.common.TopicTest > testTopicHasCollision PASSED
kafka.common.TopicTest > testTopicHasCollisionChars PASSED
kafka.common.ZkNodeChangeNotificationListenerTest > testProcessNotification PASSED
630 tests completed, 3 failed
:kafka-trunk-jdk7:core:test FAILED
:test_core_2_11_7 FAILED
FAILURE: Build failed with an exception.
* What went wrong:
Execution failed for task ':core:test'.
> There were failing tests. See the report at: file:///x1/jenkins/jenkins-slave/workspace/kafka-trunk-jdk7/core/build/reports/tests/index.html
* Try:
Run with --stacktrace option to get the stack trace. Run with --info or --debug option to get more log output.
BUILD FAILED
Total time: 1 hrs 15 mins 55.444 secs
Build step 'Execute shell' marked build as failure
Recording test results
Setting GRADLE_2_4_RC_2_HOME=/home/jenkins/jenkins-slave/tools/hudson.plugins.gradle.GradleInstallation/Gradle_2.4-rc-2
Setting JDK_1_7U51_HOME=/home/jenkins/jenkins-slave/tools/hudson.model.JDK/jdk-1.7u51
Setting GRADLE_2_4_RC_2_HOME=/home/jenkins/jenkins-slave/tools/hudson.plugins.gradle.GradleInstallation/Gradle_2.4-rc-2
Setting JDK_1_7U51_HOME=/home/jenkins/jenkins-slave/tools/hudson.model.JDK/jdk-1.7u51
Build failed in Jenkins: kafka-trunk-jdk7 #758
Posted by Apache Jenkins Server <je...@builds.apache.org>.
See <https://builds.apache.org/job/kafka-trunk-jdk7/758/changes>
Changes:
[wangguoz] KAFKA-2744: Commit source task offsets after task is completely stopped
------------------------------------------
[...truncated 124 lines...]
:kafka-trunk-jdk7:clients:determineCommitId UP-TO-DATE
:kafka-trunk-jdk7:clients:createVersionFile
:kafka-trunk-jdk7:clients:jar UP-TO-DATE
:kafka-trunk-jdk7:core:compileJava UP-TO-DATE
:kafka-trunk-jdk7:core:compileScala
<https://builds.apache.org/job/kafka-trunk-jdk7/ws/core/src/main/scala/kafka/api/OffsetCommitRequest.scala>:78: value DEFAULT_TIMESTAMP in object OffsetCommitRequest is deprecated: see corresponding Javadoc for more information.
org.apache.kafka.common.requests.OffsetCommitRequest.DEFAULT_TIMESTAMP
^
<https://builds.apache.org/job/kafka-trunk-jdk7/ws/core/src/main/scala/kafka/common/OffsetMetadataAndError.scala>:36: value DEFAULT_TIMESTAMP in object OffsetCommitRequest is deprecated: see corresponding Javadoc for more information.
commitTimestamp: Long = org.apache.kafka.common.requests.OffsetCommitRequest.DEFAULT_TIMESTAMP,
^
<https://builds.apache.org/job/kafka-trunk-jdk7/ws/core/src/main/scala/kafka/common/OffsetMetadataAndError.scala>:37: value DEFAULT_TIMESTAMP in object OffsetCommitRequest is deprecated: see corresponding Javadoc for more information.
expireTimestamp: Long = org.apache.kafka.common.requests.OffsetCommitRequest.DEFAULT_TIMESTAMP) {
^
<https://builds.apache.org/job/kafka-trunk-jdk7/ws/core/src/main/scala/kafka/coordinator/GroupMetadataManager.scala>:392: value DEFAULT_TIMESTAMP in object OffsetCommitRequest is deprecated: see corresponding Javadoc for more information.
if (value.expireTimestamp == org.apache.kafka.common.requests.OffsetCommitRequest.DEFAULT_TIMESTAMP)
^
<https://builds.apache.org/job/kafka-trunk-jdk7/ws/core/src/main/scala/kafka/server/KafkaApis.scala>:273: value DEFAULT_TIMESTAMP in object OffsetCommitRequest is deprecated: see corresponding Javadoc for more information.
if (offsetAndMetadata.commitTimestamp == org.apache.kafka.common.requests.OffsetCommitRequest.DEFAULT_TIMESTAMP)
^
<https://builds.apache.org/job/kafka-trunk-jdk7/ws/core/src/main/scala/kafka/server/KafkaServer.scala>:293: a pure expression does nothing in statement position; you may be omitting necessary parentheses
ControllerStats.uncleanLeaderElectionRate
^
<https://builds.apache.org/job/kafka-trunk-jdk7/ws/core/src/main/scala/kafka/server/KafkaServer.scala>:294: a pure expression does nothing in statement position; you may be omitting necessary parentheses
ControllerStats.leaderElectionTimer
^
<https://builds.apache.org/job/kafka-trunk-jdk7/ws/core/src/main/scala/kafka/tools/ConsoleProducer.scala>:115: value METADATA_FETCH_TIMEOUT_CONFIG in object ProducerConfig is deprecated: see corresponding Javadoc for more information.
props.put(ProducerConfig.METADATA_FETCH_TIMEOUT_CONFIG, config.metadataFetchTimeoutMs.toString)
^
<https://builds.apache.org/job/kafka-trunk-jdk7/ws/core/src/main/scala/kafka/tools/ConsoleProducer.scala>:117: value TIMEOUT_CONFIG in object ProducerConfig is deprecated: see corresponding Javadoc for more information.
props.put(ProducerConfig.TIMEOUT_CONFIG, config.requestTimeoutMs.toString)
^
<https://builds.apache.org/job/kafka-trunk-jdk7/ws/core/src/main/scala/kafka/tools/ConsoleProducer.scala>:121: value BLOCK_ON_BUFFER_FULL_CONFIG in object ProducerConfig is deprecated: see corresponding Javadoc for more information.
props.put(ProducerConfig.BLOCK_ON_BUFFER_FULL_CONFIG, "false")
^
<https://builds.apache.org/job/kafka-trunk-jdk7/ws/core/src/main/scala/kafka/tools/EndToEndLatency.scala>:75: value BLOCK_ON_BUFFER_FULL_CONFIG in object ProducerConfig is deprecated: see corresponding Javadoc for more information.
producerProps.put(ProducerConfig.BLOCK_ON_BUFFER_FULL_CONFIG, "true")
^
<https://builds.apache.org/job/kafka-trunk-jdk7/ws/core/src/main/scala/kafka/tools/MirrorMaker.scala>:194: value BLOCK_ON_BUFFER_FULL_CONFIG in object ProducerConfig is deprecated: see corresponding Javadoc for more information.
maybeSetDefaultProperty(producerProps, ProducerConfig.BLOCK_ON_BUFFER_FULL_CONFIG, "true")
^
<https://builds.apache.org/job/kafka-trunk-jdk7/ws/core/src/main/scala/kafka/admin/AclCommand.scala>:234: method readLine in class DeprecatedConsole is deprecated: Use the method in scala.io.StdIn
Console.readLine().equalsIgnoreCase("y")
^
<https://builds.apache.org/job/kafka-trunk-jdk7/ws/core/src/main/scala/kafka/admin/TopicCommand.scala>:353: method readLine in class DeprecatedConsole is deprecated: Use the method in scala.io.StdIn
if (!Console.readLine().equalsIgnoreCase("y")) {
^
<https://builds.apache.org/job/kafka-trunk-jdk7/ws/core/src/main/scala/kafka/controller/ControllerChannelManager.scala>:389: class BrokerEndPoint in object UpdateMetadataRequest is deprecated: see corresponding Javadoc for more information.
new UpdateMetadataRequest.BrokerEndPoint(brokerEndPoint.id, brokerEndPoint.host, brokerEndPoint.port)
^
<https://builds.apache.org/job/kafka-trunk-jdk7/ws/core/src/main/scala/kafka/controller/ControllerChannelManager.scala>:391: constructor UpdateMetadataRequest in class UpdateMetadataRequest is deprecated: see corresponding Javadoc for more information.
new UpdateMetadataRequest(controllerId, controllerEpoch, liveBrokers.asJava, partitionStates.asJava)
^
<https://builds.apache.org/job/kafka-trunk-jdk7/ws/core/src/main/scala/kafka/network/BlockingChannel.scala>:129: method readFromReadableChannel in class NetworkReceive is deprecated: see corresponding Javadoc for more information.
response.readFromReadableChannel(channel)
^
<https://builds.apache.org/job/kafka-trunk-jdk7/ws/core/src/main/scala/kafka/coordinator/GroupCoordinator.scala>:665: Reference to uninitialized value NoState
val EmptyGroup = GroupSummary(NoState, NoProtocolType, NoProtocol, NoMembers)
^
<https://builds.apache.org/job/kafka-trunk-jdk7/ws/core/src/main/scala/kafka/coordinator/GroupCoordinator.scala>:665: Reference to uninitialized value NoProtocolType
val EmptyGroup = GroupSummary(NoState, NoProtocolType, NoProtocol, NoMembers)
^
<https://builds.apache.org/job/kafka-trunk-jdk7/ws/core/src/main/scala/kafka/coordinator/GroupCoordinator.scala>:665: Reference to uninitialized value NoProtocol
val EmptyGroup = GroupSummary(NoState, NoProtocolType, NoProtocol, NoMembers)
^
<https://builds.apache.org/job/kafka-trunk-jdk7/ws/core/src/main/scala/kafka/coordinator/GroupCoordinator.scala>:665: Reference to uninitialized value NoMembers
val EmptyGroup = GroupSummary(NoState, NoProtocolType, NoProtocol, NoMembers)
^
<https://builds.apache.org/job/kafka-trunk-jdk7/ws/core/src/main/scala/kafka/coordinator/GroupCoordinator.scala>:666: Reference to uninitialized value NoProtocolType
val DeadGroup = GroupSummary(Dead.toString, NoProtocolType, NoProtocol, NoMembers)
^
<https://builds.apache.org/job/kafka-trunk-jdk7/ws/core/src/main/scala/kafka/coordinator/GroupCoordinator.scala>:666: Reference to uninitialized value NoProtocol
val DeadGroup = GroupSummary(Dead.toString, NoProtocolType, NoProtocol, NoMembers)
^
<https://builds.apache.org/job/kafka-trunk-jdk7/ws/core/src/main/scala/kafka/coordinator/GroupCoordinator.scala>:666: Reference to uninitialized value NoMembers
val DeadGroup = GroupSummary(Dead.toString, NoProtocolType, NoProtocol, NoMembers)
^
there were 15 feature warnings; re-run with -feature for details
25 warnings found
:kafka-trunk-jdk7:core:processResources UP-TO-DATE
:kafka-trunk-jdk7:core:classes
:kafka-trunk-jdk7:clients:compileTestJava UP-TO-DATE
:kafka-trunk-jdk7:clients:processTestResources UP-TO-DATE
:kafka-trunk-jdk7:clients:testClasses UP-TO-DATE
:kafka-trunk-jdk7:core:copyDependantLibs
:kafka-trunk-jdk7:core:copyDependantTestLibs
:kafka-trunk-jdk7:core:jar
:clients:compileJava UP-TO-DATE
:clients:processResources UP-TO-DATE
:clients:classes UP-TO-DATE
:clients:determineCommitId UP-TO-DATE
:clients:createVersionFile
:clients:jar UP-TO-DATE
:core:compileJava UP-TO-DATE
:core:compileScala
<https://builds.apache.org/job/kafka-trunk-jdk7/ws/core/src/main/scala/kafka/api/OffsetCommitRequest.scala>:78: value DEFAULT_TIMESTAMP in object OffsetCommitRequest is deprecated: see corresponding Javadoc for more information.
org.apache.kafka.common.requests.OffsetCommitRequest.DEFAULT_TIMESTAMP
^
<https://builds.apache.org/job/kafka-trunk-jdk7/ws/core/src/main/scala/kafka/common/OffsetMetadataAndError.scala>:36: value DEFAULT_TIMESTAMP in object OffsetCommitRequest is deprecated: see corresponding Javadoc for more information.
commitTimestamp: Long = org.apache.kafka.common.requests.OffsetCommitRequest.DEFAULT_TIMESTAMP,
^
<https://builds.apache.org/job/kafka-trunk-jdk7/ws/core/src/main/scala/kafka/common/OffsetMetadataAndError.scala>:37: value DEFAULT_TIMESTAMP in object OffsetCommitRequest is deprecated: see corresponding Javadoc for more information.
expireTimestamp: Long = org.apache.kafka.common.requests.OffsetCommitRequest.DEFAULT_TIMESTAMP) {
^
<https://builds.apache.org/job/kafka-trunk-jdk7/ws/core/src/main/scala/kafka/coordinator/GroupMetadataManager.scala>:392: value DEFAULT_TIMESTAMP in object OffsetCommitRequest is deprecated: see corresponding Javadoc for more information.
if (value.expireTimestamp == org.apache.kafka.common.requests.OffsetCommitRequest.DEFAULT_TIMESTAMP)
^
<https://builds.apache.org/job/kafka-trunk-jdk7/ws/core/src/main/scala/kafka/server/KafkaApis.scala>:273: value DEFAULT_TIMESTAMP in object OffsetCommitRequest is deprecated: see corresponding Javadoc for more information.
if (offsetAndMetadata.commitTimestamp == org.apache.kafka.common.requests.OffsetCommitRequest.DEFAULT_TIMESTAMP)
^
<https://builds.apache.org/job/kafka-trunk-jdk7/ws/core/src/main/scala/kafka/server/KafkaServer.scala>:293: a pure expression does nothing in statement position; you may be omitting necessary parentheses
ControllerStats.uncleanLeaderElectionRate
^
<https://builds.apache.org/job/kafka-trunk-jdk7/ws/core/src/main/scala/kafka/server/KafkaServer.scala>:294: a pure expression does nothing in statement position; you may be omitting necessary parentheses
ControllerStats.leaderElectionTimer
^
<https://builds.apache.org/job/kafka-trunk-jdk7/ws/core/src/main/scala/kafka/tools/ConsoleProducer.scala>:115: value METADATA_FETCH_TIMEOUT_CONFIG in object ProducerConfig is deprecated: see corresponding Javadoc for more information.
props.put(ProducerConfig.METADATA_FETCH_TIMEOUT_CONFIG, config.metadataFetchTimeoutMs.toString)
^
<https://builds.apache.org/job/kafka-trunk-jdk7/ws/core/src/main/scala/kafka/tools/ConsoleProducer.scala>:117: value TIMEOUT_CONFIG in object ProducerConfig is deprecated: see corresponding Javadoc for more information.
props.put(ProducerConfig.TIMEOUT_CONFIG, config.requestTimeoutMs.toString)
^
<https://builds.apache.org/job/kafka-trunk-jdk7/ws/core/src/main/scala/kafka/tools/ConsoleProducer.scala>:121: value BLOCK_ON_BUFFER_FULL_CONFIG in object ProducerConfig is deprecated: see corresponding Javadoc for more information.
props.put(ProducerConfig.BLOCK_ON_BUFFER_FULL_CONFIG, "false")
^
<https://builds.apache.org/job/kafka-trunk-jdk7/ws/core/src/main/scala/kafka/tools/EndToEndLatency.scala>:75: value BLOCK_ON_BUFFER_FULL_CONFIG in object ProducerConfig is deprecated: see corresponding Javadoc for more information.
producerProps.put(ProducerConfig.BLOCK_ON_BUFFER_FULL_CONFIG, "true")
^
<https://builds.apache.org/job/kafka-trunk-jdk7/ws/core/src/main/scala/kafka/tools/MirrorMaker.scala>:194: value BLOCK_ON_BUFFER_FULL_CONFIG in object ProducerConfig is deprecated: see corresponding Javadoc for more information.
maybeSetDefaultProperty(producerProps, ProducerConfig.BLOCK_ON_BUFFER_FULL_CONFIG, "true")
^
<https://builds.apache.org/job/kafka-trunk-jdk7/ws/core/src/main/scala/kafka/controller/ControllerChannelManager.scala>:389: class BrokerEndPoint in object UpdateMetadataRequest is deprecated: see corresponding Javadoc for more information.
new UpdateMetadataRequest.BrokerEndPoint(brokerEndPoint.id, brokerEndPoint.host, brokerEndPoint.port)
^
<https://builds.apache.org/job/kafka-trunk-jdk7/ws/core/src/main/scala/kafka/controller/ControllerChannelManager.scala>:391: constructor UpdateMetadataRequest in class UpdateMetadataRequest is deprecated: see corresponding Javadoc for more information.
new UpdateMetadataRequest(controllerId, controllerEpoch, liveBrokers.asJava, partitionStates.asJava)
^
<https://builds.apache.org/job/kafka-trunk-jdk7/ws/core/src/main/scala/kafka/network/BlockingChannel.scala>:129: method readFromReadableChannel in class NetworkReceive is deprecated: see corresponding Javadoc for more information.
response.readFromReadableChannel(channel)
^
there were 15 feature warning(s); re-run with -feature for details
16 warnings found
:core:processResources UP-TO-DATE
:core:classes
:clients:compileTestJava UP-TO-DATE
:clients:processTestResources UP-TO-DATE
:clients:testClasses UP-TO-DATE
:core:copyDependantLibs UP-TO-DATE
:core:copyDependantTestLibs
:core:jar UP-TO-DATE
:examples:compileJava
:examples:processResources UP-TO-DATE
:examples:classes
:examples:jar
:log4j-appender:compileJava
:log4j-appender:processResources UP-TO-DATE
:log4j-appender:classes
:log4j-appender:jar
:streams:compileJavaNote: Some input files use unchecked or unsafe operations.
Note: Recompile with -Xlint:unchecked for details.
:streams:processResources UP-TO-DATE
:streams:classes
:clients:javadoc
:clients:javadocJar
:clients:srcJar
:clients:testJar
:clients:signArchives SKIPPED
:streams:copyDependantLibs
:streams:jar
:tools:compileJava
:tools:processResources UP-TO-DATE
:tools:classes
:tools:copyDependantLibs
:tools:jar
:contrib:hadoop-consumer:compileJavaNote: Some input files use or override a deprecated API.
Note: Recompile with -Xlint:deprecation for details.
Note: Some input files use unchecked or unsafe operations.
Note: Recompile with -Xlint:unchecked for details.
:contrib:hadoop-consumer:processResources UP-TO-DATE
:contrib:hadoop-consumer:classes
:contrib:hadoop-consumer:jar
:contrib:hadoop-producer:compileJava
:contrib:hadoop-producer:processResources UP-TO-DATE
:contrib:hadoop-producer:classes
:contrib:hadoop-producer:jar
:copycat:api:compileJavaNote: <https://builds.apache.org/job/kafka-trunk-jdk7/ws/copycat/api/src/main/java/org/apache/kafka/copycat/data/Struct.java> uses unchecked or unsafe operations.
Note: Recompile with -Xlint:unchecked for details.
:copycat:api:processResources UP-TO-DATE
:copycat:api:classes
:copycat:api:copyDependantLibs
:copycat:api:jar
:copycat:file:compileJava
:copycat:file:processResources UP-TO-DATE
:copycat:file:classes
:copycat:file:copyDependantLibs
:copycat:file:jar
:copycat:json:compileJavaNote: <https://builds.apache.org/job/kafka-trunk-jdk7/ws/copycat/json/src/main/java/org/apache/kafka/copycat/json/JsonConverter.java> uses or overrides a deprecated API.
Note: Recompile with -Xlint:deprecation for details.
:copycat:json:processResources UP-TO-DATE
:copycat:json:classes
:copycat:json:copyDependantLibs
:copycat:json:jar
:copycat:runtime:compileJavaNote: Some input files use unchecked or unsafe operations.
Note: Recompile with -Xlint:unchecked for details.
:copycat:runtime:processResources UP-TO-DATE
:copycat:runtime:classes
:copycat:runtime:copyDependantLibs
:copycat:runtime:jar
:jarAll
:docsJar_2_10_5
Building project 'core' with Scala version 2.10.5
:kafka-trunk-jdk7:clients:compileJava UP-TO-DATE
:kafka-trunk-jdk7:clients:processResources UP-TO-DATE
:kafka-trunk-jdk7:clients:classes UP-TO-DATE
:kafka-trunk-jdk7:clients:determineCommitId UP-TO-DATE
:kafka-trunk-jdk7:clients:createVersionFile
:kafka-trunk-jdk7:clients:jar UP-TO-DATE
:kafka-trunk-jdk7:clients:javadoc UP-TO-DATE
:kafka-trunk-jdk7:core:compileJava UP-TO-DATE
:kafka-trunk-jdk7:core:compileScala UP-TO-DATE
:kafka-trunk-jdk7:core:processResources UP-TO-DATE
:kafka-trunk-jdk7:core:classes UP-TO-DATE
:kafka-trunk-jdk7:core:javadoc
:docsJar_2_10_5 FAILED
FAILURE: Build failed with an exception.
* What went wrong:
Could not read entry ':core:javadoc' from cache taskArtifacts.bin (<https://builds.apache.org/job/kafka-trunk-jdk7/ws/.gradle/2.8/taskArtifacts/taskArtifacts.bin).>
> java.io.EOFException (no error message)
* Try:
Run with --stacktrace option to get the stack trace. Run with --info or --debug option to get more log output.
BUILD FAILED
Total time: 4 mins 21.832 secs
Build step 'Execute shell' marked build as failure
Recording test results
Setting GRADLE_2_4_RC_2_HOME=/home/jenkins/jenkins-slave/tools/hudson.plugins.gradle.GradleInstallation/Gradle_2.4-rc-2
Setting JDK_1_7U51_HOME=/home/jenkins/jenkins-slave/tools/hudson.model.JDK/jdk-1.7u51
ERROR: Publisher 'Publish JUnit test result report' failed: No test report files were found. Configuration error?
Setting GRADLE_2_4_RC_2_HOME=/home/jenkins/jenkins-slave/tools/hudson.plugins.gradle.GradleInstallation/Gradle_2.4-rc-2
Setting JDK_1_7U51_HOME=/home/jenkins/jenkins-slave/tools/hudson.model.JDK/jdk-1.7u51
Build failed in Jenkins: kafka-trunk-jdk7 #757
Posted by Apache Jenkins Server <je...@builds.apache.org>.
See <https://builds.apache.org/job/kafka-trunk-jdk7/757/changes>
Changes:
[wangguoz] KAFKA-2727: Topology partial construction
[wangguoz] KAFKA-2737: Added single- and multi-consumer integration tests for
[cshapi] KAFKA-2730: use thread-id as metrics tags
[cshapi] KAFKA-2691: Improve handling of authorization failure during metadata
------------------------------------------
Started by an SCM change
[EnvInject] - Loading node environment variables.
Building remotely on ubuntu-5 (docker Ubuntu ubuntu5 ubuntu) in workspace <https://builds.apache.org/job/kafka-trunk-jdk7/ws/>
> git rev-parse --is-inside-work-tree # timeout=10
Fetching changes from the remote Git repository
> git config remote.origin.url https://git-wip-us.apache.org/repos/asf/kafka.git # timeout=10
Fetching upstream changes from https://git-wip-us.apache.org/repos/asf/kafka.git
> git --version # timeout=10
> git -c core.askpass=true fetch --tags --progress https://git-wip-us.apache.org/repos/asf/kafka.git +refs/heads/*:refs/remotes/origin/*
> git rev-parse refs/remotes/origin/trunk^{commit} # timeout=10
> git rev-parse refs/remotes/origin/origin/trunk^{commit} # timeout=10
Checking out Revision c39e79bb5af5b4e56bec358f8ec3758e6822dbcf (refs/remotes/origin/trunk)
> git config core.sparsecheckout # timeout=10
> git checkout -f c39e79bb5af5b4e56bec358f8ec3758e6822dbcf
> git rev-list 7ded64bc2edf8645d7fd113633a56791bf1e8e4a # timeout=10
Setting GRADLE_2_4_RC_2_HOME=/home/jenkins/jenkins-slave/tools/hudson.plugins.gradle.GradleInstallation/Gradle_2.4-rc-2
Setting JDK_1_7U51_HOME=/home/jenkins/jenkins-slave/tools/hudson.model.JDK/jdk-1.7u51
[kafka-trunk-jdk7] $ /bin/bash -xe /tmp/hudson8661115942565517480.sh
+ /home/jenkins/jenkins-slave/tools/hudson.plugins.gradle.GradleInstallation/Gradle_2.4-rc-2/bin/gradle
To honour the JVM settings for this build a new JVM will be forked. Please consider using the daemon: http://gradle.org/docs/2.4-rc-2/userguide/gradle_daemon.html.
Building project 'core' with Scala version 2.10.5
:downloadWrapper UP-TO-DATE
BUILD SUCCESSFUL
Total time: 16.525 secs
Setting GRADLE_2_4_RC_2_HOME=/home/jenkins/jenkins-slave/tools/hudson.plugins.gradle.GradleInstallation/Gradle_2.4-rc-2
Setting JDK_1_7U51_HOME=/home/jenkins/jenkins-slave/tools/hudson.model.JDK/jdk-1.7u51
[kafka-trunk-jdk7] $ /bin/bash -xe /tmp/hudson356459870365238869.sh
+ ./gradlew -Dorg.gradle.project.maxParallelForks=1 clean jarAll docsJarAll testAll
To honour the JVM settings for this build a new JVM will be forked. Please consider using the daemon: https://docs.gradle.org/2.8/userguide/gradle_daemon.html.
Building project 'core' with Scala version 2.10.5
:clean UP-TO-DATE
:clients:clean
:contrib:clean UP-TO-DATE
:copycat:clean UP-TO-DATE
:core:clean
:examples:clean
:log4j-appender:clean
:streams:clean
:tools:clean
:contrib:hadoop-consumer:clean
:contrib:hadoop-producer:clean
:copycat:api:clean
:copycat:file:clean
:copycat:json:clean
:copycat:runtime:clean
:jar_core_2_10_5
Building project 'core' with Scala version 2.10.5
:kafka-trunk-jdk7:clients:compileJava
:jar_core_2_10_5 FAILED
FAILURE: Build failed with an exception.
* What went wrong:
Failed to capture snapshot of input files for task 'compileJava' during up-to-date check. See stacktrace for details.
> Could not add entry '<https://builds.apache.org/job/kafka-trunk-jdk7/ws/clients/src/main/java/org/apache/kafka/clients/ManualMetadataUpdater.java'> to cache fileHashes.bin (<https://builds.apache.org/job/kafka-trunk-jdk7/ws/.gradle/2.8/taskArtifacts/fileHashes.bin).>
* Try:
Run with --stacktrace option to get the stack trace. Run with --info or --debug option to get more log output.
BUILD FAILED
Total time: 18.353 secs
Build step 'Execute shell' marked build as failure
Recording test results
Setting GRADLE_2_4_RC_2_HOME=/home/jenkins/jenkins-slave/tools/hudson.plugins.gradle.GradleInstallation/Gradle_2.4-rc-2
Setting JDK_1_7U51_HOME=/home/jenkins/jenkins-slave/tools/hudson.model.JDK/jdk-1.7u51
ERROR: Publisher 'Publish JUnit test result report' failed: No test report files were found. Configuration error?
Setting GRADLE_2_4_RC_2_HOME=/home/jenkins/jenkins-slave/tools/hudson.plugins.gradle.GradleInstallation/Gradle_2.4-rc-2
Setting JDK_1_7U51_HOME=/home/jenkins/jenkins-slave/tools/hudson.model.JDK/jdk-1.7u51
Build failed in Jenkins: kafka-trunk-jdk7 #756
Posted by Apache Jenkins Server <je...@builds.apache.org>.
See <https://builds.apache.org/job/kafka-trunk-jdk7/756/changes>
Changes:
[wangguoz] KAFKA-2740: Convert Windows bin scripts from CRLF to LF line encodings
------------------------------------------
Started by an SCM change
[EnvInject] - Loading node environment variables.
Building remotely on H11 (Ubuntu ubuntu) in workspace <https://builds.apache.org/job/kafka-trunk-jdk7/ws/>
> git rev-parse --is-inside-work-tree # timeout=10
Fetching changes from the remote Git repository
> git config remote.origin.url https://git-wip-us.apache.org/repos/asf/kafka.git # timeout=10
Fetching upstream changes from https://git-wip-us.apache.org/repos/asf/kafka.git
> git --version # timeout=10
> git -c core.askpass=true fetch --tags --progress https://git-wip-us.apache.org/repos/asf/kafka.git +refs/heads/*:refs/remotes/origin/*
> git rev-parse refs/remotes/origin/trunk^{commit} # timeout=10
> git rev-parse refs/remotes/origin/origin/trunk^{commit} # timeout=10
Checking out Revision 7ded64bc2edf8645d7fd113633a56791bf1e8e4a (refs/remotes/origin/trunk)
> git config core.sparsecheckout # timeout=10
> git checkout -f 7ded64bc2edf8645d7fd113633a56791bf1e8e4a
> git rev-list 70a7d5786cc3f04b5f3d964eb1fd1d826e9b9e0f # timeout=10
Setting GRADLE_2_4_RC_2_HOME=/home/jenkins/jenkins-slave/tools/hudson.plugins.gradle.GradleInstallation/Gradle_2.4-rc-2
Setting JDK_1_7U51_HOME=/home/jenkins/jenkins-slave/tools/hudson.model.JDK/jdk-1.7u51
[kafka-trunk-jdk7] $ /bin/bash -xe /tmp/hudson8987651918272700004.sh
+ /home/jenkins/jenkins-slave/tools/hudson.plugins.gradle.GradleInstallation/Gradle_2.4-rc-2/bin/gradle
To honour the JVM settings for this build a new JVM will be forked. Please consider using the daemon: http://gradle.org/docs/2.4-rc-2/userguide/gradle_daemon.html.
Building project 'core' with Scala version 2.10.5
:downloadWrapper UP-TO-DATE
BUILD SUCCESSFUL
Total time: 12.033 secs
Setting GRADLE_2_4_RC_2_HOME=/home/jenkins/jenkins-slave/tools/hudson.plugins.gradle.GradleInstallation/Gradle_2.4-rc-2
Setting JDK_1_7U51_HOME=/home/jenkins/jenkins-slave/tools/hudson.model.JDK/jdk-1.7u51
[kafka-trunk-jdk7] $ /bin/bash -xe /tmp/hudson8136075842187995279.sh
+ ./gradlew -Dorg.gradle.project.maxParallelForks=1 clean jarAll docsJarAll testAll
To honour the JVM settings for this build a new JVM will be forked. Please consider using the daemon: https://docs.gradle.org/2.8/userguide/gradle_daemon.html.
Building project 'core' with Scala version 2.10.5
:clean UP-TO-DATE
:clients:clean UP-TO-DATE
:contrib:clean UP-TO-DATE
:copycat:clean UP-TO-DATE
:core:clean UP-TO-DATE
:examples:clean UP-TO-DATE
:log4j-appender:clean UP-TO-DATE
:streams:clean UP-TO-DATE
:tools:clean UP-TO-DATE
:contrib:hadoop-consumer:clean UP-TO-DATE
:contrib:hadoop-producer:clean UP-TO-DATE
:copycat:api:clean UP-TO-DATE
:copycat:file:clean UP-TO-DATE
:copycat:json:clean UP-TO-DATE
:copycat:runtime:clean UP-TO-DATE
:jar_core_2_10_5
Building project 'core' with Scala version 2.10.5
:kafka-trunk-jdk7:clients:compileJava
:jar_core_2_10_5 FAILED
FAILURE: Build failed with an exception.
* What went wrong:
Failed to capture snapshot of input files for task 'compileJava' during up-to-date check. See stacktrace for details.
> Could not add entry '<https://builds.apache.org/job/kafka-trunk-jdk7/ws/clients/src/main/java/org/apache/kafka/common/requests/GroupCoordinatorResponse.java'> to cache fileHashes.bin (<https://builds.apache.org/job/kafka-trunk-jdk7/ws/.gradle/2.8/taskArtifacts/fileHashes.bin).>
* Try:
Run with --stacktrace option to get the stack trace. Run with --info or --debug option to get more log output.
BUILD FAILED
Total time: 13.42 secs
Build step 'Execute shell' marked build as failure
Recording test results
Setting GRADLE_2_4_RC_2_HOME=/home/jenkins/jenkins-slave/tools/hudson.plugins.gradle.GradleInstallation/Gradle_2.4-rc-2
Setting JDK_1_7U51_HOME=/home/jenkins/jenkins-slave/tools/hudson.model.JDK/jdk-1.7u51
ERROR: Publisher 'Publish JUnit test result report' failed: No test report files were found. Configuration error?
Setting GRADLE_2_4_RC_2_HOME=/home/jenkins/jenkins-slave/tools/hudson.plugins.gradle.GradleInstallation/Gradle_2.4-rc-2
Setting JDK_1_7U51_HOME=/home/jenkins/jenkins-slave/tools/hudson.model.JDK/jdk-1.7u51
Build failed in Jenkins: kafka-trunk-jdk7 #755
Posted by Apache Jenkins Server <je...@builds.apache.org>.
See <https://builds.apache.org/job/kafka-trunk-jdk7/755/changes>
Changes:
[junrao] KAFKA-2722; Improve ISR change propagation.
------------------------------------------
Started by an SCM change
[EnvInject] - Loading node environment variables.
Building remotely on H11 (Ubuntu ubuntu) in workspace <https://builds.apache.org/job/kafka-trunk-jdk7/ws/>
> git rev-parse --is-inside-work-tree # timeout=10
Fetching changes from the remote Git repository
> git config remote.origin.url https://git-wip-us.apache.org/repos/asf/kafka.git # timeout=10
Fetching upstream changes from https://git-wip-us.apache.org/repos/asf/kafka.git
> git --version # timeout=10
> git -c core.askpass=true fetch --tags --progress https://git-wip-us.apache.org/repos/asf/kafka.git +refs/heads/*:refs/remotes/origin/*
> git rev-parse refs/remotes/origin/trunk^{commit} # timeout=10
> git rev-parse refs/remotes/origin/origin/trunk^{commit} # timeout=10
Checking out Revision 70a7d5786cc3f04b5f3d964eb1fd1d826e9b9e0f (refs/remotes/origin/trunk)
> git config core.sparsecheckout # timeout=10
> git checkout -f 70a7d5786cc3f04b5f3d964eb1fd1d826e9b9e0f
> git rev-list 98db5ea94fcf7600137b5072453705c2a62e1f54 # timeout=10
Setting GRADLE_2_4_RC_2_HOME=/home/jenkins/jenkins-slave/tools/hudson.plugins.gradle.GradleInstallation/Gradle_2.4-rc-2
Setting JDK_1_7U51_HOME=/home/jenkins/jenkins-slave/tools/hudson.model.JDK/jdk-1.7u51
[kafka-trunk-jdk7] $ /bin/bash -xe /tmp/hudson4790101061604007061.sh
+ /home/jenkins/jenkins-slave/tools/hudson.plugins.gradle.GradleInstallation/Gradle_2.4-rc-2/bin/gradle
To honour the JVM settings for this build a new JVM will be forked. Please consider using the daemon: http://gradle.org/docs/2.4-rc-2/userguide/gradle_daemon.html.
Building project 'core' with Scala version 2.10.5
:downloadWrapper UP-TO-DATE
BUILD SUCCESSFUL
Total time: 12.837 secs
Setting GRADLE_2_4_RC_2_HOME=/home/jenkins/jenkins-slave/tools/hudson.plugins.gradle.GradleInstallation/Gradle_2.4-rc-2
Setting JDK_1_7U51_HOME=/home/jenkins/jenkins-slave/tools/hudson.model.JDK/jdk-1.7u51
[kafka-trunk-jdk7] $ /bin/bash -xe /tmp/hudson703082196164120070.sh
+ ./gradlew -Dorg.gradle.project.maxParallelForks=1 clean jarAll docsJarAll testAll
To honour the JVM settings for this build a new JVM will be forked. Please consider using the daemon: https://docs.gradle.org/2.8/userguide/gradle_daemon.html.
Building project 'core' with Scala version 2.10.5
:clean UP-TO-DATE
:clients:clean UP-TO-DATE
:contrib:clean UP-TO-DATE
:copycat:clean UP-TO-DATE
:core:clean UP-TO-DATE
:examples:clean UP-TO-DATE
:log4j-appender:clean UP-TO-DATE
:streams:clean UP-TO-DATE
:tools:clean UP-TO-DATE
:contrib:hadoop-consumer:clean UP-TO-DATE
:contrib:hadoop-producer:clean UP-TO-DATE
:copycat:api:clean UP-TO-DATE
:copycat:file:clean UP-TO-DATE
:copycat:json:clean UP-TO-DATE
:copycat:runtime:clean UP-TO-DATE
:jar_core_2_10_5
Building project 'core' with Scala version 2.10.5
:kafka-trunk-jdk7:clients:compileJava
:jar_core_2_10_5 FAILED
FAILURE: Build failed with an exception.
* What went wrong:
Failed to capture snapshot of input files for task 'compileJava' during up-to-date check. See stacktrace for details.
> Could not add entry '<https://builds.apache.org/job/kafka-trunk-jdk7/ws/clients/src/main/java/org/apache/kafka/common/requests/GroupCoordinatorResponse.java'> to cache fileHashes.bin (<https://builds.apache.org/job/kafka-trunk-jdk7/ws/.gradle/2.8/taskArtifacts/fileHashes.bin).>
* Try:
Run with --stacktrace option to get the stack trace. Run with --info or --debug option to get more log output.
BUILD FAILED
Total time: 14.755 secs
Build step 'Execute shell' marked build as failure
Recording test results
Setting GRADLE_2_4_RC_2_HOME=/home/jenkins/jenkins-slave/tools/hudson.plugins.gradle.GradleInstallation/Gradle_2.4-rc-2
Setting JDK_1_7U51_HOME=/home/jenkins/jenkins-slave/tools/hudson.model.JDK/jdk-1.7u51
ERROR: Publisher 'Publish JUnit test result report' failed: No test report files were found. Configuration error?
Setting GRADLE_2_4_RC_2_HOME=/home/jenkins/jenkins-slave/tools/hudson.plugins.gradle.GradleInstallation/Gradle_2.4-rc-2
Setting JDK_1_7U51_HOME=/home/jenkins/jenkins-slave/tools/hudson.model.JDK/jdk-1.7u51
Build failed in Jenkins: kafka-trunk-jdk7 #754
Posted by Apache Jenkins Server <je...@builds.apache.org>.
See <https://builds.apache.org/job/kafka-trunk-jdk7/754/changes>
Changes:
[junrao] KAFKA-2644; Run relevant ducktape tests with SASL_PLAINTEXT and SASL_SSL
------------------------------------------
Started by an SCM change
[EnvInject] - Loading node environment variables.
Building remotely on H11 (Ubuntu ubuntu) in workspace <https://builds.apache.org/job/kafka-trunk-jdk7/ws/>
> git rev-parse --is-inside-work-tree # timeout=10
Fetching changes from the remote Git repository
> git config remote.origin.url https://git-wip-us.apache.org/repos/asf/kafka.git # timeout=10
Fetching upstream changes from https://git-wip-us.apache.org/repos/asf/kafka.git
> git --version # timeout=10
> git -c core.askpass=true fetch --tags --progress https://git-wip-us.apache.org/repos/asf/kafka.git +refs/heads/*:refs/remotes/origin/*
> git rev-parse refs/remotes/origin/trunk^{commit} # timeout=10
> git rev-parse refs/remotes/origin/origin/trunk^{commit} # timeout=10
Checking out Revision 98db5ea94fcf7600137b5072453705c2a62e1f54 (refs/remotes/origin/trunk)
> git config core.sparsecheckout # timeout=10
> git checkout -f 98db5ea94fcf7600137b5072453705c2a62e1f54
> git rev-list 596c203af1f33360c04f4be7c466310d11343f78 # timeout=10
Setting GRADLE_2_4_RC_2_HOME=/home/jenkins/jenkins-slave/tools/hudson.plugins.gradle.GradleInstallation/Gradle_2.4-rc-2
Setting JDK_1_7U51_HOME=/home/jenkins/jenkins-slave/tools/hudson.model.JDK/jdk-1.7u51
[kafka-trunk-jdk7] $ /bin/bash -xe /tmp/hudson7913984734227006215.sh
+ /home/jenkins/jenkins-slave/tools/hudson.plugins.gradle.GradleInstallation/Gradle_2.4-rc-2/bin/gradle
To honour the JVM settings for this build a new JVM will be forked. Please consider using the daemon: http://gradle.org/docs/2.4-rc-2/userguide/gradle_daemon.html.
Building project 'core' with Scala version 2.10.5
:downloadWrapper UP-TO-DATE
BUILD SUCCESSFUL
Total time: 15.636 secs
Setting GRADLE_2_4_RC_2_HOME=/home/jenkins/jenkins-slave/tools/hudson.plugins.gradle.GradleInstallation/Gradle_2.4-rc-2
Setting JDK_1_7U51_HOME=/home/jenkins/jenkins-slave/tools/hudson.model.JDK/jdk-1.7u51
[kafka-trunk-jdk7] $ /bin/bash -xe /tmp/hudson7474139289309530492.sh
+ ./gradlew -Dorg.gradle.project.maxParallelForks=1 clean jarAll docsJarAll testAll
To honour the JVM settings for this build a new JVM will be forked. Please consider using the daemon: https://docs.gradle.org/2.8/userguide/gradle_daemon.html.
Building project 'core' with Scala version 2.10.5
:clean UP-TO-DATE
:clients:clean UP-TO-DATE
:contrib:clean UP-TO-DATE
:copycat:clean UP-TO-DATE
:core:clean UP-TO-DATE
:examples:clean UP-TO-DATE
:log4j-appender:clean UP-TO-DATE
:streams:clean UP-TO-DATE
:tools:clean UP-TO-DATE
:contrib:hadoop-consumer:clean UP-TO-DATE
:contrib:hadoop-producer:clean UP-TO-DATE
:copycat:api:clean UP-TO-DATE
:copycat:file:clean UP-TO-DATE
:copycat:json:clean UP-TO-DATE
:copycat:runtime:clean UP-TO-DATE
:jar_core_2_10_5
Building project 'core' with Scala version 2.10.5
:kafka-trunk-jdk7:clients:compileJava
:jar_core_2_10_5 FAILED
FAILURE: Build failed with an exception.
* What went wrong:
Failed to capture snapshot of input files for task 'compileJava' during up-to-date check. See stacktrace for details.
> Could not add entry '<https://builds.apache.org/job/kafka-trunk-jdk7/ws/clients/src/main/java/org/apache/kafka/common/requests/GroupCoordinatorResponse.java'> to cache fileHashes.bin (<https://builds.apache.org/job/kafka-trunk-jdk7/ws/.gradle/2.8/taskArtifacts/fileHashes.bin).>
* Try:
Run with --stacktrace option to get the stack trace. Run with --info or --debug option to get more log output.
BUILD FAILED
Total time: 16.908 secs
Build step 'Execute shell' marked build as failure
Recording test results
Setting GRADLE_2_4_RC_2_HOME=/home/jenkins/jenkins-slave/tools/hudson.plugins.gradle.GradleInstallation/Gradle_2.4-rc-2
Setting JDK_1_7U51_HOME=/home/jenkins/jenkins-slave/tools/hudson.model.JDK/jdk-1.7u51
ERROR: Publisher 'Publish JUnit test result report' failed: No test report files were found. Configuration error?
Setting GRADLE_2_4_RC_2_HOME=/home/jenkins/jenkins-slave/tools/hudson.plugins.gradle.GradleInstallation/Gradle_2.4-rc-2
Setting JDK_1_7U51_HOME=/home/jenkins/jenkins-slave/tools/hudson.model.JDK/jdk-1.7u51
Build failed in Jenkins: kafka-trunk-jdk7 #753
Posted by Apache Jenkins Server <je...@builds.apache.org>.
See <https://builds.apache.org/job/kafka-trunk-jdk7/753/changes>
Changes:
[wangguoz] KAFKA-2687: Add support for ListGroups and DescribeGroup APIs
------------------------------------------
Started by an SCM change
[EnvInject] - Loading node environment variables.
Building remotely on H11 (Ubuntu ubuntu) in workspace <https://builds.apache.org/job/kafka-trunk-jdk7/ws/>
> git rev-parse --is-inside-work-tree # timeout=10
Fetching changes from the remote Git repository
> git config remote.origin.url https://git-wip-us.apache.org/repos/asf/kafka.git # timeout=10
Fetching upstream changes from https://git-wip-us.apache.org/repos/asf/kafka.git
> git --version # timeout=10
> git -c core.askpass=true fetch --tags --progress https://git-wip-us.apache.org/repos/asf/kafka.git +refs/heads/*:refs/remotes/origin/*
> git rev-parse refs/remotes/origin/trunk^{commit} # timeout=10
> git rev-parse refs/remotes/origin/origin/trunk^{commit} # timeout=10
Checking out Revision 596c203af1f33360c04f4be7c466310d11343f78 (refs/remotes/origin/trunk)
> git config core.sparsecheckout # timeout=10
> git checkout -f 596c203af1f33360c04f4be7c466310d11343f78
> git rev-list f413143eddd713dc5f03d53fdeb10e4e7f3738b1 # timeout=10
Setting GRADLE_2_4_RC_2_HOME=/home/jenkins/jenkins-slave/tools/hudson.plugins.gradle.GradleInstallation/Gradle_2.4-rc-2
Setting JDK_1_7U51_HOME=/home/jenkins/jenkins-slave/tools/hudson.model.JDK/jdk-1.7u51
[kafka-trunk-jdk7] $ /bin/bash -xe /tmp/hudson1636439642232168162.sh
+ /home/jenkins/jenkins-slave/tools/hudson.plugins.gradle.GradleInstallation/Gradle_2.4-rc-2/bin/gradle
To honour the JVM settings for this build a new JVM will be forked. Please consider using the daemon: http://gradle.org/docs/2.4-rc-2/userguide/gradle_daemon.html.
Building project 'core' with Scala version 2.10.5
:downloadWrapper UP-TO-DATE
BUILD SUCCESSFUL
Total time: 15.118 secs
Setting GRADLE_2_4_RC_2_HOME=/home/jenkins/jenkins-slave/tools/hudson.plugins.gradle.GradleInstallation/Gradle_2.4-rc-2
Setting JDK_1_7U51_HOME=/home/jenkins/jenkins-slave/tools/hudson.model.JDK/jdk-1.7u51
[kafka-trunk-jdk7] $ /bin/bash -xe /tmp/hudson7324184418762666047.sh
+ ./gradlew -Dorg.gradle.project.maxParallelForks=1 clean jarAll docsJarAll testAll
To honour the JVM settings for this build a new JVM will be forked. Please consider using the daemon: https://docs.gradle.org/2.8/userguide/gradle_daemon.html.
Building project 'core' with Scala version 2.10.5
:clean UP-TO-DATE
:clients:clean
:contrib:clean UP-TO-DATE
:copycat:clean UP-TO-DATE
:core:clean
:examples:clean UP-TO-DATE
:log4j-appender:clean
:streams:clean UP-TO-DATE
:tools:clean UP-TO-DATE
:contrib:hadoop-consumer:clean UP-TO-DATE
:contrib:hadoop-producer:clean UP-TO-DATE
:copycat:api:clean UP-TO-DATE
:copycat:file:clean UP-TO-DATE
:copycat:json:clean UP-TO-DATE
:copycat:runtime:clean UP-TO-DATE
:jar_core_2_10_5
Building project 'core' with Scala version 2.10.5
:kafka-trunk-jdk7:clients:compileJava
:jar_core_2_10_5 FAILED
FAILURE: Build failed with an exception.
* What went wrong:
Failed to capture snapshot of input files for task 'compileJava' during up-to-date check. See stacktrace for details.
> Could not add entry '<https://builds.apache.org/job/kafka-trunk-jdk7/ws/clients/src/main/java/org/apache/kafka/common/requests/GroupCoordinatorResponse.java'> to cache fileHashes.bin (<https://builds.apache.org/job/kafka-trunk-jdk7/ws/.gradle/2.8/taskArtifacts/fileHashes.bin).>
* Try:
Run with --stacktrace option to get the stack trace. Run with --info or --debug option to get more log output.
BUILD FAILED
Total time: 16.454 secs
Build step 'Execute shell' marked build as failure
Recording test results
Setting GRADLE_2_4_RC_2_HOME=/home/jenkins/jenkins-slave/tools/hudson.plugins.gradle.GradleInstallation/Gradle_2.4-rc-2
Setting JDK_1_7U51_HOME=/home/jenkins/jenkins-slave/tools/hudson.model.JDK/jdk-1.7u51
ERROR: Publisher 'Publish JUnit test result report' failed: No test report files were found. Configuration error?
Setting GRADLE_2_4_RC_2_HOME=/home/jenkins/jenkins-slave/tools/hudson.plugins.gradle.GradleInstallation/Gradle_2.4-rc-2
Setting JDK_1_7U51_HOME=/home/jenkins/jenkins-slave/tools/hudson.model.JDK/jdk-1.7u51