You are viewing a plain text version of this content. The canonical link for it is here.
Posted to dev@jmeter.apache.org by Apache Jenkins Server <je...@builds.apache.org> on 2019/09/28 14:58:23 UTC
Build failed in Jenkins: JMeter-trunk #7386
See <https://builds.apache.org/job/JMeter-trunk/7386/display/redirect>
------------------------------------------
[...truncated 604.23 KB...]
Starting process 'command '/usr/local/asfpackages/java/jdk1.8.0_191/bin/java''. Working directory: <https://builds.apache.org/job/JMeter-trunk/ws/bin> Command: /usr/local/asfpackages/java/jdk1.8.0_191/bin/java -Djava.awt.headless=true -Djava.rmi.server.hostname=asf935.gq1.ygridcore.net -Duser.region=en -Xss256k -XX:MaxMetaspaceSize=128m -javaagent:../src/dist-check/build/tmp/expandedArchives/org.jacoco.agent-0.8.2.jar_2aca8b620b19ecd063f63feff8caaa38/jacocoagent.jar=destfile=../src/dist-check/build/jacoco/batchResponseDecompression.exec,append=true,includes=org.apache.jmeter.*:org.apache.jorphan.*:org.apache.commons.cli.*,inclnolocationclasses=false,dumponexit=true,output=file,jmx=false -Xmx128m -Dfile.encoding=ISO-8859-1 -Duser.country=US -Duser.language=en -Duser.variant -cp <https://builds.apache.org/job/JMeter-trunk/ws/bin/ApacheJMeter.jar>:/home/jenkins/.gradle/caches/modules-2/files-2.1/org.slf4j/jcl-over-slf4j/1.7.25/f8c32b13ff142a513eeb5b6330b1588dcb2c0461/jcl-over-slf4j-1.7.25.jar:/home/jenkins/.gradle/caches/modules-2/files-2.1/org.apache.logging.log4j/log4j-1.2-api/2.11.1/3aba3398fe064a3eab4331f88161c7480e848418/log4j-1.2-api-2.11.1.jar:/home/jenkins/.gradle/caches/modules-2/files-2.1/org.apache.logging.log4j/log4j-slf4j-impl/2.11.1/4b41b53a3a2d299ce381a69d165381ca19f62912/log4j-slf4j-impl-2.11.1.jar:/home/jenkins/.gradle/caches/modules-2/files-2.1/org.apache.logging.log4j/log4j-core/2.11.1/592a48674c926b01a9a747c7831bcd82a9e6d6e4/log4j-core-2.11.1.jar:/home/jenkins/.gradle/caches/modules-2/files-2.1/org.apache.logging.log4j/log4j-api/2.11.1/268f0fe4df3eefe052b57c87ec48517d64fb2a10/log4j-api-2.11.1.jar:/home/jenkins/.gradle/caches/modules-2/files-2.1/org.slf4j/slf4j-api/1.7.25/da76ca59f6a57ee3102f8f9bd9cee742973efa8a/slf4j-api-1.7.25.jar:<https://builds.apache.org/job/JMeter-trunk/ws/lib/opt/activemq-broker-5.15.8.jar>:<https://builds.apache.org/job/JMeter-trunk/ws/lib/opt/spring-beans-4.3.17.RELEASE.jar>:<https://builds.apache.org/job/JMeter-trunk/ws/lib/opt/xbean-spring-4.2.jar>:<https://builds.apache.org/job/JMeter-trunk/ws/lib/opt/commons-logging-1.2.jar>:<https://builds.apache.org/job/JMeter-trunk/ws/lib/opt/activemq-spring-5.15.8.jar>:<https://builds.apache.org/job/JMeter-trunk/ws/lib/opt/hsqldb-2.4.1.jar>:<https://builds.apache.org/job/JMeter-trunk/ws/lib/opt/guava-18.0.jar>:<https://builds.apache.org/job/JMeter-trunk/ws/lib/opt/geronimo-j2ee-management_1.1_spec-1.0.1.jar>:<https://builds.apache.org/job/JMeter-trunk/ws/lib/opt/jackson-annotations-2.9.10.jar>:<https://builds.apache.org/job/JMeter-trunk/ws/lib/opt/jackson-databind-2.9.10.jar>:<https://builds.apache.org/job/JMeter-trunk/ws/lib/opt/commons-pool2-2.6.0.jar>:<https://builds.apache.org/job/JMeter-trunk/ws/lib/opt/activemq-jms-pool-5.15.8.jar>:<https://builds.apache.org/job/JMeter-trunk/ws/lib/opt/geronimo-jms_1.1_spec-1.1.1.jar>:<https://builds.apache.org/job/JMeter-trunk/ws/lib/opt/spring-context-4.3.17.RELEASE.jar>:<https://builds.apache.org/job/JMeter-trunk/ws/lib/opt/spring-expression-4.3.17.RELEASE.jar>:<https://builds.apache.org/job/JMeter-trunk/ws/lib/opt/ftpserver-core-1.1.1.jar>:<https://builds.apache.org/job/JMeter-trunk/ws/lib/opt/activemq-pool-5.15.8.jar>:<https://builds.apache.org/job/JMeter-trunk/ws/lib/opt/mina-core-2.0.19.jar>:<https://builds.apache.org/job/JMeter-trunk/ws/lib/opt/slf4j-api-1.7.25.jar>:<https://builds.apache.org/job/JMeter-trunk/ws/lib/opt/jackson-core-2.9.10.jar>:<https://builds.apache.org/job/JMeter-trunk/ws/lib/opt/spring-core-4.3.17.RELEASE.jar>:<https://builds.apache.org/job/JMeter-trunk/ws/lib/opt/geronimo-jta_1.0.1B_spec-1.0.1.jar>:<https://builds.apache.org/job/JMeter-trunk/ws/lib/opt/activemq-client-5.15.8.jar>:<https://builds.apache.org/job/JMeter-trunk/ws/lib/opt/ftplet-api-1.1.1.jar>:<https://builds.apache.org/job/JMeter-trunk/ws/lib/opt/hawtbuf-1.11.jar>:<https://builds.apache.org/job/JMeter-trunk/ws/lib/opt/activemq-openwire-legacy-5.15.8.jar>:<https://builds.apache.org/job/JMeter-trunk/ws/lib/opt/spring-aop-4.3.17.RELEASE.jar> org.apache.jmeter.NewDriver -pjmeter.properties -q <https://builds.apache.org/job/JMeter-trunk/ws/bin/testfiles/jmeter-batch.properties> -n -t <https://builds.apache.org/job/JMeter-trunk/ws/bin/testfiles/ResponseDecompression.jmx> -i <https://builds.apache.org/job/JMeter-trunk/ws/bin/testfiles/log4j2-batch.xml> -j <https://builds.apache.org/job/JMeter-trunk/ws/bin/ResponseDecompression.log> -l <https://builds.apache.org/job/JMeter-trunk/ws/bin/ResponseDecompression.jtl> -Jmodule=Module -Gmodule=Module -JCSVFILE=<https://builds.apache.org/job/JMeter-trunk/ws/bin/ResponseDecompression.csv>
Successfully started process 'command '/usr/local/asfpackages/java/jdk1.8.0_191/bin/java''
Creating summariser <summary>
Created the tree successfully using <https://builds.apache.org/job/JMeter-trunk/ws/bin/testfiles/ResponseDecompression.jmx>
Starting the test @ Sat Sep 28 14:57:28 UTC 2019 (1569682648949)
Waiting for possible Shutdown/StopTestNow/HeapDump/ThreadDump message on port 4445
summary + 1 in 00:00:01 = 0.9/s Avg: 625 Min: 625 Max: 625 Err: 0 (0.00%) Active: 1 Started: 1 Finished: 0
summary + 1 in 00:00:01 = 1.1/s Avg: 320 Min: 320 Max: 320 Err: 0 (0.00%) Active: 0 Started: 1 Finished: 1
summary = 2 in 00:00:02 = 1.0/s Avg: 472 Min: 320 Max: 625 Err: 0 (0.00%)
Tidying up ... @ Sat Sep 28 14:57:31 UTC 2019 (1569682651682)
... end of run
No errors present in the logfile <https://builds.apache.org/job/JMeter-trunk/ws/bin/ResponseDecompression.log> (the file is empty)
:src:dist-check:batchResponseDecompression (Thread[Daemon worker,5,main]) completed. Took 52.956 secs.
:src:dist-check:batchServerBatchTestLocal (Thread[Daemon worker,5,main]) started.
Starting process 'command '/usr/local/asfpackages/java/jdk1.8.0_191/bin/java''. Working directory: <https://builds.apache.org/job/JMeter-trunk/ws/bin> Command: /usr/local/asfpackages/java/jdk1.8.0_191/bin/java -Djava.awt.headless=true -Djava.rmi.server.hostname=asf935.gq1.ygridcore.net -Dserver_port=38254 -Duser.region=en -Xss256k -XX:MaxMetaspaceSize=128m -javaagent:../src/dist-check/build/tmp/expandedArchives/org.jacoco.agent-0.8.2.jar_2aca8b620b19ecd063f63feff8caaa38/jacocoagent.jar=destfile=../src/dist-check/build/jacoco/batchServerBatchTestLocal.exec,append=true,includes=org.apache.jmeter.*:org.apache.jorphan.*:org.apache.commons.cli.*,inclnolocationclasses=false,dumponexit=true,output=file,jmx=false -Xmx128m -Dfile.encoding=ISO-8859-1 -Duser.country=US -Duser.language=en -Duser.variant -cp <https://builds.apache.org/job/JMeter-trunk/ws/bin/ApacheJMeter.jar>:/home/jenkins/.gradle/caches/modules-2/files-2.1/org.slf4j/jcl-over-slf4j/1.7.25/f8c32b13ff142a513eeb5b6330b1588dcb2c0461/jcl-over-slf4j-1.7.25.jar:/home/jenkins/.gradle/caches/modules-2/files-2.1/org.apache.logging.log4j/log4j-1.2-api/2.11.1/3aba3398fe064a3eab4331f88161c7480e848418/log4j-1.2-api-2.11.1.jar:/home/jenkins/.gradle/caches/modules-2/files-2.1/org.apache.logging.log4j/log4j-slf4j-impl/2.11.1/4b41b53a3a2d299ce381a69d165381ca19f62912/log4j-slf4j-impl-2.11.1.jar:/home/jenkins/.gradle/caches/modules-2/files-2.1/org.apache.logging.log4j/log4j-core/2.11.1/592a48674c926b01a9a747c7831bcd82a9e6d6e4/log4j-core-2.11.1.jar:/home/jenkins/.gradle/caches/modules-2/files-2.1/org.apache.logging.log4j/log4j-api/2.11.1/268f0fe4df3eefe052b57c87ec48517d64fb2a10/log4j-api-2.11.1.jar:/home/jenkins/.gradle/caches/modules-2/files-2.1/org.slf4j/slf4j-api/1.7.25/da76ca59f6a57ee3102f8f9bd9cee742973efa8a/slf4j-api-1.7.25.jar:<https://builds.apache.org/job/JMeter-trunk/ws/lib/opt/activemq-broker-5.15.8.jar>:<https://builds.apache.org/job/JMeter-trunk/ws/lib/opt/spring-beans-4.3.17.RELEASE.jar>:<https://builds.apache.org/job/JMeter-trunk/ws/lib/opt/xbean-spring-4.2.jar>:<https://builds.apache.org/job/JMeter-trunk/ws/lib/opt/commons-logging-1.2.jar>:<https://builds.apache.org/job/JMeter-trunk/ws/lib/opt/activemq-spring-5.15.8.jar>:<https://builds.apache.org/job/JMeter-trunk/ws/lib/opt/hsqldb-2.4.1.jar>:<https://builds.apache.org/job/JMeter-trunk/ws/lib/opt/guava-18.0.jar>:<https://builds.apache.org/job/JMeter-trunk/ws/lib/opt/geronimo-j2ee-management_1.1_spec-1.0.1.jar>:<https://builds.apache.org/job/JMeter-trunk/ws/lib/opt/jackson-annotations-2.9.10.jar>:<https://builds.apache.org/job/JMeter-trunk/ws/lib/opt/jackson-databind-2.9.10.jar>:<https://builds.apache.org/job/JMeter-trunk/ws/lib/opt/commons-pool2-2.6.0.jar>:<https://builds.apache.org/job/JMeter-trunk/ws/lib/opt/activemq-jms-pool-5.15.8.jar>:<https://builds.apache.org/job/JMeter-trunk/ws/lib/opt/geronimo-jms_1.1_spec-1.1.1.jar>:<https://builds.apache.org/job/JMeter-trunk/ws/lib/opt/spring-context-4.3.17.RELEASE.jar>:<https://builds.apache.org/job/JMeter-trunk/ws/lib/opt/spring-expression-4.3.17.RELEASE.jar>:<https://builds.apache.org/job/JMeter-trunk/ws/lib/opt/ftpserver-core-1.1.1.jar>:<https://builds.apache.org/job/JMeter-trunk/ws/lib/opt/activemq-pool-5.15.8.jar>:<https://builds.apache.org/job/JMeter-trunk/ws/lib/opt/mina-core-2.0.19.jar>:<https://builds.apache.org/job/JMeter-trunk/ws/lib/opt/slf4j-api-1.7.25.jar>:<https://builds.apache.org/job/JMeter-trunk/ws/lib/opt/jackson-core-2.9.10.jar>:<https://builds.apache.org/job/JMeter-trunk/ws/lib/opt/spring-core-4.3.17.RELEASE.jar>:<https://builds.apache.org/job/JMeter-trunk/ws/lib/opt/geronimo-jta_1.0.1B_spec-1.0.1.jar>:<https://builds.apache.org/job/JMeter-trunk/ws/lib/opt/activemq-client-5.15.8.jar>:<https://builds.apache.org/job/JMeter-trunk/ws/lib/opt/ftplet-api-1.1.1.jar>:<https://builds.apache.org/job/JMeter-trunk/ws/lib/opt/hawtbuf-1.11.jar>:<https://builds.apache.org/job/JMeter-trunk/ws/lib/opt/activemq-openwire-legacy-5.15.8.jar>:<https://builds.apache.org/job/JMeter-trunk/ws/lib/opt/spring-aop-4.3.17.RELEASE.jar> org.apache.jmeter.NewDriver -pjmeter.properties -q <https://builds.apache.org/job/JMeter-trunk/ws/bin/testfiles/jmeter-batch.properties> -i <https://builds.apache.org/job/JMeter-trunk/ws/bin/testfiles/log4j2-batch.xml> -j <https://builds.apache.org/job/JMeter-trunk/ws/bin/BatchTestLocalServer.log> -s -Jserver.exitaftertest=true
Successfully started process 'command '/usr/local/asfpackages/java/jdk1.8.0_191/bin/java''
> Task :src:dist-check:batchServerBatchTestLocal
Deleting stale output file: <https://builds.apache.org/job/JMeter-trunk/ws/src/dist-check/build/jacoco/batchServerBatchTestLocal.exec>
Caching disabled for task ':src:dist-check:batchServerBatchTestLocal' because:
Build cache is disabled
Task ':src:dist-check:batchServerBatchTestLocal' is not up-to-date because:
No history is available.
> Task :src:dist-check:batchServerBatchTestLocal FAILED
:src:dist-check:batchServerBatchTestLocal (Thread[Daemon worker,5,main]) completed. Took 5.034 secs.
checksum-dependency elapsed time: 1698ms, configurations processed: 278 (add -PchecksumTimingsPrint to print detailed timings)
Saving updated checksum.xml as <https://builds.apache.org/job/JMeter-trunk/ws/build/checksum/checksum.xml>
Closing Git repo: <https://builds.apache.org/job/JMeter-trunk/ws/.git>
FAILURE: Build failed with an exception.
* What went wrong:
Execution failed for task ':src:dist-check:batchServerBatchTestLocal'.
> Unable to connect to asf935.gq1.ygridcore.net:38254 with timeout of PT5S
* Try:
Run with --debug option to get more log output. Run with --scan to get full insights.
* Exception is:
org.gradle.api.tasks.TaskExecutionException: Execution failed for task ':src:dist-check:batchServerBatchTestLocal'.
at org.gradle.api.internal.tasks.execution.ExecuteActionsTaskExecuter$3.accept(ExecuteActionsTaskExecuter.java:166)
at org.gradle.api.internal.tasks.execution.ExecuteActionsTaskExecuter$3.accept(ExecuteActionsTaskExecuter.java:163)
at org.gradle.internal.Try$Failure.ifSuccessfulOrElse(Try.java:191)
at org.gradle.api.internal.tasks.execution.ExecuteActionsTaskExecuter.execute(ExecuteActionsTaskExecuter.java:156)
at org.gradle.api.internal.tasks.execution.ValidatingTaskExecuter.execute(ValidatingTaskExecuter.java:62)
at org.gradle.api.internal.tasks.execution.SkipEmptySourceFilesTaskExecuter.execute(SkipEmptySourceFilesTaskExecuter.java:108)
at org.gradle.api.internal.tasks.execution.ResolveBeforeExecutionOutputsTaskExecuter.execute(ResolveBeforeExecutionOutputsTaskExecuter.java:67)
at org.gradle.api.internal.tasks.execution.ResolveAfterPreviousExecutionStateTaskExecuter.execute(ResolveAfterPreviousExecutionStateTaskExecuter.java:46)
at org.gradle.api.internal.tasks.execution.CleanupStaleOutputsExecuter.execute(CleanupStaleOutputsExecuter.java:94)
at org.gradle.api.internal.tasks.execution.FinalizePropertiesTaskExecuter.execute(FinalizePropertiesTaskExecuter.java:46)
at org.gradle.api.internal.tasks.execution.ResolveTaskExecutionModeExecuter.execute(ResolveTaskExecutionModeExecuter.java:95)
at org.gradle.api.internal.tasks.execution.SkipTaskWithNoActionsExecuter.execute(SkipTaskWithNoActionsExecuter.java:57)
at org.gradle.api.internal.tasks.execution.SkipOnlyIfTaskExecuter.execute(SkipOnlyIfTaskExecuter.java:56)
at org.gradle.api.internal.tasks.execution.CatchExceptionTaskExecuter.execute(CatchExceptionTaskExecuter.java:36)
at org.gradle.api.internal.tasks.execution.EventFiringTaskExecuter$1.executeTask(EventFiringTaskExecuter.java:77)
at org.gradle.api.internal.tasks.execution.EventFiringTaskExecuter$1.call(EventFiringTaskExecuter.java:55)
at org.gradle.api.internal.tasks.execution.EventFiringTaskExecuter$1.call(EventFiringTaskExecuter.java:52)
at org.gradle.internal.operations.DefaultBuildOperationExecutor$CallableBuildOperationWorker.execute(DefaultBuildOperationExecutor.java:416)
at org.gradle.internal.operations.DefaultBuildOperationExecutor$CallableBuildOperationWorker.execute(DefaultBuildOperationExecutor.java:406)
at org.gradle.internal.operations.DefaultBuildOperationExecutor$1.execute(DefaultBuildOperationExecutor.java:165)
at org.gradle.internal.operations.DefaultBuildOperationExecutor.execute(DefaultBuildOperationExecutor.java:250)
at org.gradle.internal.operations.DefaultBuildOperationExecutor.execute(DefaultBuildOperationExecutor.java:158)
at org.gradle.internal.operations.DefaultBuildOperationExecutor.call(DefaultBuildOperationExecutor.java:102)
at org.gradle.internal.operations.DelegatingBuildOperationExecutor.call(DelegatingBuildOperationExecutor.java:36)
at org.gradle.api.internal.tasks.execution.EventFiringTaskExecuter.execute(EventFiringTaskExecuter.java:52)
at org.gradle.execution.plan.LocalTaskNodeExecutor.execute(LocalTaskNodeExecutor.java:43)
at org.gradle.execution.taskgraph.DefaultTaskExecutionGraph$InvokeNodeExecutorsAction.execute(DefaultTaskExecutionGraph.java:355)
at org.gradle.execution.taskgraph.DefaultTaskExecutionGraph$InvokeNodeExecutorsAction.execute(DefaultTaskExecutionGraph.java:343)
at org.gradle.execution.taskgraph.DefaultTaskExecutionGraph$BuildOperationAwareExecutionAction.execute(DefaultTaskExecutionGraph.java:336)
at org.gradle.execution.taskgraph.DefaultTaskExecutionGraph$BuildOperationAwareExecutionAction.execute(DefaultTaskExecutionGraph.java:322)
at org.gradle.execution.plan.DefaultPlanExecutor$ExecutorWorker$1.execute(DefaultPlanExecutor.java:134)
at org.gradle.execution.plan.DefaultPlanExecutor$ExecutorWorker$1.execute(DefaultPlanExecutor.java:129)
at org.gradle.execution.plan.DefaultPlanExecutor$ExecutorWorker.execute(DefaultPlanExecutor.java:202)
at org.gradle.execution.plan.DefaultPlanExecutor$ExecutorWorker.executeNextNode(DefaultPlanExecutor.java:193)
at org.gradle.execution.plan.DefaultPlanExecutor$ExecutorWorker.run(DefaultPlanExecutor.java:129)
at org.gradle.execution.plan.DefaultPlanExecutor.process(DefaultPlanExecutor.java:74)
at org.gradle.execution.taskgraph.DefaultTaskExecutionGraph.executeWithServices(DefaultTaskExecutionGraph.java:178)
at org.gradle.execution.taskgraph.DefaultTaskExecutionGraph.execute(DefaultTaskExecutionGraph.java:154)
at org.gradle.execution.SelectedTaskExecutionAction.execute(SelectedTaskExecutionAction.java:41)
at org.gradle.execution.DefaultBuildWorkExecutor.execute(DefaultBuildWorkExecutor.java:40)
at org.gradle.execution.DefaultBuildWorkExecutor.access$000(DefaultBuildWorkExecutor.java:24)
at org.gradle.execution.DefaultBuildWorkExecutor$1.proceed(DefaultBuildWorkExecutor.java:48)
at org.gradle.execution.DryRunBuildExecutionAction.execute(DryRunBuildExecutionAction.java:49)
at org.gradle.execution.DefaultBuildWorkExecutor.execute(DefaultBuildWorkExecutor.java:40)
at org.gradle.execution.DefaultBuildWorkExecutor.execute(DefaultBuildWorkExecutor.java:33)
at org.gradle.execution.IncludedBuildLifecycleBuildWorkExecutor.execute(IncludedBuildLifecycleBuildWorkExecutor.java:36)
at org.gradle.execution.BuildOperationFiringBuildWorkerExecutor$ExecuteTasks.run(BuildOperationFiringBuildWorkerExecutor.java:56)
at org.gradle.internal.operations.DefaultBuildOperationExecutor$RunnableBuildOperationWorker.execute(DefaultBuildOperationExecutor.java:402)
at org.gradle.internal.operations.DefaultBuildOperationExecutor$RunnableBuildOperationWorker.execute(DefaultBuildOperationExecutor.java:394)
at org.gradle.internal.operations.DefaultBuildOperationExecutor$1.execute(DefaultBuildOperationExecutor.java:165)
at org.gradle.internal.operations.DefaultBuildOperationExecutor.execute(DefaultBuildOperationExecutor.java:250)
at org.gradle.internal.operations.DefaultBuildOperationExecutor.execute(DefaultBuildOperationExecutor.java:158)
at org.gradle.internal.operations.DefaultBuildOperationExecutor.run(DefaultBuildOperationExecutor.java:92)
at org.gradle.internal.operations.DelegatingBuildOperationExecutor.run(DelegatingBuildOperationExecutor.java:31)
at org.gradle.execution.BuildOperationFiringBuildWorkerExecutor.execute(BuildOperationFiringBuildWorkerExecutor.java:41)
at org.gradle.initialization.DefaultGradleLauncher.runWork(DefaultGradleLauncher.java:236)
at org.gradle.initialization.DefaultGradleLauncher.doClassicBuildStages(DefaultGradleLauncher.java:147)
at org.gradle.initialization.DefaultGradleLauncher.doBuildStages(DefaultGradleLauncher.java:126)
at org.gradle.initialization.DefaultGradleLauncher.executeTasks(DefaultGradleLauncher.java:106)
at org.gradle.internal.invocation.GradleBuildController$1.execute(GradleBuildController.java:60)
at org.gradle.internal.invocation.GradleBuildController$1.execute(GradleBuildController.java:57)
at org.gradle.internal.invocation.GradleBuildController$3.create(GradleBuildController.java:85)
at org.gradle.internal.invocation.GradleBuildController$3.create(GradleBuildController.java:78)
at org.gradle.internal.work.DefaultWorkerLeaseService.withLocks(DefaultWorkerLeaseService.java:189)
at org.gradle.internal.work.StopShieldingWorkerLeaseService.withLocks(StopShieldingWorkerLeaseService.java:40)
at org.gradle.internal.invocation.GradleBuildController.doBuild(GradleBuildController.java:78)
at org.gradle.internal.invocation.GradleBuildController.run(GradleBuildController.java:57)
at org.gradle.tooling.internal.provider.ExecuteBuildActionRunner.run(ExecuteBuildActionRunner.java:31)
at org.gradle.launcher.exec.ChainingBuildActionRunner.run(ChainingBuildActionRunner.java:35)
at org.gradle.launcher.exec.BuildOutcomeReportingBuildActionRunner.run(BuildOutcomeReportingBuildActionRunner.java:63)
at org.gradle.tooling.internal.provider.ValidatingBuildActionRunner.run(ValidatingBuildActionRunner.java:32)
at org.gradle.launcher.exec.BuildCompletionNotifyingBuildActionRunner.run(BuildCompletionNotifyingBuildActionRunner.java:39)
at org.gradle.launcher.exec.RunAsBuildOperationBuildActionRunner$3.call(RunAsBuildOperationBuildActionRunner.java:51)
at org.gradle.launcher.exec.RunAsBuildOperationBuildActionRunner$3.call(RunAsBuildOperationBuildActionRunner.java:45)
at org.gradle.internal.operations.DefaultBuildOperationExecutor$CallableBuildOperationWorker.execute(DefaultBuildOperationExecutor.java:416)
at org.gradle.internal.operations.DefaultBuildOperationExecutor$CallableBuildOperationWorker.execute(DefaultBuildOperationExecutor.java:406)
at org.gradle.internal.operations.DefaultBuildOperationExecutor$1.execute(DefaultBuildOperationExecutor.java:165)
at org.gradle.internal.operations.DefaultBuildOperationExecutor.execute(DefaultBuildOperationExecutor.java:250)
at org.gradle.internal.operations.DefaultBuildOperationExecutor.execute(DefaultBuildOperationExecutor.java:158)
at org.gradle.internal.operations.DefaultBuildOperationExecutor.call(DefaultBuildOperationExecutor.java:102)
at org.gradle.internal.operations.DelegatingBuildOperationExecutor.call(DelegatingBuildOperationExecutor.java:36)
at org.gradle.launcher.exec.RunAsBuildOperationBuildActionRunner.run(RunAsBuildOperationBuildActionRunner.java:45)
at org.gradle.launcher.exec.InProcessBuildActionExecuter$1.transform(InProcessBuildActionExecuter.java:50)
at org.gradle.launcher.exec.InProcessBuildActionExecuter$1.transform(InProcessBuildActionExecuter.java:47)
at org.gradle.composite.internal.DefaultRootBuildState.run(DefaultRootBuildState.java:78)
at org.gradle.launcher.exec.InProcessBuildActionExecuter.execute(InProcessBuildActionExecuter.java:47)
at org.gradle.launcher.exec.InProcessBuildActionExecuter.execute(InProcessBuildActionExecuter.java:31)
at org.gradle.launcher.exec.BuildTreeScopeBuildActionExecuter.execute(BuildTreeScopeBuildActionExecuter.java:42)
at org.gradle.launcher.exec.BuildTreeScopeBuildActionExecuter.execute(BuildTreeScopeBuildActionExecuter.java:28)
at org.gradle.tooling.internal.provider.ContinuousBuildActionExecuter.execute(ContinuousBuildActionExecuter.java:78)
at org.gradle.tooling.internal.provider.ContinuousBuildActionExecuter.execute(ContinuousBuildActionExecuter.java:52)
at org.gradle.tooling.internal.provider.SubscribableBuildActionExecuter.execute(SubscribableBuildActionExecuter.java:59)
at org.gradle.tooling.internal.provider.SubscribableBuildActionExecuter.execute(SubscribableBuildActionExecuter.java:36)
at org.gradle.tooling.internal.provider.SessionScopeBuildActionExecuter.execute(SessionScopeBuildActionExecuter.java:68)
at org.gradle.tooling.internal.provider.SessionScopeBuildActionExecuter.execute(SessionScopeBuildActionExecuter.java:38)
at org.gradle.tooling.internal.provider.GradleThreadBuildActionExecuter.execute(GradleThreadBuildActionExecuter.java:37)
at org.gradle.tooling.internal.provider.GradleThreadBuildActionExecuter.execute(GradleThreadBuildActionExecuter.java:26)
at org.gradle.tooling.internal.provider.ParallelismConfigurationBuildActionExecuter.execute(ParallelismConfigurationBuildActionExecuter.java:43)
at org.gradle.tooling.internal.provider.ParallelismConfigurationBuildActionExecuter.execute(ParallelismConfigurationBuildActionExecuter.java:29)
at org.gradle.tooling.internal.provider.StartParamsValidatingActionExecuter.execute(StartParamsValidatingActionExecuter.java:60)
at org.gradle.tooling.internal.provider.StartParamsValidatingActionExecuter.execute(StartParamsValidatingActionExecuter.java:32)
at org.gradle.tooling.internal.provider.SessionFailureReportingActionExecuter.execute(SessionFailureReportingActionExecuter.java:55)
at org.gradle.tooling.internal.provider.SessionFailureReportingActionExecuter.execute(SessionFailureReportingActionExecuter.java:41)
at org.gradle.tooling.internal.provider.SetupLoggingActionExecuter.execute(SetupLoggingActionExecuter.java:48)
at org.gradle.tooling.internal.provider.SetupLoggingActionExecuter.execute(SetupLoggingActionExecuter.java:32)
at org.gradle.launcher.daemon.server.exec.ExecuteBuild.doBuild(ExecuteBuild.java:68)
at org.gradle.launcher.daemon.server.exec.BuildCommandOnly.execute(BuildCommandOnly.java:37)
at org.gradle.launcher.daemon.server.api.DaemonCommandExecution.proceed(DaemonCommandExecution.java:104)
at org.gradle.launcher.daemon.server.exec.WatchForDisconnection.execute(WatchForDisconnection.java:39)
at org.gradle.launcher.daemon.server.api.DaemonCommandExecution.proceed(DaemonCommandExecution.java:104)
at org.gradle.launcher.daemon.server.exec.ResetDeprecationLogger.execute(ResetDeprecationLogger.java:27)
at org.gradle.launcher.daemon.server.api.DaemonCommandExecution.proceed(DaemonCommandExecution.java:104)
at org.gradle.launcher.daemon.server.exec.RequestStopIfSingleUsedDaemon.execute(RequestStopIfSingleUsedDaemon.java:35)
at org.gradle.launcher.daemon.server.api.DaemonCommandExecution.proceed(DaemonCommandExecution.java:104)
at org.gradle.launcher.daemon.server.exec.ForwardClientInput$2.create(ForwardClientInput.java:78)
at org.gradle.launcher.daemon.server.exec.ForwardClientInput$2.create(ForwardClientInput.java:75)
at org.gradle.util.Swapper.swap(Swapper.java:38)
at org.gradle.launcher.daemon.server.exec.ForwardClientInput.execute(ForwardClientInput.java:75)
at org.gradle.launcher.daemon.server.api.DaemonCommandExecution.proceed(DaemonCommandExecution.java:104)
at org.gradle.launcher.daemon.server.exec.LogAndCheckHealth.execute(LogAndCheckHealth.java:50)
at org.gradle.launcher.daemon.server.api.DaemonCommandExecution.proceed(DaemonCommandExecution.java:104)
at org.gradle.launcher.daemon.server.exec.LogToClient.doBuild(LogToClient.java:63)
at org.gradle.launcher.daemon.server.exec.BuildCommandOnly.execute(BuildCommandOnly.java:37)
at org.gradle.launcher.daemon.server.api.DaemonCommandExecution.proceed(DaemonCommandExecution.java:104)
at org.gradle.launcher.daemon.server.exec.EstablishBuildEnvironment.doBuild(EstablishBuildEnvironment.java:82)
at org.gradle.launcher.daemon.server.exec.BuildCommandOnly.execute(BuildCommandOnly.java:37)
at org.gradle.launcher.daemon.server.api.DaemonCommandExecution.proceed(DaemonCommandExecution.java:104)
at org.gradle.launcher.daemon.server.exec.StartBuildOrRespondWithBusy$1.run(StartBuildOrRespondWithBusy.java:52)
at org.gradle.launcher.daemon.server.DaemonStateCoordinator$1.run(DaemonStateCoordinator.java:297)
at org.gradle.internal.concurrent.ExecutorPolicy$CatchAndRecordFailures.onExecute(ExecutorPolicy.java:64)
at org.gradle.internal.concurrent.ManagedExecutorImpl$1.run(ManagedExecutorImpl.java:48)
at org.gradle.internal.concurrent.ThreadFactoryImpl$ManagedThreadRunnable.run(ThreadFactoryImpl.java:56)
Caused by: org.gradle.api.GradleException: Unable to connect to asf935.gq1.ygridcore.net:38254 with timeout of PT5S
at org.apache.jmeter.buildtools.batchtest.BatchTestServer.waitForPort(BatchTestServer.kt:70)
at org.apache.jmeter.buildtools.batchtest.BatchTestServer.exec(BatchTestServer.kt:131)
at org.gradle.internal.reflect.JavaMethod.invoke(JavaMethod.java:103)
at org.gradle.api.internal.project.taskfactory.StandardTaskAction.doExecute(StandardTaskAction.java:49)
at org.gradle.api.internal.project.taskfactory.StandardTaskAction.execute(StandardTaskAction.java:42)
at org.gradle.api.internal.project.taskfactory.StandardTaskAction.execute(StandardTaskAction.java:28)
at org.gradle.api.internal.AbstractTask$TaskActionWrapper.execute(AbstractTask.java:717)
at org.gradle.api.internal.AbstractTask$TaskActionWrapper.execute(AbstractTask.java:684)
at org.gradle.api.internal.tasks.execution.ExecuteActionsTaskExecuter$5.run(ExecuteActionsTaskExecuter.java:476)
at org.gradle.internal.operations.DefaultBuildOperationExecutor$RunnableBuildOperationWorker.execute(DefaultBuildOperationExecutor.java:402)
at org.gradle.internal.operations.DefaultBuildOperationExecutor$RunnableBuildOperationWorker.execute(DefaultBuildOperationExecutor.java:394)
at org.gradle.internal.operations.DefaultBuildOperationExecutor$1.execute(DefaultBuildOperationExecutor.java:165)
at org.gradle.internal.operations.DefaultBuildOperationExecutor.execute(DefaultBuildOperationExecutor.java:250)
at org.gradle.internal.operations.DefaultBuildOperationExecutor.execute(DefaultBuildOperationExecutor.java:158)
at org.gradle.internal.operations.DefaultBuildOperationExecutor.run(DefaultBuildOperationExecutor.java:92)
at org.gradle.internal.operations.DelegatingBuildOperationExecutor.run(DelegatingBuildOperationExecutor.java:31)
at org.gradle.api.internal.tasks.execution.ExecuteActionsTaskExecuter.executeAction(ExecuteActionsTaskExecuter.java:461)
at org.gradle.api.internal.tasks.execution.ExecuteActionsTaskExecuter.executeActions(ExecuteActionsTaskExecuter.java:444)
at org.gradle.api.internal.tasks.execution.ExecuteActionsTaskExecuter.access$200(ExecuteActionsTaskExecuter.java:93)
at org.gradle.api.internal.tasks.execution.ExecuteActionsTaskExecuter$TaskExecution.execute(ExecuteActionsTaskExecuter.java:237)
at org.gradle.internal.execution.steps.ExecuteStep.lambda$execute$1(ExecuteStep.java:33)
at org.gradle.internal.execution.steps.ExecuteStep.execute(ExecuteStep.java:33)
at org.gradle.internal.execution.steps.ExecuteStep.execute(ExecuteStep.java:26)
at org.gradle.internal.execution.steps.CleanupOutputsStep.execute(CleanupOutputsStep.java:58)
at org.gradle.internal.execution.steps.CleanupOutputsStep.execute(CleanupOutputsStep.java:35)
at org.gradle.internal.execution.steps.ResolveInputChangesStep.execute(ResolveInputChangesStep.java:48)
at org.gradle.internal.execution.steps.ResolveInputChangesStep.execute(ResolveInputChangesStep.java:33)
at org.gradle.internal.execution.steps.CancelExecutionStep.execute(CancelExecutionStep.java:39)
at org.gradle.internal.execution.steps.TimeoutStep.executeWithoutTimeout(TimeoutStep.java:73)
at org.gradle.internal.execution.steps.TimeoutStep.execute(TimeoutStep.java:54)
at org.gradle.internal.execution.steps.CatchExceptionStep.execute(CatchExceptionStep.java:35)
at org.gradle.internal.execution.steps.CreateOutputsStep.execute(CreateOutputsStep.java:51)
at org.gradle.internal.execution.steps.SnapshotOutputsStep.execute(SnapshotOutputsStep.java:45)
at org.gradle.internal.execution.steps.SnapshotOutputsStep.execute(SnapshotOutputsStep.java:31)
at org.gradle.internal.execution.steps.CacheStep.executeWithoutCache(CacheStep.java:208)
at org.gradle.internal.execution.steps.CacheStep.execute(CacheStep.java:70)
at org.gradle.internal.execution.steps.CacheStep.execute(CacheStep.java:45)
at org.gradle.internal.execution.steps.BroadcastChangingOutputsStep.execute(BroadcastChangingOutputsStep.java:49)
at org.gradle.internal.execution.steps.StoreSnapshotsStep.execute(StoreSnapshotsStep.java:43)
at org.gradle.internal.execution.steps.StoreSnapshotsStep.execute(StoreSnapshotsStep.java:32)
at org.gradle.internal.execution.steps.RecordOutputsStep.execute(RecordOutputsStep.java:38)
at org.gradle.internal.execution.steps.RecordOutputsStep.execute(RecordOutputsStep.java:24)
at org.gradle.internal.execution.steps.SkipUpToDateStep.executeBecause(SkipUpToDateStep.java:96)
at org.gradle.internal.execution.steps.SkipUpToDateStep.lambda$execute$0(SkipUpToDateStep.java:89)
at org.gradle.internal.execution.steps.SkipUpToDateStep.execute(SkipUpToDateStep.java:54)
at org.gradle.internal.execution.steps.SkipUpToDateStep.execute(SkipUpToDateStep.java:38)
at org.gradle.internal.execution.steps.ResolveChangesStep.execute(ResolveChangesStep.java:76)
at org.gradle.internal.execution.steps.ResolveChangesStep.execute(ResolveChangesStep.java:37)
at org.gradle.internal.execution.steps.legacy.MarkSnapshottingInputsFinishedStep.execute(MarkSnapshottingInputsFinishedStep.java:36)
at org.gradle.internal.execution.steps.legacy.MarkSnapshottingInputsFinishedStep.execute(MarkSnapshottingInputsFinishedStep.java:26)
at org.gradle.internal.execution.steps.ResolveCachingStateStep.execute(ResolveCachingStateStep.java:90)
at org.gradle.internal.execution.steps.ResolveCachingStateStep.execute(ResolveCachingStateStep.java:48)
at org.gradle.internal.execution.steps.CaptureStateBeforeExecutionStep.execute(CaptureStateBeforeExecutionStep.java:69)
at org.gradle.internal.execution.steps.CaptureStateBeforeExecutionStep.execute(CaptureStateBeforeExecutionStep.java:47)
at org.gradle.internal.execution.impl.DefaultWorkExecutor.execute(DefaultWorkExecutor.java:33)
at org.gradle.api.internal.tasks.execution.ExecuteActionsTaskExecuter.execute(ExecuteActionsTaskExecuter.java:140)
... 128 more
* Get more help at https://help.gradle.org
Deprecated Gradle features were used in this build, making it incompatible with Gradle 6.0.
Use '--warning-mode all' to show the individual deprecation warnings.
See https://docs.gradle.org/5.6.1/userguide/command_line_interface.html#sec:command_line_warnings
BUILD FAILED in 26m 54s
178 actionable tasks: 68 executed, 110 up-to-date
Stopped 1 worker daemon(s).
Build step 'Invoke Gradle script' changed build result to FAILURE
Build step 'Invoke Gradle script' marked build as failure
[locks-and-latches] Releasing all the locks
[locks-and-latches] All the locks released
Archiving artifacts
[Fast Archiver] Compressed 176.76 MB of artifacts by 36.0% relative to #7348
Recording test results
Build failed in Jenkins: JMeter-trunk #7393
Posted by Apache Jenkins Server <je...@builds.apache.org>.
See <https://builds.apache.org/job/JMeter-trunk/7393/display/redirect>
------------------------------------------
Started by user vladimirsitnikov
[EnvInject] - Loading node environment variables.
Building remotely on H35 (ubuntu xenial) in workspace <https://builds.apache.org/job/JMeter-trunk/ws/>
No credentials specified
> git rev-parse --is-inside-work-tree # timeout=10
Fetching changes from the remote Git repository
> git config remote.origin.url https://gitbox.apache.org/repos/asf/jmeter.git # timeout=10
Fetching upstream changes from https://gitbox.apache.org/repos/asf/jmeter.git
> git --version # timeout=10
> git fetch --tags --progress https://gitbox.apache.org/repos/asf/jmeter.git +refs/heads/*:refs/remotes/origin/*
> git rev-parse refs/remotes/origin/master^{commit} # timeout=10
> git rev-parse refs/remotes/origin/origin/master^{commit} # timeout=10
Checking out Revision 5cc84c6f8c24b3258235c76164e487d01c6e37aa (refs/remotes/origin/master)
> git config core.sparsecheckout # timeout=10
> git checkout -f 5cc84c6f8c24b3258235c76164e487d01c6e37aa
Commit message: "Update Hamcrest to 2.1"
> git rev-list --no-walk 5cc84c6f8c24b3258235c76164e487d01c6e37aa # timeout=10
[EnvInject] - Executing scripts and injecting environment variables after the SCM step.
[EnvInject] - Injecting as environment variables the properties content
SONAR_HOST_URL=https://sonarcloud.io
[EnvInject] - Variables injected successfully.
[EnvInject] - Mask passwords that will be passed as build parameters.
[locks-and-latches] Checking to see if we really have the locks
[locks-and-latches] Have all the locks, build can start
[JMeter-trunk] $ /bin/bash -xe /tmp/jenkins4166841518044827303.sh
+ export TERM=linux
+ TERM=linux
+ top -d 1 -n 5
top: failed tty get
Build step 'Execute shell' marked build as failure
[locks-and-latches] Releasing all the locks
[locks-and-latches] All the locks released
Archiving artifacts
[Fast Archiver] Compressed 176.76 MB of artifacts by 36.0% relative to #7348
Recording test results
ERROR: Step ?Publish JUnit test result report? failed: Test reports were found but none of them are new. Did leafNodes run?
For example, <https://builds.apache.org/job/JMeter-trunk/ws/src/components/build/test-results/test/TEST-org.apache.jmeter.assertions.CompareAssertionSpec.xml> is 57 min old
Build failed in Jenkins: JMeter-trunk #7392
Posted by Apache Jenkins Server <je...@builds.apache.org>.
See <https://builds.apache.org/job/JMeter-trunk/7392/display/redirect>
------------------------------------------
Started by user vladimirsitnikov
[EnvInject] - Loading node environment variables.
Building remotely on H35 (ubuntu xenial) in workspace <https://builds.apache.org/job/JMeter-trunk/ws/>
No credentials specified
> git rev-parse --is-inside-work-tree # timeout=10
Fetching changes from the remote Git repository
> git config remote.origin.url https://gitbox.apache.org/repos/asf/jmeter.git # timeout=10
Fetching upstream changes from https://gitbox.apache.org/repos/asf/jmeter.git
> git --version # timeout=10
> git fetch --tags --progress https://gitbox.apache.org/repos/asf/jmeter.git +refs/heads/*:refs/remotes/origin/*
> git rev-parse refs/remotes/origin/master^{commit} # timeout=10
> git rev-parse refs/remotes/origin/origin/master^{commit} # timeout=10
Checking out Revision 5cc84c6f8c24b3258235c76164e487d01c6e37aa (refs/remotes/origin/master)
> git config core.sparsecheckout # timeout=10
> git checkout -f 5cc84c6f8c24b3258235c76164e487d01c6e37aa
Commit message: "Update Hamcrest to 2.1"
> git rev-list --no-walk 5cc84c6f8c24b3258235c76164e487d01c6e37aa # timeout=10
[EnvInject] - Executing scripts and injecting environment variables after the SCM step.
[EnvInject] - Injecting as environment variables the properties content
SONAR_HOST_URL=https://sonarcloud.io
[EnvInject] - Variables injected successfully.
[EnvInject] - Mask passwords that will be passed as build parameters.
[locks-and-latches] Checking to see if we really have the locks
[locks-and-latches] Have all the locks, build can start
[JMeter-trunk] $ /bin/bash -xe /tmp/jenkins5650666937549329160.sh
+ top -d 1 -n 5
TERM environment variable not set.
Build step 'Execute shell' marked build as failure
[locks-and-latches] Releasing all the locks
[locks-and-latches] All the locks released
Archiving artifacts
[Fast Archiver] Compressed 176.76 MB of artifacts by 36.0% relative to #7348
Recording test results
ERROR: Step ?Publish JUnit test result report? failed: Test reports were found but none of them are new. Did leafNodes run?
For example, <https://builds.apache.org/job/JMeter-trunk/ws/src/components/build/test-results/test/TEST-org.apache.jmeter.assertions.CompareAssertionSpec.xml> is 55 min old
Build failed in Jenkins: JMeter-trunk #7391
Posted by Apache Jenkins Server <je...@builds.apache.org>.
See <https://builds.apache.org/job/JMeter-trunk/7391/display/redirect>
------------------------------------------
Started by user vladimirsitnikov
[EnvInject] - Loading node environment variables.
Building remotely on H35 (ubuntu xenial) in workspace <https://builds.apache.org/job/JMeter-trunk/ws/>
No credentials specified
> git rev-parse --is-inside-work-tree # timeout=10
Fetching changes from the remote Git repository
> git config remote.origin.url https://gitbox.apache.org/repos/asf/jmeter.git # timeout=10
Fetching upstream changes from https://gitbox.apache.org/repos/asf/jmeter.git
> git --version # timeout=10
> git fetch --tags --progress https://gitbox.apache.org/repos/asf/jmeter.git +refs/heads/*:refs/remotes/origin/*
> git rev-parse refs/remotes/origin/master^{commit} # timeout=10
> git rev-parse refs/remotes/origin/origin/master^{commit} # timeout=10
Checking out Revision 5cc84c6f8c24b3258235c76164e487d01c6e37aa (refs/remotes/origin/master)
> git config core.sparsecheckout # timeout=10
> git checkout -f 5cc84c6f8c24b3258235c76164e487d01c6e37aa
Commit message: "Update Hamcrest to 2.1"
> git rev-list --no-walk 5cc84c6f8c24b3258235c76164e487d01c6e37aa # timeout=10
[EnvInject] - Executing scripts and injecting environment variables after the SCM step.
[EnvInject] - Injecting as environment variables the properties content
SONAR_HOST_URL=https://sonarcloud.io
[EnvInject] - Variables injected successfully.
[EnvInject] - Mask passwords that will be passed as build parameters.
[locks-and-latches] Checking to see if we really have the locks
[locks-and-latches] Have all the locks, build can start
[JMeter-trunk] $ /bin/bash -xe /tmp/jenkins4771325914106071744.sh
+ top -d 1 -n 5 -o RSS
top: unrecognized field name 'RSS'
Build step 'Execute shell' marked build as failure
[locks-and-latches] Releasing all the locks
[locks-and-latches] All the locks released
Archiving artifacts
[Fast Archiver] Compressed 176.76 MB of artifacts by 36.0% relative to #7348
Recording test results
ERROR: Step ?Publish JUnit test result report? failed: Test reports were found but none of them are new. Did leafNodes run?
For example, <https://builds.apache.org/job/JMeter-trunk/ws/src/components/build/test-results/test/TEST-org.apache.jmeter.assertions.CompareAssertionSpec.xml> is 53 min old
Build failed in Jenkins: JMeter-trunk #7390
Posted by Apache Jenkins Server <je...@builds.apache.org>.
See <https://builds.apache.org/job/JMeter-trunk/7390/display/redirect>
------------------------------------------
Started by user vladimirsitnikov
[EnvInject] - Loading node environment variables.
Building remotely on H35 (ubuntu xenial) in workspace <https://builds.apache.org/job/JMeter-trunk/ws/>
No credentials specified
> git rev-parse --is-inside-work-tree # timeout=10
Fetching changes from the remote Git repository
> git config remote.origin.url https://gitbox.apache.org/repos/asf/jmeter.git # timeout=10
Fetching upstream changes from https://gitbox.apache.org/repos/asf/jmeter.git
> git --version # timeout=10
> git fetch --tags --progress https://gitbox.apache.org/repos/asf/jmeter.git +refs/heads/*:refs/remotes/origin/*
> git rev-parse refs/remotes/origin/master^{commit} # timeout=10
> git rev-parse refs/remotes/origin/origin/master^{commit} # timeout=10
Checking out Revision 5cc84c6f8c24b3258235c76164e487d01c6e37aa (refs/remotes/origin/master)
> git config core.sparsecheckout # timeout=10
> git checkout -f 5cc84c6f8c24b3258235c76164e487d01c6e37aa
Commit message: "Update Hamcrest to 2.1"
> git rev-list --no-walk 5cc84c6f8c24b3258235c76164e487d01c6e37aa # timeout=10
[EnvInject] - Executing scripts and injecting environment variables after the SCM step.
[EnvInject] - Injecting as environment variables the properties content
SONAR_HOST_URL=https://sonarcloud.io
[EnvInject] - Variables injected successfully.
[EnvInject] - Mask passwords that will be passed as build parameters.
[locks-and-latches] Checking to see if we really have the locks
[locks-and-latches] Have all the locks, build can start
[JMeter-trunk] $ /bin/bash -xe /tmp/jenkins8976718472839359464.sh
+ top -d 1 -n 5 -o RSS
top: unrecognized field name 'RSS'
Build step 'Execute shell' marked build as failure
[locks-and-latches] Releasing all the locks
[locks-and-latches] All the locks released
Archiving artifacts
[Fast Archiver] Compressed 176.76 MB of artifacts by 36.0% relative to #7348
Recording test results
ERROR: Step ?Publish JUnit test result report? failed: Test reports were found but none of them are new. Did leafNodes run?
For example, <https://builds.apache.org/job/JMeter-trunk/ws/src/components/build/test-results/test/TEST-org.apache.jmeter.assertions.CompareAssertionSpec.xml> is 52 min old
Build failed in Jenkins: JMeter-trunk #7389
Posted by Apache Jenkins Server <je...@builds.apache.org>.
See <https://builds.apache.org/job/JMeter-trunk/7389/display/redirect>
------------------------------------------
Started by user vladimirsitnikov
[EnvInject] - Loading node environment variables.
Building remotely on H35 (ubuntu xenial) in workspace <https://builds.apache.org/job/JMeter-trunk/ws/>
No credentials specified
> git rev-parse --is-inside-work-tree # timeout=10
Fetching changes from the remote Git repository
> git config remote.origin.url https://gitbox.apache.org/repos/asf/jmeter.git # timeout=10
Fetching upstream changes from https://gitbox.apache.org/repos/asf/jmeter.git
> git --version # timeout=10
> git fetch --tags --progress https://gitbox.apache.org/repos/asf/jmeter.git +refs/heads/*:refs/remotes/origin/*
> git rev-parse refs/remotes/origin/master^{commit} # timeout=10
> git rev-parse refs/remotes/origin/origin/master^{commit} # timeout=10
Checking out Revision 5cc84c6f8c24b3258235c76164e487d01c6e37aa (refs/remotes/origin/master)
> git config core.sparsecheckout # timeout=10
> git checkout -f 5cc84c6f8c24b3258235c76164e487d01c6e37aa
Commit message: "Update Hamcrest to 2.1"
> git rev-list --no-walk 5cc84c6f8c24b3258235c76164e487d01c6e37aa # timeout=10
[EnvInject] - Executing scripts and injecting environment variables after the SCM step.
[EnvInject] - Injecting as environment variables the properties content
SONAR_HOST_URL=https://sonarcloud.io
[EnvInject] - Variables injected successfully.
[EnvInject] - Mask passwords that will be passed as build parameters.
[locks-and-latches] Checking to see if we really have the locks
[locks-and-latches] Have all the locks, build can start
[JMeter-trunk] $ /bin/bash -xe /tmp/jenkins228555465278575160.sh
+ top -h
procps-ng version 3.3.10
Usage:
top -hv | -bcHiOSs -d secs -n max -u|U user -p pid(s) -o field -w [cols]
+ top -i 1 -l 5 -o RSS
top: unknown option '1'
Usage:
top -hv | -bcHiOSs -d secs -n max -u|U user -p pid(s) -o field -w [cols]
Build step 'Execute shell' marked build as failure
[locks-and-latches] Releasing all the locks
[locks-and-latches] All the locks released
Archiving artifacts
[Fast Archiver] Compressed 176.76 MB of artifacts by 36.0% relative to #7348
Recording test results
ERROR: Step ?Publish JUnit test result report? failed: Test reports were found but none of them are new. Did leafNodes run?
For example, <https://builds.apache.org/job/JMeter-trunk/ws/src/components/build/test-results/test/TEST-org.apache.jmeter.assertions.CompareAssertionSpec.xml> is 50 min old
Build failed in Jenkins: JMeter-trunk #7388
Posted by Apache Jenkins Server <je...@builds.apache.org>.
See <https://builds.apache.org/job/JMeter-trunk/7388/display/redirect>
------------------------------------------
Started by user vladimirsitnikov
[EnvInject] - Loading node environment variables.
Building remotely on H35 (ubuntu xenial) in workspace <https://builds.apache.org/job/JMeter-trunk/ws/>
No credentials specified
> git rev-parse --is-inside-work-tree # timeout=10
Fetching changes from the remote Git repository
> git config remote.origin.url https://gitbox.apache.org/repos/asf/jmeter.git # timeout=10
Fetching upstream changes from https://gitbox.apache.org/repos/asf/jmeter.git
> git --version # timeout=10
> git fetch --tags --progress https://gitbox.apache.org/repos/asf/jmeter.git +refs/heads/*:refs/remotes/origin/*
> git rev-parse refs/remotes/origin/master^{commit} # timeout=10
> git rev-parse refs/remotes/origin/origin/master^{commit} # timeout=10
Checking out Revision 5cc84c6f8c24b3258235c76164e487d01c6e37aa (refs/remotes/origin/master)
> git config core.sparsecheckout # timeout=10
> git checkout -f 5cc84c6f8c24b3258235c76164e487d01c6e37aa
Commit message: "Update Hamcrest to 2.1"
> git rev-list --no-walk 5cc84c6f8c24b3258235c76164e487d01c6e37aa # timeout=10
[EnvInject] - Executing scripts and injecting environment variables after the SCM step.
[EnvInject] - Injecting as environment variables the properties content
SONAR_HOST_URL=https://sonarcloud.io
[EnvInject] - Variables injected successfully.
[EnvInject] - Mask passwords that will be passed as build parameters.
[locks-and-latches] Checking to see if we really have the locks
[locks-and-latches] Have all the locks, build can start
[JMeter-trunk] $ /bin/bash -xe /tmp/jenkins7891008602443941411.sh
+ top -i 1 -l 5 -o RSS
top: unknown option '1'
Usage:
top -hv | -bcHiOSs -d secs -n max -u|U user -p pid(s) -o field -w [cols]
Build step 'Execute shell' marked build as failure
[locks-and-latches] Releasing all the locks
[locks-and-latches] All the locks released
Archiving artifacts
[Fast Archiver] Compressed 176.76 MB of artifacts by 36.0% relative to #7348
Recording test results
ERROR: Step ?Publish JUnit test result report? failed: Test reports were found but none of them are new. Did leafNodes run?
For example, <https://builds.apache.org/job/JMeter-trunk/ws/src/components/build/test-results/test/TEST-org.apache.jmeter.assertions.CompareAssertionSpec.xml> is 48 min old
Build failed in Jenkins: JMeter-trunk #7387
Posted by Apache Jenkins Server <je...@builds.apache.org>.
See <https://builds.apache.org/job/JMeter-trunk/7387/display/redirect>
------------------------------------------
Started by user vladimirsitnikov
[EnvInject] - Loading node environment variables.
Building remotely on H35 (ubuntu xenial) in workspace <https://builds.apache.org/job/JMeter-trunk/ws/>
No credentials specified
> git rev-parse --is-inside-work-tree # timeout=10
Fetching changes from the remote Git repository
> git config remote.origin.url https://gitbox.apache.org/repos/asf/jmeter.git # timeout=10
Fetching upstream changes from https://gitbox.apache.org/repos/asf/jmeter.git
> git --version # timeout=10
> git fetch --tags --progress https://gitbox.apache.org/repos/asf/jmeter.git +refs/heads/*:refs/remotes/origin/*
> git rev-parse refs/remotes/origin/master^{commit} # timeout=10
> git rev-parse refs/remotes/origin/origin/master^{commit} # timeout=10
Checking out Revision 5cc84c6f8c24b3258235c76164e487d01c6e37aa (refs/remotes/origin/master)
> git config core.sparsecheckout # timeout=10
> git checkout -f 5cc84c6f8c24b3258235c76164e487d01c6e37aa
Commit message: "Update Hamcrest to 2.1"
> git rev-list --no-walk 5cc84c6f8c24b3258235c76164e487d01c6e37aa # timeout=10
[EnvInject] - Executing scripts and injecting environment variables after the SCM step.
[EnvInject] - Injecting as environment variables the properties content
SONAR_HOST_URL=https://sonarcloud.io
[EnvInject] - Variables injected successfully.
[EnvInject] - Mask passwords that will be passed as build parameters.
[locks-and-latches] Checking to see if we really have the locks
[locks-and-latches] Have all the locks, build can start
[JMeter-trunk] $ /bin/bash -xe /tmp/jenkins3574401294581282892.sh
+ ping -c 5 asf935.gq1.ygridcore.net
PING asf935.gq1.ygridcore.net (67.195.81.176) 56(84) bytes of data.
64 bytes from asf935.gq1.ygridcore.net (67.195.81.176): icmp_seq=1 ttl=64 time=0.101 ms
64 bytes from asf935.gq1.ygridcore.net (67.195.81.176): icmp_seq=2 ttl=64 time=0.085 ms
64 bytes from asf935.gq1.ygridcore.net (67.195.81.176): icmp_seq=3 ttl=64 time=0.062 ms
64 bytes from asf935.gq1.ygridcore.net (67.195.81.176): icmp_seq=4 ttl=64 time=0.089 ms
64 bytes from asf935.gq1.ygridcore.net (67.195.81.176): icmp_seq=5 ttl=64 time=0.066 ms
--- asf935.gq1.ygridcore.net ping statistics ---
5 packets transmitted, 5 received, 0% packet loss, time 3999ms
rtt min/avg/max/mdev = 0.062/0.080/0.101/0.017 ms
real 0m4.018s
user 0m0.000s
sys 0m0.000s
+ ping -c 5 asf935.gq1.ygridcore.net
PING asf935.gq1.ygridcore.net (67.195.81.176) 56(84) bytes of data.
64 bytes from asf935.gq1.ygridcore.net (67.195.81.176): icmp_seq=1 ttl=64 time=0.061 ms
64 bytes from asf935.gq1.ygridcore.net (67.195.81.176): icmp_seq=2 ttl=64 time=0.109 ms
64 bytes from asf935.gq1.ygridcore.net (67.195.81.176): icmp_seq=3 ttl=64 time=0.063 ms
64 bytes from asf935.gq1.ygridcore.net (67.195.81.176): icmp_seq=4 ttl=64 time=0.098 ms
64 bytes from asf935.gq1.ygridcore.net (67.195.81.176): icmp_seq=5 ttl=64 time=0.076 ms
--- asf935.gq1.ygridcore.net ping statistics ---
5 packets transmitted, 5 received, 0% packet loss, time 3996ms
rtt min/avg/max/mdev = 0.061/0.081/0.109/0.020 ms
+ top
TERM environment variable not set.
Build step 'Execute shell' marked build as failure
[locks-and-latches] Releasing all the locks
[locks-and-latches] All the locks released
Archiving artifacts
[Fast Archiver] Compressed 176.76 MB of artifacts by 36.0% relative to #7348
Recording test results
ERROR: Step ?Publish JUnit test result report? failed: Test reports were found but none of them are new. Did leafNodes run?
For example, <https://builds.apache.org/job/JMeter-trunk/ws/src/components/build/test-results/test/TEST-org.apache.jmeter.assertions.CompareAssertionSpec.xml> is 46 min old