You are viewing a plain text version of this content. The canonical link for it is here.
Posted to dev@lucene.apache.org by Apache Jenkins Server <je...@builds.apache.org> on 2016/06/25 15:25:19 UTC

[JENKINS] Lucene-Solr-Tests-master - Build # 1227 - Still Failing

Build: https://builds.apache.org/job/Lucene-Solr-Tests-master/1227/

2 tests failed.
FAILED:  org.apache.solr.cloud.overseer.ZkStateReaderTest.testStateFormatUpdateWithTimeDelay

Error Message:
Could not find collection : c1

Stack Trace:
org.apache.solr.common.SolrException: Could not find collection : c1
	at __randomizedtesting.SeedInfo.seed([83027BED5969CE71:FC9CCC68300BE3FB]:0)
	at org.apache.solr.common.cloud.ClusterState.getCollection(ClusterState.java:192)
	at org.apache.solr.cloud.overseer.ZkStateReaderTest.testStateFormatUpdate(ZkStateReaderTest.java:129)
	at org.apache.solr.cloud.overseer.ZkStateReaderTest.testStateFormatUpdateWithTimeDelay(ZkStateReaderTest.java:51)
	at sun.reflect.NativeMethodAccessorImpl.invoke0(Native Method)
	at sun.reflect.NativeMethodAccessorImpl.invoke(NativeMethodAccessorImpl.java:62)
	at sun.reflect.DelegatingMethodAccessorImpl.invoke(DelegatingMethodAccessorImpl.java:43)
	at java.lang.reflect.Method.invoke(Method.java:498)
	at com.carrotsearch.randomizedtesting.RandomizedRunner.invoke(RandomizedRunner.java:1764)
	at com.carrotsearch.randomizedtesting.RandomizedRunner$8.evaluate(RandomizedRunner.java:871)
	at com.carrotsearch.randomizedtesting.RandomizedRunner$9.evaluate(RandomizedRunner.java:907)
	at com.carrotsearch.randomizedtesting.RandomizedRunner$10.evaluate(RandomizedRunner.java:921)
	at com.carrotsearch.randomizedtesting.rules.SystemPropertiesRestoreRule$1.evaluate(SystemPropertiesRestoreRule.java:57)
	at org.apache.lucene.util.TestRuleSetupTeardownChained$1.evaluate(TestRuleSetupTeardownChained.java:49)
	at org.apache.lucene.util.AbstractBeforeAfterRule$1.evaluate(AbstractBeforeAfterRule.java:45)
	at org.apache.lucene.util.TestRuleThreadAndTestName$1.evaluate(TestRuleThreadAndTestName.java:48)
	at org.apache.lucene.util.TestRuleIgnoreAfterMaxFailures$1.evaluate(TestRuleIgnoreAfterMaxFailures.java:64)
	at org.apache.lucene.util.TestRuleMarkFailure$1.evaluate(TestRuleMarkFailure.java:47)
	at com.carrotsearch.randomizedtesting.rules.StatementAdapter.evaluate(StatementAdapter.java:36)
	at com.carrotsearch.randomizedtesting.ThreadLeakControl$StatementRunner.run(ThreadLeakControl.java:367)
	at com.carrotsearch.randomizedtesting.ThreadLeakControl.forkTimeoutingTask(ThreadLeakControl.java:809)
	at com.carrotsearch.randomizedtesting.ThreadLeakControl$3.evaluate(ThreadLeakControl.java:460)
	at com.carrotsearch.randomizedtesting.RandomizedRunner.runSingleTest(RandomizedRunner.java:880)
	at com.carrotsearch.randomizedtesting.RandomizedRunner$5.evaluate(RandomizedRunner.java:781)
	at com.carrotsearch.randomizedtesting.RandomizedRunner$6.evaluate(RandomizedRunner.java:816)
	at com.carrotsearch.randomizedtesting.RandomizedRunner$7.evaluate(RandomizedRunner.java:827)
	at com.carrotsearch.randomizedtesting.rules.StatementAdapter.evaluate(StatementAdapter.java:36)
	at com.carrotsearch.randomizedtesting.rules.SystemPropertiesRestoreRule$1.evaluate(SystemPropertiesRestoreRule.java:57)
	at org.apache.lucene.util.AbstractBeforeAfterRule$1.evaluate(AbstractBeforeAfterRule.java:45)
	at com.carrotsearch.randomizedtesting.rules.StatementAdapter.evaluate(StatementAdapter.java:36)
	at org.apache.lucene.util.TestRuleStoreClassName$1.evaluate(TestRuleStoreClassName.java:41)
	at com.carrotsearch.randomizedtesting.rules.NoShadowingOrOverridesOnMethodsRule$1.evaluate(NoShadowingOrOverridesOnMethodsRule.java:40)
	at com.carrotsearch.randomizedtesting.rules.NoShadowingOrOverridesOnMethodsRule$1.evaluate(NoShadowingOrOverridesOnMethodsRule.java:40)
	at com.carrotsearch.randomizedtesting.rules.StatementAdapter.evaluate(StatementAdapter.java:36)
	at com.carrotsearch.randomizedtesting.rules.StatementAdapter.evaluate(StatementAdapter.java:36)
	at com.carrotsearch.randomizedtesting.rules.StatementAdapter.evaluate(StatementAdapter.java:36)
	at org.apache.lucene.util.TestRuleAssertionsRequired$1.evaluate(TestRuleAssertionsRequired.java:53)
	at org.apache.lucene.util.TestRuleMarkFailure$1.evaluate(TestRuleMarkFailure.java:47)
	at org.apache.lucene.util.TestRuleIgnoreAfterMaxFailures$1.evaluate(TestRuleIgnoreAfterMaxFailures.java:64)
	at org.apache.lucene.util.TestRuleIgnoreTestSuites$1.evaluate(TestRuleIgnoreTestSuites.java:54)
	at com.carrotsearch.randomizedtesting.rules.StatementAdapter.evaluate(StatementAdapter.java:36)
	at com.carrotsearch.randomizedtesting.ThreadLeakControl$StatementRunner.run(ThreadLeakControl.java:367)
	at java.lang.Thread.run(Thread.java:745)


FAILED:  org.apache.solr.handler.component.DistributedFacetPivotLongTailTest.test

Error Message:
GC overhead limit exceeded

Stack Trace:
java.lang.OutOfMemoryError: GC overhead limit exceeded
	at __randomizedtesting.SeedInfo.seed([83027BED5969CE71:B564437F795A389]:0)
	at java.util.HashSet.<init>(HashSet.java:105)
	at sun.security.ssl.SSLAlgorithmDecomposer.decomposes(SSLAlgorithmDecomposer.java:51)
	at sun.security.ssl.SSLAlgorithmDecomposer.decompose(SSLAlgorithmDecomposer.java:212)
	at sun.security.ssl.SSLAlgorithmDecomposer.decompose(SSLAlgorithmDecomposer.java:243)
	at sun.security.util.AbstractAlgorithmConstraints.checkAlgorithm(AbstractAlgorithmConstraints.java:104)
	at sun.security.util.DisabledAlgorithmConstraints.permits(DisabledAlgorithmConstraints.java:91)
	at sun.security.ssl.SSLAlgorithmConstraints.permits(SSLAlgorithmConstraints.java:149)
	at sun.security.ssl.SSLContextImpl.getApplicableCipherSuiteList(SSLContextImpl.java:349)
	at sun.security.ssl.SSLContextImpl.getDefaultCipherSuiteList(SSLContextImpl.java:304)
	at sun.security.ssl.SSLSocketImpl.init(SSLSocketImpl.java:626)
	at sun.security.ssl.SSLSocketImpl.<init>(SSLSocketImpl.java:567)
	at sun.security.ssl.SSLSocketFactoryImpl.createSocket(SSLSocketFactoryImpl.java:110)
	at org.apache.http.conn.ssl.SSLConnectionSocketFactory.createLayeredSocket(SSLConnectionSocketFactory.java:363)
	at org.apache.http.conn.ssl.SSLConnectionSocketFactory.connectSocket(SSLConnectionSocketFactory.java:353)
	at org.apache.http.impl.conn.DefaultHttpClientConnectionOperator.connect(DefaultHttpClientConnectionOperator.java:134)
	at org.apache.http.impl.conn.PoolingHttpClientConnectionManager.connect(PoolingHttpClientConnectionManager.java:353)
	at org.apache.http.impl.execchain.MainClientExec.establishRoute(MainClientExec.java:380)
	at org.apache.http.impl.execchain.MainClientExec.execute(MainClientExec.java:236)
	at org.apache.http.impl.execchain.ProtocolExec.execute(ProtocolExec.java:184)
	at org.apache.http.impl.execchain.RetryExec.execute(RetryExec.java:88)
	at org.apache.http.impl.execchain.RedirectExec.execute(RedirectExec.java:110)
	at org.apache.http.impl.client.InternalHttpClient.doExecute(InternalHttpClient.java:184)
	at org.apache.http.impl.client.CloseableHttpClient.execute(CloseableHttpClient.java:82)
	at org.apache.http.impl.client.CloseableHttpClient.execute(CloseableHttpClient.java:55)
	at org.apache.solr.client.solrj.impl.HttpSolrClient.executeMethod(HttpSolrClient.java:511)
	at org.apache.solr.client.solrj.impl.HttpSolrClient.request(HttpSolrClient.java:259)
	at org.apache.solr.client.solrj.impl.HttpSolrClient.request(HttpSolrClient.java:248)
	at org.apache.solr.client.solrj.SolrRequest.process(SolrRequest.java:149)
	at org.apache.solr.client.solrj.SolrClient.add(SolrClient.java:173)
	at org.apache.solr.client.solrj.SolrClient.add(SolrClient.java:138)
	at org.apache.solr.client.solrj.SolrClient.add(SolrClient.java:152)
	at org.apache.solr.handler.component.DistributedFacetPivotLongTailTest.test(DistributedFacetPivotLongTailTest.java:70)




Build Log:
[...truncated 10699 lines...]
   [junit4] Suite: org.apache.solr.cloud.overseer.ZkStateReaderTest
   [junit4]   2> Creating dataDir: /x1/jenkins/jenkins-slave/workspace/Lucene-Solr-Tests-master/solr/build/solr-core/test/J1/temp/solr.cloud.overseer.ZkStateReaderTest_83027BED5969CE71-001/init-core-data-001
   [junit4]   2> 140813 INFO  (SUITE-ZkStateReaderTest-seed#[83027BED5969CE71]-worker) [    ] o.a.s.SolrTestCaseJ4 Randomized ssl (true) and clientAuth (true) via: @org.apache.solr.util.RandomizeSSL(reason=, ssl=NaN, value=NaN, clientAuth=NaN)
   [junit4]   2> 140831 INFO  (TEST-ZkStateReaderTest.testStateFormatUpdateWithTimeDelay-seed#[83027BED5969CE71]) [    ] o.a.s.SolrTestCaseJ4 ###Starting testStateFormatUpdateWithTimeDelay
   [junit4]   2> 140831 INFO  (TEST-ZkStateReaderTest.testStateFormatUpdateWithTimeDelay-seed#[83027BED5969CE71]) [    ] o.a.s.c.ZkTestServer STARTING ZK TEST SERVER
   [junit4]   2> 140832 INFO  (Thread-664) [    ] o.a.s.c.ZkTestServer client port:0.0.0.0/0.0.0.0:0
   [junit4]   2> 140832 INFO  (Thread-664) [    ] o.a.s.c.ZkTestServer Starting server
   [junit4]   2> 140932 INFO  (TEST-ZkStateReaderTest.testStateFormatUpdateWithTimeDelay-seed#[83027BED5969CE71]) [    ] o.a.s.c.ZkTestServer start zk server on port:42847
   [junit4]   2> 140932 INFO  (TEST-ZkStateReaderTest.testStateFormatUpdateWithTimeDelay-seed#[83027BED5969CE71]) [    ] o.a.s.c.c.SolrZkClient Using default ZkCredentialsProvider
   [junit4]   2> 140933 INFO  (TEST-ZkStateReaderTest.testStateFormatUpdateWithTimeDelay-seed#[83027BED5969CE71]) [    ] o.a.s.c.c.ConnectionManager Waiting for client to connect to ZooKeeper
   [junit4]   2> 140939 INFO  (zkCallback-204-thread-1) [    ] o.a.s.c.c.ConnectionManager Watcher org.apache.solr.common.cloud.ConnectionManager@5ea76430 name:ZooKeeperConnection Watcher:127.0.0.1:42847 got event WatchedEvent state:SyncConnected type:None path:null path:null type:None
   [junit4]   2> 140939 INFO  (TEST-ZkStateReaderTest.testStateFormatUpdateWithTimeDelay-seed#[83027BED5969CE71]) [    ] o.a.s.c.c.ConnectionManager Client is connected to ZooKeeper
   [junit4]   2> 140939 INFO  (TEST-ZkStateReaderTest.testStateFormatUpdateWithTimeDelay-seed#[83027BED5969CE71]) [    ] o.a.s.c.c.SolrZkClient Using default ZkACLProvider
   [junit4]   2> 140940 INFO  (TEST-ZkStateReaderTest.testStateFormatUpdateWithTimeDelay-seed#[83027BED5969CE71]) [    ] o.a.s.c.c.SolrZkClient Using default ZkCredentialsProvider
   [junit4]   2> 140941 INFO  (TEST-ZkStateReaderTest.testStateFormatUpdateWithTimeDelay-seed#[83027BED5969CE71]) [    ] o.a.s.c.c.ConnectionManager Waiting for client to connect to ZooKeeper
   [junit4]   2> 140948 INFO  (zkCallback-205-thread-1) [    ] o.a.s.c.c.ConnectionManager Watcher org.apache.solr.common.cloud.ConnectionManager@642ac5fb name:ZooKeeperConnection Watcher:127.0.0.1:42847 got event WatchedEvent state:SyncConnected type:None path:null path:null type:None
   [junit4]   2> 140948 INFO  (TEST-ZkStateReaderTest.testStateFormatUpdateWithTimeDelay-seed#[83027BED5969CE71]) [    ] o.a.s.c.c.ConnectionManager Client is connected to ZooKeeper
   [junit4]   2> 140948 INFO  (TEST-ZkStateReaderTest.testStateFormatUpdateWithTimeDelay-seed#[83027BED5969CE71]) [    ] o.a.s.c.c.SolrZkClient Using default ZkACLProvider
   [junit4]   2> 140948 INFO  (TEST-ZkStateReaderTest.testStateFormatUpdateWithTimeDelay-seed#[83027BED5969CE71]) [    ] o.a.s.c.c.SolrZkClient makePath: /solr
   [junit4]   2> 140958 INFO  (TEST-ZkStateReaderTest.testStateFormatUpdateWithTimeDelay-seed#[83027BED5969CE71]) [    ] o.a.s.c.c.SolrZkClient Using default ZkCredentialsProvider
   [junit4]   2> 140959 INFO  (TEST-ZkStateReaderTest.testStateFormatUpdateWithTimeDelay-seed#[83027BED5969CE71]) [    ] o.a.s.c.c.ConnectionManager Waiting for client to connect to ZooKeeper
   [junit4]   2> 140980 INFO  (zkCallback-206-thread-1) [    ] o.a.s.c.c.ConnectionManager Watcher org.apache.solr.common.cloud.ConnectionManager@459a64fb name:ZooKeeperConnection Watcher:127.0.0.1:42847/solr got event WatchedEvent state:SyncConnected type:None path:null path:null type:None
   [junit4]   2> 140980 INFO  (TEST-ZkStateReaderTest.testStateFormatUpdateWithTimeDelay-seed#[83027BED5969CE71]) [    ] o.a.s.c.c.ConnectionManager Client is connected to ZooKeeper
   [junit4]   2> 140980 INFO  (TEST-ZkStateReaderTest.testStateFormatUpdateWithTimeDelay-seed#[83027BED5969CE71]) [    ] o.a.s.c.c.SolrZkClient Using default ZkACLProvider
   [junit4]   2> 140980 INFO  (TEST-ZkStateReaderTest.testStateFormatUpdateWithTimeDelay-seed#[83027BED5969CE71]) [    ] o.a.s.c.c.SolrZkClient makePath: /live_nodes
   [junit4]   2> 140981 INFO  (TEST-ZkStateReaderTest.testStateFormatUpdateWithTimeDelay-seed#[83027BED5969CE71]) [    ] o.a.s.c.c.SolrZkClient makePath: /collections
   [junit4]   2> 140982 INFO  (TEST-ZkStateReaderTest.testStateFormatUpdateWithTimeDelay-seed#[83027BED5969CE71]) [    ] o.a.s.c.c.SolrZkClient makePath: /aliases.json
   [junit4]   2> 140983 INFO  (TEST-ZkStateReaderTest.testStateFormatUpdateWithTimeDelay-seed#[83027BED5969CE71]) [    ] o.a.s.c.c.SolrZkClient makePath: /clusterstate.json
   [junit4]   2> 140983 INFO  (TEST-ZkStateReaderTest.testStateFormatUpdateWithTimeDelay-seed#[83027BED5969CE71]) [    ] o.a.s.c.c.SolrZkClient makePath: /security.json
   [junit4]   2> 140984 INFO  (TEST-ZkStateReaderTest.testStateFormatUpdateWithTimeDelay-seed#[83027BED5969CE71]) [    ] o.a.s.c.c.ZkStateReader Updating cluster state from ZooKeeper... 
   [junit4]   2> 140984 INFO  (TEST-ZkStateReaderTest.testStateFormatUpdateWithTimeDelay-seed#[83027BED5969CE71]) [    ] o.a.s.c.c.ZkStateReader Loaded empty cluster properties
   [junit4]   2> 140985 INFO  (TEST-ZkStateReaderTest.testStateFormatUpdateWithTimeDelay-seed#[83027BED5969CE71]) [    ] o.a.s.c.c.ZkStateReader Updated live nodes from ZooKeeper... (0) -> (0)
   [junit4]   2> 140986 INFO  (TEST-ZkStateReaderTest.testStateFormatUpdateWithTimeDelay-seed#[83027BED5969CE71]) [    ] o.a.s.c.c.ZkStateReader Deleting data for [c1]
   [junit4]   2> 140987 INFO  (TEST-ZkStateReaderTest.testStateFormatUpdateWithTimeDelay-seed#[83027BED5969CE71]) [    ] o.a.s.c.c.SolrZkClient makePath: /collections/c1
   [junit4]   2> 140989 INFO  (zkCallback-206-thread-1) [    ] o.a.s.c.c.ZkStateReader A collections change: [WatchedEvent state:SyncConnected type:NodeChildrenChanged path:/collections], has occurred - updating...
   [junit4]   2> 141013 INFO  (zkCallback-206-thread-2) [    ] o.a.s.c.c.ZkStateReader A cluster state change: [WatchedEvent state:SyncConnected type:NodeDataChanged path:/clusterstate.json], has occurred - updating... (live nodes size: [0])
   [junit4]   2> 141141 INFO  (TEST-ZkStateReaderTest.testStateFormatUpdateWithTimeDelay-seed#[83027BED5969CE71]) [    ] o.a.s.c.o.ZkStateWriter going to create_collection /collections/c1/state.json
   [junit4]   2> 141142 INFO  (zkCallback-206-thread-1) [    ] o.a.s.c.c.ZkStateReader A cluster state change: [WatchedEvent state:SyncConnected type:NodeCreated path:/collections/c1/state.json] for collection [c1] has occurred - updating... (live nodes size: [0])
   [junit4]   2> 141143 INFO  (zkCallback-206-thread-2) [    ] o.a.s.c.c.ZkStateReader A cluster state change: [WatchedEvent state:SyncConnected type:NodeDataChanged path:/clusterstate.json], has occurred - updating... (live nodes size: [0])
   [junit4]   2> 141187 INFO  (zkCallback-206-thread-1) [    ] o.a.s.c.c.ZkStateReader Add data for [c1] ver [0]
   [junit4]   2> 141187 INFO  (TEST-ZkStateReaderTest.testStateFormatUpdateWithTimeDelay-seed#[83027BED5969CE71]) [    ] o.a.s.c.ZkTestServer connecting to 127.0.0.1:42847 42847
   [junit4]   2> 141295 INFO  (Thread-664) [    ] o.a.s.c.ZkTestServer connecting to 127.0.0.1:42847 42847
   [junit4]   2> 141297 INFO  (TEST-ZkStateReaderTest.testStateFormatUpdateWithTimeDelay-seed#[83027BED5969CE71]) [    ] o.a.s.SolrTestCaseJ4 ###Ending testStateFormatUpdateWithTimeDelay
   [junit4]   2> NOTE: reproduce with: ant test  -Dtestcase=ZkStateReaderTest -Dtests.method=testStateFormatUpdateWithTimeDelay -Dtests.seed=83027BED5969CE71 -Dtests.multiplier=2 -Dtests.slow=true -Dtests.locale=es-UY -Dtests.timezone=Pacific/Bougainville -Dtests.asserts=true -Dtests.file.encoding=US-ASCII
   [junit4] ERROR   0.49s J1 | ZkStateReaderTest.testStateFormatUpdateWithTimeDelay <<<
   [junit4]    > Throwable #1: org.apache.solr.common.SolrException: Could not find collection : c1
   [junit4]    > 	at __randomizedtesting.SeedInfo.seed([83027BED5969CE71:FC9CCC68300BE3FB]:0)
   [junit4]    > 	at org.apache.solr.common.cloud.ClusterState.getCollection(ClusterState.java:192)
   [junit4]    > 	at org.apache.solr.cloud.overseer.ZkStateReaderTest.testStateFormatUpdate(ZkStateReaderTest.java:129)
   [junit4]    > 	at org.apache.solr.cloud.overseer.ZkStateReaderTest.testStateFormatUpdateWithTimeDelay(ZkStateReaderTest.java:51)
   [junit4]    > 	at java.lang.Thread.run(Thread.java:745)
   [junit4]   2> 141300 INFO  (TEST-ZkStateReaderTest.testExternalCollectionWatchedNotWatched-seed#[83027BED5969CE71]) [    ] o.a.s.SolrTestCaseJ4 ###Starting testExternalCollectionWatchedNotWatched
   [junit4]   2> 141300 INFO  (TEST-ZkStateReaderTest.testExternalCollectionWatchedNotWatched-seed#[83027BED5969CE71]) [    ] o.a.s.c.ZkTestServer STARTING ZK TEST SERVER
   [junit4]   2> 141307 INFO  (Thread-665) [    ] o.a.s.c.ZkTestServer client port:0.0.0.0/0.0.0.0:0
   [junit4]   2> 141307 INFO  (Thread-665) [    ] o.a.s.c.ZkTestServer Starting server
   [junit4]   2> 141407 INFO  (TEST-ZkStateReaderTest.testExternalCollectionWatchedNotWatched-seed#[83027BED5969CE71]) [    ] o.a.s.c.ZkTestServer start zk server on port:38037
   [junit4]   2> 141407 INFO  (TEST-ZkStateReaderTest.testExternalCollectionWatchedNotWatched-seed#[83027BED5969CE71]) [    ] o.a.s.c.c.SolrZkClient Using default ZkCredentialsProvider
   [junit4]   2> 141545 INFO  (TEST-ZkStateReaderTest.testExternalCollectionWatchedNotWatched-seed#[83027BED5969CE71]) [    ] o.a.s.c.c.ConnectionManager Waiting for client to connect to ZooKeeper
   [junit4]   2> 141605 INFO  (zkCallback-208-thread-1) [    ] o.a.s.c.c.ConnectionManager Watcher org.apache.solr.common.cloud.ConnectionManager@2646bcec name:ZooKeeperConnection Watcher:127.0.0.1:38037 got event WatchedEvent state:SyncConnected type:None path:null path:null type:None
   [junit4]   2> 141605 INFO  (TEST-ZkStateReaderTest.testExternalCollectionWatchedNotWatched-seed#[83027BED5969CE71]) [    ] o.a.s.c.c.ConnectionManager Client is connected to ZooKeeper
   [junit4]   2> 141605 INFO  (TEST-ZkStateReaderTest.testExternalCollectionWatchedNotWatched-seed#[83027BED5969CE71]) [    ] o.a.s.c.c.SolrZkClient Using default ZkACLProvider
   [junit4]   2> 141607 INFO  (TEST-ZkStateReaderTest.testExternalCollectionWatchedNotWatched-seed#[83027BED5969CE71]) [    ] o.a.s.c.c.SolrZkClient Using default ZkCredentialsProvider
   [junit4]   2> 141623 INFO  (TEST-ZkStateReaderTest.testExternalCollectionWatchedNotWatched-seed#[83027BED5969CE71]) [    ] o.a.s.c.c.ConnectionManager Waiting for client to connect to ZooKeeper
   [junit4]   2> 141633 INFO  (zkCallback-209-thread-1) [    ] o.a.s.c.c.ConnectionManager Watcher org.apache.solr.common.cloud.ConnectionManager@6b277adb name:ZooKeeperConnection Watcher:127.0.0.1:38037 got event WatchedEvent state:SyncConnected type:None path:null path:null type:None
   [junit4]   2> 141633 INFO  (TEST-ZkStateReaderTest.testExternalCollectionWatchedNotWatched-seed#[83027BED5969CE71]) [    ] o.a.s.c.c.ConnectionManager Client is connected to ZooKeeper
   [junit4]   2> 141634 INFO  (TEST-ZkStateReaderTest.testExternalCollectionWatchedNotWatched-seed#[83027BED5969CE71]) [    ] o.a.s.c.c.SolrZkClient Using default ZkACLProvider
   [junit4]   2> 141634 INFO  (TEST-ZkStateReaderTest.testExternalCollectionWatchedNotWatched-seed#[83027BED5969CE71]) [    ] o.a.s.c.c.SolrZkClient makePath: /solr
   [junit4]   2> 141636 INFO  (TEST-ZkStateReaderTest.testExternalCollectionWatchedNotWatched-seed#[83027BED5969CE71]) [    ] o.a.s.c.c.SolrZkClient Using default ZkCredentialsProvider
   [junit4]   2> 141651 INFO  (TEST-ZkStateReaderTest.testExternalCollectionWatchedNotWatched-seed#[83027BED5969CE71]) [    ] o.a.s.c.c.ConnectionManager Waiting for client to connect to ZooKeeper
   [junit4]   2> 141665 INFO  (zkCallback-210-thread-1) [    ] o.a.s.c.c.ConnectionManager Watcher org.apache.solr.common.cloud.ConnectionManager@bbe5e9c name:ZooKeeperConnection Watcher:127.0.0.1:38037/solr got event WatchedEvent state:SyncConnected type:None path:null path:null type:None
   [junit4]   2> 141665 INFO  (TEST-ZkStateReaderTest.testExternalCollectionWatchedNotWatched-seed#[83027BED5969CE71]) [    ] o.a.s.c.c.ConnectionManager Client is connected to ZooKeeper
   [junit4]   2> 141665 INFO  (TEST-ZkStateReaderTest.testExternalCollectionWatchedNotWatched-seed#[83027BED5969CE71]) [    ] o.a.s.c.c.SolrZkClient Using default ZkACLProvider
   [junit4]   2> 141666 INFO  (TEST-ZkStateReaderTest.testExternalCollectionWatchedNotWatched-seed#[83027BED5969CE71]) [    ] o.a.s.c.c.SolrZkClient makePath: /live_nodes
   [junit4]   2> 141667 INFO  (TEST-ZkStateReaderTest.testExternalCollectionWatchedNotWatched-seed#[83027BED5969CE71]) [    ] o.a.s.c.c.SolrZkClient makePath: /collections
   [junit4]   2> 141667 INFO  (TEST-ZkStateReaderTest.testExternalCollectionWatchedNotWatched-seed#[83027BED5969CE71]) [    ] o.a.s.c.c.SolrZkClient makePath: /aliases.json
   [junit4]   2> 141668 INFO  (TEST-ZkStateReaderTest.testExternalCollectionWatchedNotWatched-seed#[83027BED5969CE71]) [    ] o.a.s.c.c.SolrZkClient makePath: /clusterstate.json
   [junit4]   2> 141668 INFO  (TEST-ZkStateReaderTest.testExternalCollectionWatchedNotWatched-seed#[83027BED5969CE71]) [    ] o.a.s.c.c.SolrZkClient makePath: /security.json
   [junit4]   2> 141675 INFO  (TEST-ZkStateReaderTest.testExternalCollectionWatchedNotWatched-seed#[83027BED5969CE71]) [    ] o.a.s.c.c.ZkStateReader Updating cluster state from ZooKeeper... 
   [junit4]   2> 141675 INFO  (TEST-ZkStateReaderTest.testExternalCollectionWatchedNotWatched-seed#[83027BED5969CE71]) [    ] o.a.s.c.c.ZkStateReader Loaded empty cluster properties
   [junit4]   2> 141676 INFO  (TEST-ZkStateReaderTest.testExternalCollectionWatchedNotWatched-seed#[83027BED5969CE71]) [    ] o.a.s.c.c.ZkStateReader Updated live nodes from ZooKeeper... (0) -> (0)
   [junit4]   2> 141676 INFO  (TEST-ZkStateReaderTest.testExternalCollectionWatchedNotWatched-seed#[83027BED5969CE71]) [    ] o.a.s.c.c.SolrZkClient makePath: /collections/c1
   [junit4]   2> 141684 INFO  (TEST-ZkStateReaderTest.testExternalCollectionWatchedNotWatched-seed#[83027BED5969CE71]) [    ] o.a.s.c.o.ZkStateWriter going to create_collection /collections/c1/state.json
   [junit4]   2> 141685 INFO  (TEST-ZkStateReaderTest.testExternalCollectionWatchedNotWatched-seed#[83027BED5969CE71]) [    ] o.a.s.c.c.ZkStateReader Add data for [c1] ver [0]
   [junit4]   2> 141686 INFO  (zkCallback-210-thread-2) [    ] o.a.s.c.c.ZkStateReader A collections change: [WatchedEvent state:SyncConnected type:NodeChildrenChanged path:/collections], has occurred - updating...
   [junit4]   2> 141707 INFO  (TEST-ZkStateReaderTest.testExternalCollectionWatchedNotWatched-seed#[83027BED5969CE71]) [    ] o.a.s.c.ZkTestServer connecting to 127.0.0.1:38037 38037
   [junit4]   2> 141835 INFO  (Thread-665) [    ] o.a.s.c.ZkTestServer connecting to 127.0.0.1:38037 38037
   [junit4]   2> 141836 INFO  (TEST-ZkStateReaderTest.testExternalCollectionWatchedNotWatched-seed#[83027BED5969CE71]) [    ] o.a.s.SolrTestCaseJ4 ###Ending testExternalCollectionWatchedNotWatched
   [junit4]   2> 141838 INFO  (TEST-ZkStateReaderTest.testStateFormatUpdateWithTimeDelayLazy-seed#[83027BED5969CE71]) [    ] o.a.s.SolrTestCaseJ4 ###Starting testStateFormatUpdateWithTimeDelayLazy
   [junit4]   2> 141838 INFO  (TEST-ZkStateReaderTest.testStateFormatUpdateWithTimeDelayLazy-seed#[83027BED5969CE71]) [    ] o.a.s.c.ZkTestServer STARTING ZK TEST SERVER
   [junit4]   2> 141839 INFO  (Thread-666) [    ] o.a.s.c.ZkTestServer client port:0.0.0.0/0.0.0.0:0
   [junit4]   2> 141839 INFO  (Thread-666) [    ] o.a.s.c.ZkTestServer Starting server
   [junit4]   2> 141939 INFO  (TEST-ZkStateReaderTest.testStateFormatUpdateWithTimeDelayLazy-seed#[83027BED5969CE71]) [    ] o.a.s.c.ZkTestServer start zk server on port:44072
   [junit4]   2> 141939 INFO  (TEST-ZkStateReaderTest.testStateFormatUpdateWithTimeDelayLazy-seed#[83027BED5969CE71]) [    ] o.a.s.c.c.SolrZkClient Using default ZkCredentialsProvider
   [junit4]   2> 141939 INFO  (TEST-ZkStateReaderTest.testStateFormatUpdateWithTimeDelayLazy-seed#[83027BED5969CE71]) [    ] o.a.s.c.c.ConnectionManager Waiting for client to connect to ZooKeeper
   [junit4]   2> 141941 INFO  (zkCallback-212-thread-1) [    ] o.a.s.c.c.ConnectionManager Watcher org.apache.solr.common.cloud.ConnectionManager@39b2a3fb name:ZooKeeperConnection Watcher:127.0.0.1:44072 got event WatchedEvent state:SyncConnected type:None path:null path:null type:None
   [junit4]   2> 141941 INFO  (TEST-ZkStateReaderTest.testStateFormatUpdateWithTimeDelayLazy-seed#[83027BED5969CE71]) [    ] o.a.s.c.c.ConnectionManager Client is connected to ZooKeeper
   [junit4]   2> 141942 INFO  (TEST-ZkStateReaderTest.testStateFormatUpdateWithTimeDelayLazy-seed#[83027BED5969CE71]) [    ] o.a.s.c.c.SolrZkClient Using default ZkACLProvider
   [junit4]   2> 141944 INFO  (TEST-ZkStateReaderTest.testStateFormatUpdateWithTimeDelayLazy-seed#[83027BED5969CE71]) [    ] o.a.s.c.c.SolrZkClient Using default ZkCredentialsProvider
   [junit4]   2> 141944 INFO  (TEST-ZkStateReaderTest.testStateFormatUpdateWithTimeDelayLazy-seed#[83027BED5969CE71]) [    ] o.a.s.c.c.ConnectionManager Waiting for client to connect to ZooKeeper
   [junit4]   2> 141951 INFO  (zkCallback-213-thread-1) [    ] o.a.s.c.c.ConnectionManager Watcher org.apache.solr.common.cloud.ConnectionManager@69c93515 name:ZooKeeperConnection Watcher:127.0.0.1:44072 got event WatchedEvent state:SyncConnected type:None path:null path:null type:None
   [junit4]   2> 141953 INFO  (TEST-ZkStateReaderTest.testStateFormatUpdateWithTimeDelayLazy-seed#[83027BED5969CE71]) [    ] o.a.s.c.c.ConnectionManager Client is connected to ZooKeeper
   [junit4]   2> 141953 INFO  (TEST-ZkStateReaderTest.testStateFormatUpdateWithTimeDelayLazy-seed#[83027BED5969CE71]) [    ] o.a.s.c.c.SolrZkClient Using default ZkACLProvider
   [junit4]   2> 141953 INFO  (TEST-ZkStateReaderTest.testStateFormatUpdateWithTimeDelayLazy-seed#[83027BED5969CE71]) [    ] o.a.s.c.c.SolrZkClient makePath: /solr
   [junit4]   2> 141959 INFO  (TEST-ZkStateReaderTest.testStateFormatUpdateWithTimeDelayLazy-seed#[83027BED5969CE71]) [    ] o.a.s.c.c.SolrZkClient Using default ZkCredentialsProvider
   [junit4]   2> 141960 INFO  (TEST-ZkStateReaderTest.testStateFormatUpdateWithTimeDelayLazy-seed#[83027BED5969CE71]) [    ] o.a.s.c.c.ConnectionManager Waiting for client to connect to ZooKeeper
   [junit4]   2> 141971 INFO  (zkCallback-214-thread-1) [    ] o.a.s.c.c.ConnectionManager Watcher org.apache.solr.common.cloud.ConnectionManager@2e81ca32 name:ZooKeeperConnection Watcher:127.0.0.1:44072/solr got event WatchedEvent state:SyncConnected type:None path:null path:null type:None
   [junit4]   2> 141971 INFO  (TEST-ZkStateReaderTest.testStateFormatUpdateWithTimeDelayLazy-seed#[83027BED5969CE71]) [    ] o.a.s.c.c.ConnectionManager Client is connected to ZooKeeper
   [junit4]   2> 141972 INFO  (TEST-ZkStateReaderTest.testStateFormatUpdateWithTimeDelayLazy-seed#[83027BED5969CE71]) [    ] o.a.s.c.c.SolrZkClient Using default ZkACLProvider
   [junit4]   2> 141972 INFO  (TEST-ZkStateReaderTest.testStateFormatUpdateWithTimeDelayLazy-seed#[83027BED5969CE71]) [    ] o.a.s.c.c.SolrZkClient makePath: /live_nodes
   [junit4]   2> 141974 INFO  (TEST-ZkStateReaderTest.testStateFormatUpdateWithTimeDelayLazy-seed#[83027BED5969CE71]) [    ] o.a.s.c.c.SolrZkClient makePath: /collections
   [junit4]   2> 141974 INFO  (TEST-ZkStateReaderTest.testStateFormatUpdateWithTimeDelayLazy-seed#[83027BED5969CE71]) [    ] o.a.s.c.c.SolrZkClient makePath: /aliases.json
   [junit4]   2> 141975 INFO  (TEST-ZkStateReaderTest.testStateFormatUpdateWithTimeDelayLazy-seed#[83027BED5969CE71]) [    ] o.a.s.c.c.SolrZkClient makePath: /clusterstate.json
   [junit4]   2> 141977 INFO  (TEST-ZkStateReaderTest.testStateFormatUpdateWithTimeDelayLazy-seed#[83027BED5969CE71]) [    ] o.a.s.c.c.SolrZkClient makePath: /security.json
   [junit4]   2> 141978 INFO  (TEST-ZkStateReaderTest.testStateFormatUpdateWithTimeDelayLazy-seed#[83027BED5969CE71]) [    ] o.a.s.c.c.ZkStateReader Updating cluster state from ZooKeeper... 
   [junit4]   2> 141978 INFO  (TEST-ZkStateReaderTest.testStateFormatUpdateWithTimeDelayLazy-seed#[83027BED5969CE71]) [    ] o.a.s.c.c.ZkStateReader Loaded empty cluster properties
   [junit4]   2> 141979 INFO  (TEST-ZkStateReaderTest.testStateFormatUpdateWithTimeDelayLazy-seed#[83027BED5969CE71]) [    ] o.a.s.c.c.ZkStateReader Updated live nodes from ZooKeeper... (0) -> (0)
   [junit4]   2> 141983 INFO  (TEST-ZkStateReaderTest.testStateFormatUpdateWithTimeDelayLazy-seed#[83027BED5969CE71]) [    ] o.a.s.c.c.SolrZkClient makePath: /collections/c1
   [junit4]   2> 141985 INFO  (zkCallback-214-thread-1) [    ] o.a.s.c.c.ZkStateReader A collections change: [WatchedEvent state:SyncConnected type:NodeChildrenChanged path:/collections], has occurred - updating...
   [junit4]   2> 141986 INFO  (zkCallback-214-thread-1) [    ] o.a.s.c.c.ZkStateReader A cluster state change: [WatchedEvent state:SyncConnected type:NodeDataChanged path:/clusterstate.json], has occurred - updating... (live nodes size: [0])
   [junit4]   2> 141987 INFO  (TEST-ZkStateReaderTest.testStateFormatUpdateWithTimeDelayLazy-seed#[83027BED5969CE71]) [    ] o.a.s.c.o.ZkStateWriter going to create_collection /collections/c1/state.json
   [junit4]   2> 141991 INFO  (zkCallback-214-thread-1) [    ] o.a.s.c.c.ZkStateReader A cluster state change: [WatchedEvent state:SyncConnected type:NodeDataChanged path:/clusterstate.json], has occurred - updating... (live nodes size: [0])
   [junit4]   2> 142082 INFO  (TEST-ZkStateReaderTest.testStateFormatUpdateWithTimeDelayLazy-seed#[83027BED5969CE71]) [    ] o.a.s.c.ZkTestServer connecting to 127.0.0.1:44072 44072
   [junit4]   2> 142257 INFO  (Thread-666) [    ] o.a.s.c.ZkTestServer connecting to 127.0.0.1:44072 44072
   [junit4]   2> 142258 INFO  (TEST-ZkStateReaderTest.testStateFormatUpdateWithTimeDelayLazy-seed#[83027BED5969CE71]) [    ] o.a.s.SolrTestCaseJ4 ###Ending testStateFormatUpdateWithTimeDelayLazy
   [junit4]   2> 142259 INFO  (TEST-ZkStateReaderTest.testStateFormatUpdateWithExplicitRefresh-seed#[83027BED5969CE71]) [    ] o.a.s.SolrTestCaseJ4 ###Starting testStateFormatUpdateWithExplicitRefresh
   [junit4]   2> 142260 INFO  (TEST-ZkStateReaderTest.testStateFormatUpdateWithExplicitRefresh-seed#[83027BED5969CE71]) [    ] o.a.s.c.ZkTestServer STARTING ZK TEST SERVER
   [junit4]   2> 142260 INFO  (Thread-667) [    ] o.a.s.c.ZkTestServer client port:0.0.0.0/0.0.0.0:0
   [junit4]   2> 142260 INFO  (Thread-667) [    ] o.a.s.c.ZkTestServer Starting server
   [junit4]   2> 142361 INFO  (TEST-ZkStateReaderTest.testStateFormatUpdateWithExplicitRefresh-seed#[83027BED5969CE71]) [    ] o.a.s.c.ZkTestServer start zk server on port:59660
   [junit4]   2> 142361 INFO  (TEST-ZkStateReaderTest.testStateFormatUpdateWithExplicitRefresh-seed#[83027BED5969CE71]) [    ] o.a.s.c.c.SolrZkClient Using default ZkCredentialsProvider
   [junit4]   2> 142363 INFO  (TEST-ZkStateReaderTest.testStateFormatUpdateWithExplicitRefresh-seed#[83027BED5969CE71]) [    ] o.a.s.c.c.ConnectionManager Waiting for client to connect to ZooKeeper
   [junit4]   2> 142370 INFO  (zkCallback-216-thread-1) [    ] o.a.s.c.c.ConnectionManager Watcher org.apache.solr.common.cloud.ConnectionManager@7e9e8be7 name:ZooKeeperConnection Watcher:127.0.0.1:59660 got event WatchedEvent state:SyncConnected type:None path:null path:null type:None
   [junit4]   2> 142370 INFO  (TEST-ZkStateReaderTest.testStateFormatUpdateWithExplicitRefresh-seed#[83027BED5969CE71]) [    ] o.a.s.c.c.ConnectionManager Client is connected to ZooKeeper
   [junit4]   2> 142370 INFO  (TEST-ZkStateReaderTest.testStateFormatUpdateWithExplicitRefresh-seed#[83027BED5969CE71]) [    ] o.a.s.c.c.SolrZkClient Using default ZkACLProvider
   [junit4]   2> 142374 INFO  (TEST-ZkStateReaderTest.testStateFormatUpdateWithExplicitRefresh-seed#[83027BED5969CE71]) [    ] o.a.s.c.c.SolrZkClient Using default ZkCredentialsProvider
   [junit4]   2> 142374 INFO  (TEST-ZkStateReaderTest.testStateFormatUpdateWithExplicitRefresh-seed#[83027BED5969CE71]) [    ] o.a.s.c.c.ConnectionManager Waiting for client to connect to ZooKeeper
   [junit4]   2> 142375 INFO  (zkCallback-217-thread-1) [    ] o.a.s.c.c.ConnectionManager Watcher org.apache.solr.common.cloud.ConnectionManager@57abe228 name:ZooKeeperConnection Watcher:127.0.0.1:59660 got event WatchedEvent state:SyncConnected type:None path:null path:null type:None
   [junit4]   2> 142376 INFO  (TEST-ZkStateReaderTest.testStateFormatUpdateWithExplicitRefresh-seed#[83027BED5969CE71]) [    ] o.a.s.c.c.ConnectionManager Client is connected to ZooKeeper
   [junit4]   2> 142376 INFO  (TEST-ZkStateReaderTest.testStateFormatUpdateWithExplicitRefresh-seed#[83027BED5969CE71]) [    ] o.a.s.c.c.SolrZkClient Using default ZkACLProvider
   [junit4]   2> 142376 INFO  (TEST-ZkStateReaderTest.testStateFormatUpdateWithExplicitRefresh-seed#[83027BED5969CE71]) [    ] o.a.s.c.c.SolrZkClient makePath: /solr
   [junit4]   2> 142377 INFO  (TEST-ZkStateReaderTest.testStateFormatUpdateWithExplicitRefresh-seed#[83027BED5969CE71]) [    ] o.a.s.c.c.SolrZkClient Using default ZkCredentialsProvider
   [junit4]   2> 142378 INFO  (TEST-ZkStateReaderTest.testStateFormatUpdateWithExplicitRefresh-seed#[83027BED5969CE71]) [    ] o.a.s.c.c.ConnectionManager Waiting for client to connect to ZooKeeper
   [junit4]   2> 142379 INFO  (zkCallback-218-thread-1) [    ] o.a.s.c.c.ConnectionManager Watcher org.apache.solr.common.cloud.ConnectionManager@5029a1d name:ZooKeeperConnection Watcher:127.0.0.1:59660/solr got event WatchedEvent state:SyncConnected type:None path:null path:null type:None
   [junit4]   2> 142379 INFO  (TEST-ZkStateReaderTest.testStateFormatUpdateWithExplicitRefresh-seed#[83027BED5969CE71]) [    ] o.a.s.c.c.ConnectionManager Client is connected to ZooKeeper
   [junit4]   2> 142379 INFO  (TEST-ZkStateReaderTest.testStateFormatUpdateWithExplicitRefresh-seed#[83027BED5969CE71]) [    ] o.a.s.c.c.SolrZkClient Using default ZkACLProvider
   [junit4]   2> 142379 INFO  (TEST-ZkStateReaderTest.testStateFormatUpdateWithExplicitRefresh-seed#[83027BED5969CE71]) [    ] o.a.s.c.c.SolrZkClient makePath: /live_nodes
   [junit4]   2> 142380 INFO  (TEST-ZkStateReaderTest.testStateFormatUpdateWithExplicitRefresh-seed#[83027BED5969CE71]) [    ] o.a.s.c.c.SolrZkClient makePath: /collections
   [junit4]   2> 142381 INFO  (TEST-ZkStateReaderTest.testStateFormatUpdateWithExplicitRefresh-seed#[83027BED5969CE71]) [    ] o.a.s.c.c.SolrZkClient makePath: /aliases.json
   [junit4]   2> 142382 INFO  (TEST-ZkStateReaderTest.testStateFormatUpdateWithExplicitRefresh-seed#[83027BED5969CE71]) [    ] o.a.s.c.c.SolrZkClient makePath: /clusterstate.json
   [junit4]   2> 142383 INFO  (TEST-ZkStateReaderTest.testStateFormatUpdateWithExplicitRefresh-seed#[83027BED5969CE71]) [    ] o.a.s.c.c.SolrZkClient makePath: /security.json
   [junit4]   2> 142384 INFO  (TEST-ZkStateReaderTest.testStateFormatUpdateWithExplicitRefresh-seed#[83027BED5969CE71]) [    ] o.a.s.c.c.ZkStateReader Updating cluster state from ZooKeeper... 
   [junit4]   2> 142384 INFO  (TEST-ZkStateReaderTest.testStateFormatUpdateWithExplicitRefresh-seed#[83027BED5969CE71]) [    ] o.a.s.c.c.ZkStateReader Loaded empty cluster properties
   [junit4]   2> 142387 INFO  (TEST-ZkStateReaderTest.testStateFormatUpdateWithExplicitRefresh-seed#[83027BED5969CE71]) [    ] o.a.s.c.c.ZkStateReader Updated live nodes from ZooKeeper... (0) -> (0)
   [junit4]   2> 142388 INFO  (TEST-ZkStateReaderTest.testStateFormatUpdateWithExplicitRefresh-seed#[83027BED5969CE71]) [    ] o.a.s.c.c.ZkStateReader Deleting data for [c1]
   [junit4]   2> 142388 INFO  (TEST-ZkStateReaderTest.testStateFormatUpdateWithExplicitRefresh-seed#[83027BED5969CE71]) [    ] o.a.s.c.c.SolrZkClient makePath: /collections/c1
   [junit4]   2> 142389 INFO  (zkCallback-218-thread-1) [    ] o.a.s.c.c.ZkStateReader A collections change: [WatchedEvent state:SyncConnected type:NodeChildrenChanged path:/collections], has occurred - updating...
   [junit4]   2> 142390 INFO  (zkCallback-218-thread-1) [    ] o.a.s.c.c.ZkStateReader A cluster state change: [WatchedEvent state:SyncConnected type:NodeDataChanged path:/clusterstate.json], has occurred - updating... (live nodes size: [0])
   [junit4]   2> 142399 INFO  (TEST-ZkStateReaderTest.testStateFormatUpdateWithExplicitRefresh-seed#[83027BED5969CE71]) [    ] o.a.s.c.o.ZkStateWriter going to create_collection /collections/c1/state.json
   [junit4]   2> 142401 INFO  (TEST-ZkStateReaderTest.testStateFormatUpdateWithExplicitRefresh-seed#[83027BED5969CE71]) [    ] o.a.s.c.ZkTestServer connecting to 127.0.0.1:59660 59660
   [junit4]   2> 142403 ERROR (TEST-ZkStateReaderTest.testStateFormatUpdateWithExplicitRefresh-seed#[83027BED5969CE71]-EventThread) [    ] o.a.z.ClientCnxn Error while calling watcher 
   [junit4]   2> java.util.concurrent.RejectedExecutionException: Task org.apache.solr.common.util.ExecutorUtil$MDCAwareThreadPoolExecutor$$Lambda$7/1486567882@35480044 rejected from org.apache.solr.common.util.ExecutorUtil$MDCAwareThreadPoolExecutor@31779235[Terminated, pool size = 0, active threads = 0, queued tasks = 0, completed tasks = 3]
   [junit4]   2> 	at java.util.concurrent.ThreadPoolExecutor$AbortPolicy.rejectedExecution(ThreadPoolExecutor.java:2047)
   [junit4]   2> 	at java.util.concurrent.ThreadPoolExecutor.reject(ThreadPoolExecutor.java:823)
   [junit4]   2> 	at java.util.concurrent.ThreadPoolExecutor.execute(ThreadPoolExecutor.java:1369)
   [junit4]   2> 	at org.apache.solr.common.util.ExecutorUtil$MDCAwareThreadPoolExecutor.execute(ExecutorUtil.java:214)
   [junit4]   2> 	at java.util.concurrent.AbstractExecutorService.submit(AbstractExecutorService.java:112)
   [junit4]   2> 	at org.apache.solr.common.cloud.SolrZkClient$3.process(SolrZkClient.java:265)
   [junit4]   2> 	at org.apache.zookeeper.ClientCnxn$EventThread.processEvent(ClientCnxn.java:522)
   [junit4]   2> 	at org.apache.zookeeper.ClientCnxn$EventThread.run(ClientCnxn.java:498)
   [junit4]   2> 142403 ERROR (TEST-ZkStateReaderTest.testStateFormatUpdateWithExplicitRefresh-seed#[83027BED5969CE71]-EventThread) [    ] o.a.z.ClientCnxn Error while calling watcher 
   [junit4]   2> java.util.concurrent.RejectedExecutionException: Task org.apache.solr.common.util.ExecutorUtil$MDCAwareThreadPoolExecutor$$Lambda$7/1486567882@30748065 rejected from org.apache.solr.common.util.ExecutorUtil$MDCAwareThreadPoolExecutor@31779235[Terminated, pool size = 0, active threads = 0, queued tasks = 0, completed tasks = 3]
   [junit4]   2> 	at java.util.concurrent.ThreadPoolExecutor$AbortPolicy.rejectedExecution(ThreadPoolExecutor.java:2047)
   [junit4]   2> 	at java.util.concurrent.ThreadPoolExecutor.reject(ThreadPoolExecutor.java:823)
   [junit4]   2> 	at java.util.concurrent.ThreadPoolExecutor.execute(ThreadPoolExecutor.java:1369)
   [junit4]   2> 	at org.apache.solr.common.util.ExecutorUtil$MDCAwareThreadPoolExecutor.execute(ExecutorUtil.java:214)
   [junit4]   2> 	at java.util.concurrent.AbstractExecutorService.submit(AbstractExecutorService.java:112)
   [junit4]   2> 	at org.apache.solr.common.cloud.SolrZkClient$3.process(SolrZkClient.java:265)
   [junit4]   2> 	at org.apache.zookeeper.ClientCnxn$EventThread.processEvent(ClientCnxn.java:522)
   [junit4]   2> 	at org.apache.zookeeper.ClientCnxn$EventThread.run(ClientCnxn.java:498)
   [junit4]   2> 142500 INFO  (Thread-667) [    ] o.a.s.c.ZkTestServer connecting to 127.0.0.1:59660 59660
   [junit4]   2> 142500 INFO  (TEST-ZkStateReaderTest.testStateFormatUpdateWithExplicitRefresh-seed#[83027BED5969CE71]) [    ] o.a.s.SolrTestCaseJ4 ###Ending testStateFormatUpdateWithExplicitRefresh
   [junit4]   2> 142502 INFO  (TEST-ZkStateReaderTest.testStateFormatUpdateWithExplicitRefreshLazy-seed#[83027BED5969CE71]) [    ] o.a.s.SolrTestCaseJ4 ###Starting testStateFormatUpdateWithExplicitRefreshLazy
   [junit4]   2> 142502 INFO  (TEST-ZkStateReaderTest.testStateFormatUpdateWithExplicitRefreshLazy-seed#[83027BED5969CE71]) [    ] o.a.s.c.ZkTestServer STARTING ZK TEST SERVER
   [junit4]   2> 142503 INFO  (Thread-668) [    ] o.a.s.c.ZkTestServer client port:0.0.0.0/0.0.0.0:0
   [junit4]   2> 142503 INFO  (Thread-668) [    ] o.a.s.c.ZkTestServer Starting server
   [junit4]   2> 142603 INFO  (TEST-ZkStateReaderTest.testStateFormatUpdateWithExplicitRefreshLazy-seed#[83027BED5969CE71]) [    ] o.a.s.c.ZkTestServer start zk server on port:54983
   [junit4]   2> 142603 INFO  (TEST-ZkStateReaderTest.testStateFormatUpdateWithExplicitRefreshLazy-seed#[83027BED5969CE71]) [    ] o.a.s.c.c.SolrZkClient Using default ZkCredentialsProvider
   [junit4]   2> 142604 INFO  (TEST-ZkStateReaderTest.testStateFormatUpdateWithExplicitRefreshLazy-seed#[83027BED5969CE71]) [    ] o.a.s.c.c.ConnectionManager Waiting for client to connect to ZooKeeper
   [junit4]   2> 142607 INFO  (zkCallback-220-thread-1) [    ] o.a.s.c.c.ConnectionManager Watcher org.apache.solr.common.cloud.ConnectionManager@1012686e name:ZooKeeperConnection Watcher:127.0.0.1:54983 got event WatchedEvent state:SyncConnected type:None path:null path:null type:None
   [junit4]   2> 142607 INFO  (TEST-ZkStateReaderTest.testStateFormatUpdateWithExplicitRefreshLazy-seed#[83027BED5969CE71]) [    ] o.a.s.c.c.ConnectionManager Client is connected to ZooKeeper
   [junit4]   2> 142607 INFO  (TEST-ZkStateReaderTest.testStateFormatUpdateWithExplicitRefreshLazy-seed#[83027BED5969CE71]) [    ] o.a.s.c.c.SolrZkClient Using default ZkACLProvider
   [junit4]   2> 142611 INFO  (TEST-ZkStateReaderTest.testStateFormatUpdateWithExplicitRefreshLazy-seed#[83027BED5969CE71]) [    ] o.a.s.c.c.SolrZkClient Using default ZkCredentialsProvider
   [junit4]   2> 142611 INFO  (TEST-ZkStateReaderTest.testStateFormatUpdateWithExplicitRefreshLazy-seed#[83027BED5969CE71]) [    ] o.a.s.c.c.ConnectionManager Waiting for client to connect to ZooKeeper
   [junit4]   2> 142612 INFO  (zkCallback-221-thread-1) [    ] o.a.s.c.c.ConnectionManager Watcher org.apache.solr.common.cloud.ConnectionManager@7eb89c18 name:ZooKeeperConnection Watcher:127.0.0.1:54983 got event WatchedEvent state:SyncConnected type:None path:null path:null type:None
   [junit4]   2> 142612 INFO  (TEST-ZkStateReaderTest.testStateFormatUpdateWithExplicitRefreshLazy-seed#[83027BED5969CE71]) [    ] o.a.s.c.c.ConnectionManager Client is connected to ZooKeeper
   [junit4]   2> 142613 INFO  (TEST-ZkStateReaderTest.testStateFormatUpdateWithExplicitRefreshLazy-seed#[83027BED5969CE71]) [    ] o.a.s.c.c.SolrZkClient Using default ZkACLProvider
   [junit4]   2> 142613 INFO  (TEST-ZkStateReaderTest.testStateFormatUpdateWithExplicitRefreshLazy-seed#[83027BED5969CE71]) [    ] o.a.s.c.c.SolrZkClient makePath: /solr
   [junit4]   2> 142620 INFO  (TEST-ZkStateReaderTest.testStateFormatUpdateWithExplicitRefreshLazy-seed#[83027BED5969CE71]) [    ] o.a.s.c.c.SolrZkClient Using default ZkCredentialsProvider
   [junit4]   2> 142627 INFO  (TEST-ZkStateReaderTest.testStateFormatUpdateWithExplicitRefreshLazy-seed#[83027BED5969CE71]) [    ] o.a.s.c.c.ConnectionManager Waiting for client to connect to ZooKeeper
   [junit4]   2> 142629 INFO  (zkCallback-222-thread-1) [    ] o.a.s.c.c.ConnectionManager Watcher org.apache.solr.common.cloud.ConnectionManager@5cb6ee9d name:ZooKeeperConnection Watcher:127.0.0.1:54983/solr got event WatchedEvent state:SyncConnected type:None path:null path:null type:None
   [junit4]   2> 142629 INFO  (TEST-ZkStateReaderTest.testStateFormatUpdateWithExplicitRefreshLazy-seed#[83027BED5969CE71]) [    ] o.a.s.c.c.ConnectionManager Client is connected to ZooKeeper
   [junit4]   2> 142629 INFO  (TEST-ZkStateReaderTest.testStateFormatUpdateWithExplicitRefreshLazy-seed#[83027BED5969CE71]) [    ] o.a.s.c.c.SolrZkClient Using default ZkACLProvider
   [junit4]   2> 142630 INFO  (TEST-ZkStateReaderTest.testStateFormatUpdateWithExplicitRefreshLazy-seed#[83027BED5969CE71]) [    ] o.a.s.c.c.SolrZkClient makePath: /live_nodes
   [junit4]   2> 142631 INFO  (TEST-ZkStateReaderTest.testStateFormatUpdateWithExplicitRefreshLazy-seed#[83027BED5969CE71]) [    ] o.a.s.c.c.SolrZkClient makePath: /collections
   [junit4]   2> 142631 INFO  (TEST-ZkStateReaderTest.testStateFormatUpdateWithExplicitRefreshLazy-seed#[83027BED5969CE71]) [    ] o.a.s.c.c.SolrZkClient makePath: /aliases.json
   [junit4]   2> 142632 INFO  (TEST-ZkStateReaderTest.testStateFormatUpdateWithExplicitRefreshLazy-seed#[83027BED5969CE71]) [    ] o.a.s.c.c.SolrZkClient makePath: /clusterstate.json
   [junit4]   2> 142632 INFO  (TEST-ZkStateReaderTest.testStateFormatUpdateWithExplicitRefreshLazy-seed#[83027BED5969CE71]) [    ] o.a.s.c.c.SolrZkClient makePath: /security.json
   [junit4]   2> 142634 INFO  (TEST-ZkStateReaderTest.testStateFormatUpdateWithExplicitRefreshLazy-seed#[83027BED5969CE71]) [    ] o.a.s.c.c.ZkStateReader Updating cluster state from ZooKeeper... 
   [junit4]   2> 142635 INFO  (TEST-ZkStateReaderTest.testStateFormatUpdateWithExplicitRefreshLazy-seed#[83027BED5969CE71]) [    ] o.a.s.c.c.ZkStateReader Loaded empty cluster properties
   [junit4]   2> 142635 INFO  (TEST-ZkStateReaderTest.testStateFormatUpdateWithExplicitRefreshLazy-seed#[83027BED5969CE71]) [    ] o.a.s.c.c.ZkStateReader Updated live nodes from ZooKeeper... (0) -> (0)
   [junit4]   2> 142636 INFO  (TEST-ZkStateReaderTest.testStateFormatUpdateWithExplicitRefreshLazy-seed#[83027BED5969CE71]) [    ] o.a.s.c.c.SolrZkClient makePath: /collections/c1
   [junit4]   2> 142636 INFO  (zkCallback-222-thread-1) [    ] o.a.s.c.c.ZkStateReader A collections change: [WatchedEvent state:SyncConnected type:NodeChildrenChanged path:/collections], has occurred - updating...
   [junit4]   2> 142637 INFO  (zkCallback-222-thread-1) [    ] o.a.s.c.c.ZkStateReader A cluster state change: [WatchedEvent state:SyncConnected type:NodeDataChanged path:/clusterstate.json], has occurred - updating... (live nodes size: [0])
   [junit4]   2> 142641 INFO  (TEST-ZkStateReaderTest.testStateFormatUpdateWithExplicitRefreshLazy-seed#[83027BED5969CE71]) [    ] o.a.s.c.o.ZkStateWriter going to create_collection /collections/c1/state.json
   [junit4]   2> 142642 INFO  (zkCallback-222-thread-1) [    ] o.a.s.c.c.ZkStateReader A cluster state change: [WatchedEvent state:SyncConnected type:NodeDataChanged path:/clusterstate.json], has occurred - updating... (live nodes size: [0])
   [junit4]   2> 142645 INFO  (TEST-ZkStateReaderTest.testStateFormatUpdateWithExplicitRefreshLazy-seed#[83027BED5969CE71]) [    ] o.a.s.c.ZkTestServer connecting to 127.0.0.1:54983 54983
   [junit4]   2> 142813 INFO  (Thread-668) [    ] o.a.s.c.ZkTestServer connecting to 127.0.0.1:54983 54983
   [junit4]   2> 142814 INFO  (TEST-ZkStateReaderTest.testStateFormatUpdateWithExplicitRefreshLazy-seed#[83027BED5969CE71]) [    ] o.a.s.SolrTestCaseJ4 ###Ending testStateFormatUpdateWithExplicitRefreshLazy
   [junit4]   2> 142815 INFO  (TEST-ZkStateReaderTest.testWatchedCollectionCreation-seed#[83027BED5969CE71]) [    ] o.a.s.SolrTestCaseJ4 ###Starting testWatchedCollectionCreation
   [junit4]   2> 142816 INFO  (TEST-ZkStateReaderTest.testWatchedCollectionCreation-seed#[83027BED5969CE71]) [    ] o.a.s.c.ZkTestServer STARTING ZK TEST SERVER
   [junit4]   2> 142816 INFO  (Thread-669) [    ] o.a.s.c.ZkTestServer client port:0.0.0.0/0.0.0.0:0
   [junit4]   2> 142816 INFO  (Thread-669) [    ] o.a.s.c.ZkTestServer Starting server
   [junit4]   2> 142916 INFO  (TEST-ZkStateReaderTest.testWatchedCollectionCreation-seed#[83027BED5969CE71]) [    ] o.a.s.c.ZkTestServer start zk server on port:53201
   [junit4]   2> 142916 INFO  (TEST-ZkStateReaderTest.testWatchedCollectionCreation-seed#[83027BED5969CE71]) [    ] o.a.s.c.c.SolrZkClient Using default ZkCredentialsProvider
   [junit4]   2> 142917 INFO  (TEST-ZkStateReaderTest.testWatchedCollectionCreation-seed#[83027BED5969CE71]) [    ] o.a.s.c.c.ConnectionManager Waiting for client to connect to ZooKeeper
   [junit4]   2> 142927 INFO  (zkCallback-224-thread-1) [    ] o.a.s.c.c.ConnectionManager Watcher org.apache.solr.common.cloud.ConnectionManager@30eacd76 name:ZooKeeperConnection Watcher:127.0.0.1:53201 got event WatchedEvent state:SyncConnected type:None path:null path:null type:None
   [junit4]   2> 142927 INFO  (TEST-ZkStateReaderTest.testWatchedCollectionCreation-seed#[83027BED5969CE71]) [    ] o.a.s.c.c.ConnectionManager Client is connected to ZooKeeper
   [junit4]   2> 142927 INFO  (TEST-ZkStateReaderTest.testWatchedCollectionCreation-seed#[83027BED5969CE71]) [    ] o.a.s.c.c.SolrZkClient Using default ZkACLProvider
   [junit4]   2> 142928 INFO  (TEST-ZkStateReaderTest.testWatchedCollectionCreation-seed#[83027BED5969CE71]) [    ] o.a.s.c.c.SolrZkClient Using default ZkCredentialsProvider
   [junit4]   2> 142929 INFO  (TEST-ZkStateReaderTest.testWatchedCollectionCreation-seed#[83027BED5969CE71]) [    ] o.a.s.c.c.ConnectionManager Waiting for client to connect to ZooKeeper
   [junit4]   2> 142930 INFO  (zkCallback-225-thread-1) [    ] o.a.s.c.c.ConnectionManager Watcher org.apache.solr.common.cloud.ConnectionManager@11fa65d name:ZooKeeperConnection Watcher:127.0.0.1:53201 got event WatchedEvent state:SyncConnected type:None path:null path:null type:None
   [junit4]   2> 142930 INFO  (TEST-ZkStateReaderTest.testWatchedCollectionCreation-seed#[83027BED5969CE71]) [    ] o.a.s.c.c.ConnectionManager Client is connected to ZooKeeper
   [junit4]   2> 142930 INFO  (TEST-ZkStateReaderTest.testWatchedCollectionCreation-seed#[83027BED5969CE71]) [    ] o.a.s.c.c.SolrZkClient Using default ZkACLProvider
   [junit4]   2> 142930 INFO  (TEST-ZkStateReaderTest.testWatchedCollectionCreation-seed#[83027BED5969CE71]) [    ] o.a.s.c.c.SolrZkClient makePath: /solr
   [junit4]   2> 142934 WARN  (NIOServerCxn.Factory:0.0.0.0/0.0.0.0:0) [    ] o.a.z.s.NIOServerCnxn caught end of stream exception
   [junit4]   2> EndOfStreamException: Unable to read additional data from client sessionid 0x1558808096f0001, likely client has closed socket
   [junit4]   2> 	at org.apache.zookeeper.server.NIOServerCnxn.doIO(NIOServerCnxn.java:228)
   [junit4]   2> 	at org.apache.zookeeper.server.NIOServerCnxnFactory.run(NIOServerCnxnFactory.java:208)
   [junit4]   2> 	at java.lang.Thread.run(Thread.java:745)
   [junit4]   2> 142935 INFO  (TEST-ZkStateReaderTest.testWatchedCollectionCreation-seed#[83027BED5969CE71]) [    ] o.a.s.c.c.SolrZkClient Using default ZkCredentialsProvider
   [junit4]   2> 142935 INFO  (TEST-ZkStateReaderTest.testWatchedCollectionCreation-seed#[83027BED5969CE71]) [    ] o.a.s.c.c.ConnectionManager Waiting for client to connect to ZooKeeper
   [junit4]   2> 142937 INFO  (zkCallback-226-thread-1) [    ] o.a.s.c.c.ConnectionManager Watcher org.apache.solr.common.cloud.ConnectionManager@18d46132 name:ZooKeeperConnection Watcher:127.0.0.1:53201/solr got event WatchedEvent state:SyncConnected type:None path:null path:null type:None
   [junit4]   2> 142937 INFO  (TEST-ZkStateReaderTest.testWatchedCollectionCreation-seed#[83027BED5969CE71]) [    ] o.a.s.c.c.ConnectionManager Client is connected to ZooKeeper
   [junit4]   2> 142937 INFO  (TEST-ZkStateReaderTest.testWatchedCollectionCreation-seed#[83027BED5969CE71]) [    ] o.a.s.c.c.SolrZkClient Using default ZkACLProvider
   [junit4]   2> 142938 INFO  (TEST-ZkStateReaderTest.testWatchedCollectionCreation-seed#[83027BED5969CE71]) [    ] o.a.s.c.c.SolrZkClient makePath: /live_nodes
   [junit4]   2> 142940 INFO  (TEST-ZkStateReaderTest.testWatchedCollectionCreation-seed#[83027BED5969CE71]) [    ] o.a.s.c.c.SolrZkClient makePath: /collections
   [junit4]   2> 142941 INFO  (TEST-ZkStateReaderTest.testWatchedCollectionCreation-seed#[83027BED5969CE71]) [    ] o.a.s.c.c.SolrZkClient makePath: /aliases.json
   [junit4]   2> 142941 INFO  (TEST-ZkStateReaderTest.testWatchedCollectionCreation-seed#[83027BED5969CE71]) [    ] o.a.s.c.c.SolrZkClient makePath: /clusterstate.json
   [junit4]   2> 142942 INFO  (TEST-ZkStateReaderTest.testWatchedCollectionCreation-seed#[83027BED5969CE71]) [    ] o.a.s.c.c.SolrZkClient makePath: /security.json
   [junit4]   2> 142943 INFO  (TEST-ZkStateReaderTest.testWatchedCollectionCreation-seed#[83027BED5969CE71]) [    ] o.a.s.c.c.ZkStateReader Updating cluster state from ZooKeeper... 
   [junit4]   2> 142946 INFO  (TEST-ZkStateReaderTest.testWatchedCollectionCreation-seed#[83027BED5969CE71]) [    ] o.a.s.c.c.ZkStateReader Loaded empty cluster properties
   [junit4]   2> 142946 INFO  (TEST-ZkStateReaderTest.testWatchedCollectionCreation-seed#[83027BED5969CE71]) [    ] o.a.s.c.c.ZkStateReader Updated live nodes from ZooKeeper... (0) -> (0)
   [junit4]   2> 142948 INFO  (TEST-ZkStateReaderTest.testWatchedCollectionCreation-seed#[83027BED5969CE71]) [    ] o.a.s.c.c.ZkStateReader Deleting data for [c1]
   [junit4]   2> 142958 INFO  (TEST-ZkStateReaderTest.testWatchedCollectionCreation-seed#[83027BED5969CE71]) [    ] o.a.s.c.c.SolrZkClient makePath: /collections/c1
   [junit4]   2> 142959 INFO  (zkCallback-226-thread-1) [    ] o.a.s.c.c.ZkStateReader A collections change: [WatchedEvent state:SyncConnected type:NodeChildrenChanged path:/collections], has occurred - updating...
   [junit4]   2> 142960 INFO  (TEST-ZkStateReaderTest.testWatchedCollectionCreation-seed#[83027BED5969CE71]) [    ] o.a.s.c.o.ZkStateWriter going to create_collection /collections/c1/state.json
   [junit4]   2> 142968 INFO  (zkCallback-226-thread-2) [    ] o.a.s.c.c.ZkStateReader A cluster state change: [WatchedEvent state:SyncConnected type:NodeCreated path:/collections/c1/state.json] for collection [c1] has occurred - updating... (live nodes size: [0])
   [junit4]   2> 142969 INFO  (zkCallback-226-thread-2) [    ] o.a.s.c.c.ZkStateReader Add data for [c1] ver [0]
   [junit4]   2> 143012 INFO  (TEST-ZkStateReaderTest.testWatchedCollectionCreation-seed#[83027BED5969CE71]) [    ] o.a.s.c.ZkTestServer connecting to 127.0.0.1:53201 53201
   [junit4]   2> 143140 INFO  (Thread-669) [    ] o.a.s.c.ZkTestServer connecting to 127.0.0.1:53201 53201
   [junit4]   2> 143140 INFO  (TEST-ZkStateReaderTest.testWatchedCollectionCreation-seed#[83027BED5969CE71]) [    ] o.a.s.SolrTestCaseJ4 ###Ending testWatchedCollectionCreation
   [junit4]   2> 143141 INFO  (SUITE-ZkStateReaderTest-seed#[83027BED5969CE71]-worker) [    ] o.a.s.SolrTestCaseJ4 ###deleteCore
   [junit4]   2> NOTE: leaving temporary files on disk at: /x1/jenkins/jenkins-slave/workspace/Lucene-Solr-Tests-master/solr/build/solr-core/test/J1/temp/solr.cloud.overseer.ZkStateReaderTest_83027BED5969CE71-001
   [junit4]   2> Jun 25, 2016 2:47:56 PM com.carrotsearch.randomizedtesting.ThreadLeakControl checkThreadLeaks
   [junit4]   2> WARNING: Will linger awaiting termination of 1 leaked thread(s).
   [junit4]   2> NOTE: test params are: codec=Asserting(Lucene62): {}, docValues:{}, maxPointsInLeafNode=429, maxMBSortInHeap=6.886016859717387, sim=RandomSimilarity(queryNorm=false,coord=yes): {}, locale=es-UY, timezone=Pacific/Bougainville
   [junit4]   2> NOTE: Linux 3.13.0-85-generic amd64/Oracle Corporation 1.8.0_74 (64-bit)/cpus=4,threads=1,free=189698560,total=376963072
   [junit4]   2> NOTE: All tests run in this JVM: [WordBreakSolrSpellCheckerTest, SolrInfoMBeanTest, TestDynamicFieldResource, LeaderInitiatedRecoveryOnShardRestartTest, FileUtilsTest, DistribCursorPagingTest, TestRawTransformer, SoftAutoCommitTest, SpatialHeatmapFacetsTest, TestReloadDeadlock, SpellPossibilityIteratorTest, OutOfBoxZkACLAndCredentialsProvidersTest, SaslZkACLProviderTest, OpenCloseCoreStressTest, DateRangeFieldTest, SolrPluginUtilsTest, TestManagedSchema, TestFiltering, ZkStateReaderTest]
   [junit4] Completed [39/616 (1!)] on J1 in 3.12s, 6 tests, 1 error <<< FAILURES!

[...truncated 1554 lines...]
   [junit4] Suite: org.apache.solr.handler.component.DistributedFacetPivotLongTailTest
   [junit4]   2> Creating dataDir: /x1/jenkins/jenkins-slave/workspace/Lucene-Solr-Tests-master/solr/build/solr-core/test/J1/temp/solr.handler.component.DistributedFacetPivotLongTailTest_83027BED5969CE71-001/init-core-data-001
   [junit4]   2> 1906970 INFO  (SUITE-DistributedFacetPivotLongTailTest-seed#[83027BED5969CE71]-worker) [    ] o.a.s.SolrTestCaseJ4 Randomized ssl (true) and clientAuth (true) via: @org.apache.solr.util.RandomizeSSL(reason=, ssl=NaN, value=NaN, clientAuth=NaN)
   [junit4]   2> 1906975 INFO  (SUITE-DistributedFacetPivotLongTailTest-seed#[83027BED5969CE71]-worker) [    ] o.a.s.BaseDistributedSearchTestCase Setting hostContext system property: /v_/v
   [junit4]   2> 1907043 INFO  (TEST-DistributedFacetPivotLongTailTest.test-seed#[83027BED5969CE71]) [    ] o.a.s.SolrTestCaseJ4 Writing core.properties file to /x1/jenkins/jenkins-slave/workspace/Lucene-Solr-Tests-master/solr/build/solr-core/test/J1/temp/solr.handler.component.DistributedFacetPivotLongTailTest_83027BED5969CE71-001/tempDir-001/control/cores/collection1
   [junit4]   2> 1907055 INFO  (TEST-DistributedFacetPivotLongTailTest.test-seed#[83027BED5969CE71]) [    ] o.e.j.s.Server jetty-9.3.8.v20160314
   [junit4]   2> 1907060 INFO  (TEST-DistributedFacetPivotLongTailTest.test-seed#[83027BED5969CE71]) [    ] o.e.j.s.h.ContextHandler Started o.e.j.s.ServletContextHandler@6c4385ac{/v_/v,null,AVAILABLE}
   [junit4]   2> 1907061 INFO  (TEST-DistributedFacetPivotLongTailTest.test-seed#[83027BED5969CE71]) [    ] o.e.j.s.ServerConnector Started ServerConnector@85c98c3{SSL,[ssl, http/1.1]}{127.0.0.1:50697}
   [junit4]   2> 1907061 INFO  (TEST-DistributedFacetPivotLongTailTest.test-seed#[83027BED5969CE71]) [    ] o.e.j.s.Server Started @1911123ms
   [junit4]   2> 1907061 INFO  (TEST-DistributedFacetPivotLongTailTest.test-seed#[83027BED5969CE71]) [    ] o.a.s.c.s.e.JettySolrRunner Jetty properties: {hostContext=/v_/v, hostPort=50697, coreRootDirectory=/x1/jenkins/jenkins-slave/workspace/Lucene-Solr-Tests-master/solr/build/solr-core/test/J1/temp/solr.handler.component.DistributedFacetPivotLongTailTest_83027BED5969CE71-001/tempDir-001/control/cores}
   [junit4]   2> 1907062 INFO  (TEST-DistributedFacetPivotLongTailTest.test-seed#[83027BED5969CE71]) [    ] o.a.s.s.SolrDispatchFilter SolrDispatchFilter.init(): sun.misc.Launcher$AppClassLoader@73d16e93
   [junit4]   2> 1907062 INFO  (TEST-DistributedFacetPivotLongTailTest.test-seed#[83027BED5969CE71]) [    ] o.a.s.c.SolrResourceLoader new SolrResourceLoader for directory: '/x1/jenkins/jenkins-slave/workspace/Lucene-Solr-Tests-master/solr/build/solr-core/test/J1/temp/solr.handler.component.DistributedFacetPivotLongTailTest_83027BED5969CE71-001/tempDir-001/control'
   [junit4]   2> 1907062 INFO  (TEST-DistributedFacetPivotLongTailTest.test-seed#[83027BED5969CE71]) [    ] o.a.s.c.SolrResourceLoader JNDI not configured for solr (NoInitialContextEx)
   [junit4]   2> 1907062 INFO  (TEST-DistributedFacetPivotLongTailTest.test-seed#[83027BED5969CE71]) [    ] o.a.s.c.SolrResourceLoader solr home defaulted to 'solr/' (could not find system property or JNDI)
   [junit4]   2> 1907062 INFO  (TEST-DistributedFacetPivotLongTailTest.test-seed#[83027BED5969CE71]) [    ] o.a.s.c.SolrXmlConfig Loading container configuration from /x1/jenkins/jenkins-slave/workspace/Lucene-Solr-Tests-master/solr/build/solr-core/test/J1/temp/solr.handler.component.DistributedFacetPivotLongTailTest_83027BED5969CE71-001/tempDir-001/control/solr.xml
   [junit4]   2> 1907066 INFO  (TEST-DistributedFacetPivotLongTailTest.test-seed#[83027BED5969CE71]) [    ] o.a.s.c.CorePropertiesLocator Config-defined core root directory: /x1/jenkins/jenkins-slave/workspace/Lucene-Solr-Tests-master/solr/build/solr-core/test/J1/temp/solr.handler.component.DistributedFacetPivotLongTailTest_83027BED5969CE71-001/tempDir-001/control/cores
   [junit4]   2> 1907066 INFO  (TEST-DistributedFacetPivotLongTailTest.test-seed#[83027BED5969CE71]) [    ] o.a.s.c.CoreContainer New CoreContainer 1258975545
   [junit4]   2> 1907066 INFO  (TEST-DistributedFacetPivotLongTailTest.test-seed#[83027BED5969CE71]) [    ] o.a.s.c.CoreContainer Loading cores into CoreContainer [instanceDir=/x1/jenkins/jenkins-slave/workspace/Lucene-Solr-Tests-master/solr/build/solr-core/test/J1/temp/solr.handler.component.DistributedFacetPivotLongTailTest_83027BED5969CE71-001/tempDir-001/control]
   [junit4]   2> 1907066 WARN  (TEST-DistributedFacetPivotLongTailTest.test-seed#[83027BED5969CE71]) [    ] o.a.s.c.CoreContainer Couldn't add files from /x1/jenkins/jenkins-slave/workspace/Lucene-Solr-Tests-master/solr/build/solr-core/test/J1/temp/solr.handler.component.DistributedFacetPivotLongTailTest_83027BED5969CE71-001/tempDir-001/control/lib to classpath: /x1/jenkins/jenkins-slave/workspace/Lucene-Solr-Tests-master/solr/build/solr-core/test/J1/temp/solr.handler.component.DistributedFacetPivotLongTailTest_83027BED5969CE71-001/tempDir-001/control/lib
   [junit4]   2> 1907066 INFO  (TEST-DistributedFacetPivotLongTailTest.test-seed#[83027BED5969CE71]) [    ] o.a.s.h.c.HttpShardHandlerFactory created with socketTimeout : 90000,urlScheme : https,connTimeout : 15000,maxConnectionsPerHost : 20,maxConnections : 10000,corePoolSize : 0,maximumPoolSize : 2147483647,maxThreadIdleTime : 5,sizeOfQueue : -1,fairnessPolicy : false,
   [junit4]   2> 1907067 INFO  (TEST-DistributedFacetPivotLongTailTest.test-seed#[83027BED5969CE71]) [    ] o.a.s.u.UpdateShardHandler Creating UpdateShardHandler HTTP client with params: 
   [junit4]   2> 1907068 INFO  (TEST-DistributedFacetPivotLongTailTest.test-seed#[83027BED5969CE71]) [    ] o.a.s.l.LogWatcher SLF4J impl is org.slf4j.impl.Log4jLoggerFactory
   [junit4]   2> 1907068 INFO  (TEST-DistributedFacetPivotLongTailTest.test-seed#[83027BED5969CE71]) [    ] o.a.s.l.LogWatcher Registering Log Listener [Log4j (org.slf4j.impl.Log4jLoggerFactory)]
   [junit4]   2> 1907068 INFO  (TEST-DistributedFacetPivotLongTailTest.test-seed#[83027BED5969CE71]) [    ] o.a.s.c.CoreContainer Security conf doesn't exist. Skipping setup for authorization module.
   [junit4]   2> 1907068 INFO  (TEST-DistributedFacetPivotLongTailTest.test-seed#[83027BED5969CE71]) [    ] o.a.s.c.CoreContainer No authentication plugin used.
   [junit4]   2> 1907068 INFO  (TEST-DistributedFacetPivotLongTailTest.test-seed#[83027BED5969CE71]) [    ] o.a.s.c.CorePropertiesLocator Looking for core definitions underneath /x1/jenkins/jenkins-slave/workspace/Lucene-Solr-Tests-master/solr/build/solr-core/test/J1/temp/solr.handler.component.DistributedFacetPivotLongTailTest_83027BED5969CE71-001/tempDir-001/control/cores
   [junit4]   2> 1907069 INFO  (TEST-DistributedFacetPivotLongTailTest.test-seed#[83027BED5969CE71]) [    ] o.a.s.c.CoreDescriptor Created CoreDescriptor: {name=collection1, config=solrconfig.xml, loadOnStartup=true, schema=schema.xml, configSetProperties=configsetprops.json, transient=false, dataDir=data/, configSet=collection1}
   [junit4]   2> 1907069 INFO  (TEST-DistributedFacetPivotLongTailTest.test-seed#[83027BED5969CE71]) [    ] o.a.s.c.CorePropertiesLocator Found core collection1 in /x1/jenkins/jenkins-slave/workspace/Lucene-Solr-Tests-master/solr/build/solr-core/test/J1/temp/solr.handler.component.DistributedFacetPivotLongTailTest_83027BED5969CE71-001/tempDir-001/control/cores/collection1
   [junit4]   2> 1907069 INFO  (TEST-DistributedFacetPivotLongTailTest.test-seed#[83027BED5969CE71]) [    ] o.a.s.c.CorePropertiesLocator Found 1 core definitions
   [junit4]   2> 1907069 INFO  (coreLoadExecutor-6280-thread-1) [    ] o.a.s.c.SolrResourceLoader new SolrResourceLoader for directory: '/x1/jenkins/jenkins-slave/workspace/Lucene-Solr-Tests-master/solr/core/src/test-files/solr/collection1'
   [junit4]   2> 1907069 INFO  (coreLoadExecutor-6280-thread-1) [    ] o.a.s.c.SolrResourceLoader JNDI not configured for solr (NoInitialContextEx)
   [junit4]   2> 1907069 INFO  (coreLoadExecutor-6280-thread-1) [    ] o.a.s.c.SolrResourceLoader solr home defaulted to 'solr/' (could not find system property or JNDI)
   [junit4]   2> 1907069 INFO  (coreLoadExecutor-6280-thread-1) [    ] o.a.s.c.SolrResourceLoader Adding 'file:/x1/jenkins/jenkins-slave/workspace/Lucene-Solr-Tests-master/solr/core/src/test-files/solr/collection1/lib/classes/' to classloader
   [junit4]   2> 1907070 INFO  (coreLoadExecutor-6280-thread-1) [    ] o.a.s.c.SolrResourceLoader Adding 'file:/x1/jenkins/jenkins-slave/workspace/Lucene-Solr-Tests-master/solr/core/src/test-files/solr/collection1/lib/README' to classloader
   [junit4]   2> 1907080 INFO  (TEST-DistributedFacetPivotLongTailTest.test-seed#[83027BED5969CE71]) [    ] o.a.s.s.SolrDispatchFilter user.dir=/x1/jenkins/jenkins-slave/workspace/Lucene-Solr-Tests-master/solr/build/solr-core/test/J1
   [junit4]   2> 1907080 INFO  (TEST-DistributedFacetPivotLongTailTest.test-seed#[83027BED5969CE71]) [    ] o.a.s.s.SolrDispatchFilter SolrDispatchFilter.init() done
   [junit4]   2> 1907083 INFO  (coreLoadExecutor-6280-thread-1) [    ] o.a.s.c.SolrConfig current version of requestparams : -1
   [junit4]   2> 1907087 WARN  (coreLoadExecutor-6280-thread-1) [    ] o.a.s.c.Config Beginning with Solr 5.5, <mergePolicy> is deprecated, use <mergePolicyFactory> instead.
   [junit4]   2> 1907089 INFO  (coreLoadExecutor-6280-thread-1) [    ] o.a.s.c.SolrConfig Using Lucene MatchVersion: 7.0.0
   [junit4]   2> 1907124 INFO  (coreLoadExecutor-6280-thread-1) [    ] o.a.s.c.SolrConfig Loaded SolrConfig: solrconfig.xml
   [junit4]   2> 1907127 INFO  (coreLoadExecutor-6280-thread-1) [    ] o.a.s.s.IndexSchema [collection1] Schema name=test
   [junit4]   2> 1907198 INFO  (coreLoadExecutor-6280-thread-1) [    ] o.a.s.s.OpenExchangeRatesOrgProvider Initialized with rates=open-exchange-rates.json, refreshInterval=1440.
   [junit4]   2> 1907202 INFO  (coreLoadExecutor-6280-thread-1) [    ] o.a.s.s.IndexSchema default search field in schema is text
   [junit4]   2> 1907202 INFO  (coreLoadExecutor-6280-thread-1) [    ] o.a.s.s.IndexSchema unique key field: id
   [junit4]   2> 1907205 INFO  (coreLoadExecutor-6280-thread-1) [    ] o.a.s.s.FileExchangeRateProvider Reloading exchange rates from file currency.xml
   [junit4]   2> 1907206 INFO  (coreLoadExecutor-6280-thread-1) [    ] o.a.s.s.FileExchangeRateProvider Reloading exchange rates from file currency.xml
   [junit4]   2> 1907207 INFO  (coreLoadExecutor-6280-thread-1) [    ] o.a.s.s.OpenExchangeRatesOrgProvider Reloading exchange rates from open-exchange-rates.json
   [junit4]   2> 1907207 INFO  (coreLoadExecutor-6280-thread-1) [    ] o.a.s.s.OpenExchangeRatesOrgProvider Reloading exchange rates from open-exchange-rates.json
   [junit4]   2> 1907208 INFO  (coreLoadExecutor-6280-thread-1) [    ] o.a.s.c.ConfigSetProperties Did not find ConfigSet properties, assuming default properties: Can't find resource 'configsetprops.json' in classpath or '/x1/jenkins/jenkins-slave/workspace/Lucene-Solr-Tests-master/solr/core/src/test-files/solr/collection1'
   [junit4]   2> 1907208 INFO  (coreLoadExecutor-6280-thread-1) [    ] o.a.s.c.CoreContainer Creating SolrCore 'collection1' using configuration from configset /x1/jenkins/jenkins-slave/workspace/Lucene-Solr-Tests-master/solr/core/src/test-files/solr/collection1
   [junit4]   2> 1907208 INFO  (coreLoadExecutor-6280-thread-1) [    x:collection1] o.a.s.c.SolrCore org.apache.solr.core.MockDirectoryFactory
   [junit4]   2> 1907208 INFO  (coreLoadExecutor-6280-thread-1) [    x:collection1] o.a.s.c.SolrCore [[collection1] ] Opening new SolrCore at [/x1/jenkins/jenkins-slave/workspace/Lucene-Solr-Tests-master/solr/core/src/test-files/solr/collection1], dataDir=[/x1/jenkins/jenkins-slave/workspace/Lucene-Solr-Tests-master/solr/build/solr-core/test/J1/temp/solr.handler.component.DistributedFacetPivotLongTailTest_83027BED5969CE71-001/tempDir-001/control/cores/collection1/data/]
   [junit4]   2> 1907208 INFO  (coreLoadExecutor-6280-thread-1) [    x:collection1] o.a.s.c.JmxMonitoredMap JMX monitoring is enabled. Adding Solr mbeans to JMX Server: com.sun.jmx.mbeanserver.JmxMBeanServer@53b4b196
   [junit4]   2> 1907209 INFO  (coreLoadExecutor-6280-thread-1) [    x:collection1] o.a.s.c.CachingDirectoryFactory return new directory for /x1/jenkins/jenkins-slave/workspace/Lucene-Solr-Tests-master/solr/build/solr-core/test/J1/temp/solr.handler.component.DistributedFacetPivotLongTailTest_83027BED5969CE71-001/tempDir-001/control/cores/collection1/data
   [junit4]   2> 1907209 INFO  (coreLoadExecutor-6280-thread-1) [    x:collection1] o.a.s.c.SolrCore New index directory detected: old=null new=/x1/jenkins/jenkins-slave/workspace/Lucene-Solr-Tests-master/solr/build/solr-core/test/J1/temp/solr.handler.component.DistributedFacetPivotLongTailTest_83027BED5969CE71-001/tempDir-001/control/cores/collection1/data/index/
   [junit4]   2> 1907209 WARN  (coreLoadExecutor-6280-thread-1) [    x:collection1] o.a.s.c.SolrCore [collection1] Solr index directory '/x1/jenkins/jenkins-slave/workspace/Lucene-Solr-Tests-master/solr/build/solr-core/test/J1/temp/solr.handler.component.DistributedFacetPivotLongTailTest_83027BED5969CE71-001/tempDir-001/control/cores/collection1/data/index' doesn't exist. Creating new index...
   [junit4]   2> 1907209 INFO  (coreLoadExecutor-6280-thread-1) [    x:collection1] o.a.s.c.CachingDirectoryFactory return new directory for /x1/jenkins/jenkins-slave/workspace/Lucene-Solr-Tests-master/solr/build/solr-core/test/J1/temp/solr.handler.component.DistributedFacetPivotLongTailTest_83027BED5969CE71-001/tempDir-001/control/cores/collection1/data/index
   [junit4]   2> 1907209 INFO  (coreLoadExecutor-6280-thread-1) [    x:collection1] o.a.s.u.RandomMergePolicy RandomMergePolicy wrapping class org.apache.lucene.index.TieredMergePolicy: [TieredMergePolicy: maxMergeAtOnce=30, maxMergeAtOnceExplicit=49, maxMergedSegmentMB=27.37109375, floorSegmentMB=1.521484375, forceMergeDeletesPctAllowed=5.983901002071253, segmentsPerTier=20.0, maxCFSSegmentSizeMB=8.796093022207999E12, noCFSRatio=0.0
   [junit4]   2> 1907209 INFO  (coreLoadExecutor-6280-thread-1) [    x:collection1] o.a.s.c.SolrDeletionPolicy SolrDeletionPolicy.onCommit: commits: num=1
   [junit4]   2> 	commit{dir=MockDirectoryWrapper(RAMDirectory@444ec183 lockFactory=org.apache.lucene.store.SingleInstanceLockFactory@6be56af4),segFN=segments_1,generation=1}
   [junit4]   2> 1907209 INFO  (coreLoadExecutor-6280-thread-1) [    x:collection1] o.a.s.c.SolrDeletionPolicy newest commit generation = 1
   [junit4]   2> 1907212 INFO  (coreLoadExecutor-6280-thread-1) [    x:collection1] o.a.s.u.p.UpdateRequestProcessorChain creating updateRequestProcessorChain "dedupe"
   [junit4]   2> 1907212 INFO  (coreLoadExecutor-6280-thread-1) [    x:collection1] o.a.s.u.p.UpdateRequestProcessorChain inserting DistributedUpdateProcessorFactory into updateRequestProcessorChain "dedupe"
   [junit4]   2> 1907212 INFO  (coreLoadExecutor-6280-thread-1) [    x:collection1] o.a.s.u.p.UpdateRequestProcessorChain creating updateRequestProcessorChain "dedupe-allfields"
   [junit4]   2> 1907212 INFO  (coreLoadExecutor-6280-thread-1) [    x:collection1] o.a.s.u.p.UpdateRequestProcessorChain inserting DistributedUpdateProcessorFactory into updateRequestProcessorChain "dedupe-allfields"
   [junit4]   2> 1907212 INFO  (coreLoadExecutor-6280-thread-1) [    x:collection1] o.a.s.u.p.UpdateRequestProcessorChain creating updateRequestProcessorChain "stored_sig"
   [junit4]   2> 1907212 INFO  (coreLoadExecutor-6280-thread-1) [    x:collection1] o.a.s.u.p.UpdateRequestProcessorChain inserting DistributedUpdateProcessorFactory into updateRequestProcessorChain "stored_sig"
   [junit4]   2> 1907212 INFO  (coreLoadExecutor-6280-thread-1) [    x:collection1] o.a.s.u.p.UpdateRequestProcessorChain creating updateRequestProcessorChain "uniq-fields"
   [junit4]   2> 1907212 INFO  (coreLoadExecutor-6280-thread-1) [    x:collection1] o.a.s.u.p.UpdateRequestProcessorChain inserting DistributedUpdateProcessorFactory into updateRequestProcessorChain "uniq-fields"
   [junit4]   2> 1907212 INFO  (coreLoadExecutor-6280-thread-1) [    x:collection1] o.a.s.u.p.UpdateRequestProcessorChain creating updateRequestProcessorChain "distrib-dup-test-chain-explicit"
   [junit4]   2> 1907212 INFO  (coreLoadExecutor-6280-thread-1) [    x:collection1] o.a.s.u.p.UpdateRequestProcessorChain creating updateRequestProcessorChain "distrib-dup-test-chain-implicit"
   [junit4]   2> 1907212 INFO  (coreLoadExecutor-6280-thread-1) [    x:collection1] o.a.s.u.p.UpdateRequestProcessorChain inserting DistributedUpdateProcessorFactory into updateRequestProcessorChain "distrib-dup-test-chain-implicit"
   [junit4]   2> 1907212 INFO  (coreLoadExecutor-6280-thread-1) [    x:collection1] o.a.s.c.SolrCore no updateRequestProcessorChain defined as default, creating implicit default
   [junit4]   2> 1907213 INFO  (coreLoadExecutor-6280-thread-1) [    x:collection1] o.a.s.h.l.XMLLoader xsltCacheLifetimeSeconds=60
   [junit4]   2> 1907214 INFO  (coreLoadExecutor-6280-thread-1) [    x:collection1] o.a.s.h.l.XMLLoader xsltCacheLifetimeSeconds=60
   [junit4]   2> 1907214 INFO  (coreLoadExecutor-6280-thread-1) [    x:collection1] o.a.s.h.l.XMLLoader xsltCacheLifetimeSeconds=60
   [junit4]   2> 1907215 INFO  (coreLoadExecutor-6280-thread-1) [    x:collection1] o.a.s.h.l.XMLLoader xsltCacheLifetimeSeconds=60
   [junit4]   2> 1907217 INFO  (coreLoadExecutor-6280-thread-1) [    x:collection1] o.a.s.c.PluginBag requestHandler : 'lazy' created with startup=lazy 
   [junit4]   2> 1907217 INFO  (coreLoadExecutor-6280-thread-1) [    x:collection1] o.a.s.c.RequestHandlers Registered paths: /admin/mbeans,standard,spellCheckCompRH,lazy,/update/json/docs,/admin/luke,/export,spellCheckWithWordbreak_Direct,tvrh,/get,/admin/properties,/update/json,mltrh,/admin/threads,/search-facet-def,/update/csv,/sql,/graph,/search-facet-invariants,/admin/segments,spellCheckCompRH1,/mlt,/admin/system,/replication,dismax,defaults,/config,/stream,/schema,/admin/plugins,/admin/logging,spellCheckWithWordbreak,mock,/admin/ping,/update,/admin/file,/terms,spellCheckCompRH_Direct,/debug/dump
   [junit4]   2> 1907218 INFO  (coreLoadExecutor-6280-thread-1) [    x:collection1] o.a.s.c.SolrCore Using default statsCache cache: org.apache.solr.search.stats.LocalStatsCache
   [junit4]   2> 1907218 INFO  (OldIndexDirectoryCleanupThreadForCore-collection1) [    x:collection1] o.a.s.c.SolrCore Looking for old index directories to cleanup for core collection1 in /x1/jenkins/jenkins-slave/workspace/Lucene-Solr-Tests-master/solr/build/solr-core/test/J1/temp/solr.handler.component.DistributedFacetPivotLongTailTest_83027BED5969CE71-001/tempDir-001/control/cores/collection1/data/
   [junit4]   2> 1907218 WARN  (OldIndexDirectoryCleanupThreadForCore-collection1) [    x:collection1] o.a.s.c.DirectoryFactory /x1/jenkins/jenkins-slave/workspace/Lucene-Solr-Tests-master/solr/build/solr-core/test/J1/temp/solr.handler.component.DistributedFacetPivotLongTailTest_83027BED5969CE71-001/tempDir-001/control/cores/collection1/data/ does not point to a valid data directory; skipping clean-up of old index directories.
   [junit4]   2> 1907218 INFO  (coreLoadExecutor-6280-thread-1) [    x:collection1] o.a.s.u.UpdateHandler Using UpdateLog implementation: org.apache.solr.update.UpdateLog
   [junit4]   2> 1907218 INFO  (coreLoadExecutor-6280-thread-1) [    x:collection1] o.a.s.u.UpdateLog Initializing UpdateLog: dataDir= defaultSyncLevel=FLUSH numRecordsToKeep=100 maxNumLogsToKeep=10 numVersionBuckets=65536
   [junit4]   2> 1907219 INFO  (coreLoadExecutor-6280-thread-1) [    x:collection1] o.a.s.u.CommitTracker Hard AutoCommit: disabled
   [junit4]   2> 1907219 INFO  (coreLoadExecutor-6280-thread-1) [    x:collection1] o.a.s.u.CommitTracker Soft AutoCommit: disabled
   [junit4]   2> 1907219 INFO  (coreLoadExecutor-6280-thread-1) [    x:collection1] o.a.s.u.RandomMergePolicy RandomMergePolicy wrapping class org.apache.lucene.index.LogDocMergePolicy: [LogDocMergePolicy: minMergeSize=1000, mergeFactor=48, maxMergeSize=9223372036854775807, maxMergeSizeForForcedMerge=9223372036854775807, calibrateSizeByDeletes=false, maxMergeDocs=2147483647, maxCFSSegmentSizeMB=8.796093022207999E12, noCFSRatio=1.0]
   [junit4]   2> 1907219 INFO  (coreLoadExecutor-6280-thread-1) [    x:collection1] o.a.s.c.SolrDeletionPolicy SolrDeletionPolicy.onInit: commits: num=1
   [junit4]   2> 	commit{dir=MockDirectoryWrapper(RAMDirectory@444ec183 lockFactory=org.apache.lucene.store.SingleInstanceLockFactory@6be56af4),segFN=segments_1,generation=1}
   [junit4]   2> 1907219 INFO  (coreLoadExecutor-6280-thread-1) [    x:collection1] o.a.s.c.SolrDeletionPolicy newest commit generation = 1
   [junit4]   2> 1907219 INFO  (coreLoadExecutor-6280-thread-1) [    x:collection1] o.a.s.s.SolrIndexSearcher Opening [Searcher@17dd45ad[collection1] main]
   [junit4]   2> 1907219 INFO  (coreLoadExecutor-6280-thread-1) [    x:collection1] o.a.s.r.RestManager Initializing RestManager with initArgs: {storageIO=org.apache.solr.rest.ManagedResourceStorage$InMemoryStorageIO}
   [junit4]   2> 1907220 INFO  (coreLoadExecutor-6280-thread-1) [    x:collection1] o.a.s.r.ManagedResourceStorage Reading _rest_managed.json using InMemoryStorage
   [junit4]   2> 1907220 INFO  (coreLoadExecutor-6280-thread-1) [    x:collection1] o.a.s.r.RestManager Initializing 0 registered ManagedResources
   [junit4]   2> 1907220 INFO  (coreLoadExecutor-6280-thread-1) [    x:collection1] o.a.s.h.c.SpellCheckComponent Initializing spell checkers
   [junit4]   2> 1907226 INFO  (coreLoadExecutor-6280-thread-1) [    x:collection1] o.a.s.s.DirectSolrSpellChecker init: {name=direct,classname=DirectSolrSpellChecker,field=lowerfilt,minQueryLength=3}
   [junit4]   2> 1907249 INFO  (coreLoadExecutor-6280-thread-1) [    x:collection1] o.a.s.h.ReplicationHandler Commits will be reserved for  10000
   [junit4]   2> 1907249 INFO  (searcherExecutor-6281-thread-1-processing-x:collection1) [    x:collection1] o.a.s.h.c.SpellCheckComponent Loading spell index for spellchecker: default
   [junit4]   2> 1907249 INFO  (searcherExecutor-6281-thread-1-processing-x:collection1) [    x:collection1] o.a.s.h.c.SpellCheckComponent Loading spell index for spellchecker: direct
   [junit4]   2> 1907249 INFO  (searcherExecutor-6281-thread-1-processing-x:collection1) [    x:collection1] o.a.s.h.c.SpellCheckComponent Loading spell index for spellchecker: wordbreak
   [junit4]   2> 1907249 INFO  (searcherExecutor-6281-thread-1-processing-x:collection1) [    x:collection1] o.a.s.h.c.SpellCheckComponent Loading spell index for spellchecker: multipleFields
   [junit4]   2> 1907249 INFO  (searcherExecutor-6281-thread-1-processing-x:collection1) [    x:collection1] o.a.s.h.c.SpellCheckComponent Loading spell index for spellchecker: jarowinkler
   [junit4]   2> 1907249 INFO  (searcherExecutor-6281-thread-1-processing-x:collection1) [    x:collection1] o.a.s.h.c.SpellCheckComponent Loading spell index for spellchecker: external
   [junit4]   2> 1907250 INFO  (searcherExecutor-6281-thread-1-processing-x:collection1) [    x:collection1] o.a.s.h.c.SpellCheckComponent Loading spell index for spellchecker: freq
   [junit4]   2> 1907250 INFO  (searcherExecutor-6281-thread-1-processing-x:collection1) [    x:collection1] o.a.s.h.c.SpellCheckComponent Loading spell index for spellchecker: fqcn
   [junit4]   2> 1907250 INFO  (searcherExecutor-6281-thread-1-processing-x:collection1) [    x:collection1] o.a.s.h.c.SpellCheckComponent Loading spell index for spellchecker: perDict
   [junit4]   2> 1907250 INFO  (searcherExecutor-6281-thread-1-processing-x:collection1) [    x:collection1] o.a.s.c.SolrCore [collection1] Registered new searcher Searcher@17dd45ad[collection1] main{ExitableDirectoryReader(UninvertingDirectoryReader())}
   [junit4]   2> 1907251 INFO  (coreLoadExecutor-6280-thread-1) [    x:collection1] o.a.s.u.UpdateLog Looking up max value of version field to seed version buckets
   [junit4]   2> 1907251 INFO  (coreLoadExecutor-6280-thread-1) [    x:collection1] o.a.s.u.VersionInfo Refreshing highest value of _version_ for 65536 version buckets from index
   [junit4]   2> 1907251 INFO  (coreLoadExecutor-6280-thread-1) [    x:collection1] o.a.s.u.VersionInfo No terms found for _version_, cannot seed version bucket highest value from index
   [junit4]   2> 1907251 INFO  (coreLoadExecutor-6280-thread-1) [    x:collection1] o.a.s.u.UpdateLog Could not find max version in index or recent updates, using new clock 1538122412662456320
   [junit4]   2> 1907253 INFO  (coreLoadExecutor-6280-thread-1) [    x:collection1] o.a.s.u.UpdateLog Took 1.0ms to seed version buckets with highest version 1538122412662456320
   [junit4]   2> 1907253 INFO  (coreLoadExecutor-6280-thread-1) [    x:collection1] o.a.s.c.CoreContainer registering core: collection1
   [junit4]   2> 1907644 INFO  (TEST-DistributedFacetPivotLongTailTest.test-seed#[83027BED5969CE71]) [    ] o.a.s.SolrTestCaseJ4 Writing core.properties file to /x1/jenkins/jenkins-slave/workspace/Lucene-Solr-Tests-master/solr/build/solr-core/test/J1/temp/solr.handler.component.DistributedFacetPivotLongTailTest_83027BED5969CE71-001/tempDir-001/shard0/cores/collection1
   [junit4]   2> 1907647 INFO  (TEST-DistributedFacetPivotLongTailTest.test-seed#[83027BED5969CE71]) [    ] o.e.j.s.Server jetty-9.3.8.v20160314
   [junit4]   2> 1907648 INFO  (TEST-DistributedFacetPivotLongTailTest.test-seed#[83027BED5969CE71]) [    ] o.e.j.s.h.ContextHandler Started o.e.j.s.ServletContextHandler@38ea279f{/v_/v,null,AVAILABLE}
   [junit4]   2> 1907649 INFO  (TEST-DistributedFacetPivotLongTailTest.test-seed#[83027BED5969CE71]) [    ] o.e.j.s.ServerConnector Started ServerConnector@2b6b7121{SSL,[ssl, http/1.1]}{127.0.0.1:41166}
   [junit4]   2> 1907649 INFO  (TEST-DistributedFacetPivotLongTailTest.test-seed#[83027BED5969CE71]) [    ] o.e.j.s.Server Started @1911710ms
   [junit4]   2> 1907649 INFO  (TEST-DistributedFacetPivotLongTailTest.test-seed#[83027BED5969CE71]) [    ] o.a.s.c.s.e.JettySolrRunner Jetty properties: {hostContext=/v_/v, hostPort=41166, coreRootDirectory=/x1/jenkins/jenkins-slave/workspace/Lucene-Solr-Tests-master/solr/build/solr-core/test/J1/temp/solr.handler.component.DistributedFacetPivotLongTailTest_83027BED5969CE71-001/tempDir-001/shard0/cores}
   [junit4]   2> 1907650 INFO  (TEST-DistributedFacetPivotLongTailTest.test-seed#[83027BED5969CE71]) [    ] o.a.s.s.SolrDispatchFilter SolrDispatchFilter.init(): sun.misc.Launcher$AppClassLoader@73d16e93
   [junit4]   2> 1907650 INFO  (TEST-DistributedFacetPivotLongTailTest.test-seed#[83027BED5969CE71]) [    ] o.a.s.c.SolrResourceLoader new SolrResourceLoader for directory: '/x1/jenkins/jenkins-slave/workspace/Lucene-Solr-Tests-master/solr/build/solr-core/test/J1/temp/solr.handler.component.DistributedFacetPivotLongTailTest_83027BED5969CE71-001/tempDir-001/shard0'
   [junit4]   2> 1907650 INFO  (TEST-DistributedFacetPivotLongTailTest.test-seed#[83027BED5969CE71]) [    ] o.a.s.c.SolrResourceLoader JNDI not configured for solr (NoInitialContextEx)
   [junit4]   2> 1907650 INFO  (TEST-DistributedFacetPivotLongTailTest.test-seed#[83027BED5969CE71]) [    ] o.a.s.c.SolrResourceLoader solr home defaulted to 'solr/' (could not find system property or JNDI)
   [junit4]   2> 1907650 INFO  (TEST-DistributedFacetPivotLongTailTest.test-seed#[83027BED5969CE71]) [    ] o.a.s.c.SolrXmlConfig Loading container configuration from /x1/jenkins/jenkins-slave/workspace/Lucene-Solr-Tests-master/solr/build/solr-core/test/J1/temp/solr.handler.component.DistributedFacetPivotLongTailTest_83027BED5969CE71-001/tempDir-001/shard0/solr.xml
   [junit4]   2> 1907654 INFO  (TEST-DistributedFacetPivotLongTailTest.test-seed#[83027BED5969CE71]) [    ] o.a.s.c.CorePropertiesLocator Config-defined core root directory: /x1/jenkins/jenkins-slave/workspace/Lucene-Solr-Tests-master/solr/build/solr-core/test/J1/temp/solr.handler.component.DistributedFacetPivotLongTailTest_83027BED5969CE71-001/tempDir-001/shard0/cores
   [junit4]   2> 1907654 INFO  (TEST-DistributedFacetPivotLongTailTest.test-seed#[83027BED5969CE71]) [    ] o.a.s.c.CoreContainer New CoreContainer 39295885
   [junit4]   2> 1907654 INFO  (TEST-DistributedFacetPivotLongTailTest.test-seed#[83027BED5969CE71]) [    ] o.a.s.c.CoreContainer Loading cores into CoreContainer [instanceDir=/x1/jenkins/jenkins-slave/workspace/Lucene-Solr-Tests-master/solr/build/solr-core/test/J1/temp/solr.handler.component.DistributedFacetPivotLongTailTest_83027BED5969CE71-001/tempDir-001/shard0]
   [junit4]   2> 1907654 WARN  (TEST-DistributedFacetPivotLongTailTest.test-seed#[83027BED5969CE71]) [    ] o.a.s.c.CoreContainer Couldn't add files from /x1/jenkins/jenkins-slave/workspace/Lucene-Solr-Tests-master/solr/build/solr-core/test/J1/temp/solr.handler.component.DistributedFacetPivotLongTailTest_83027BED5969CE71-001/tempDir-001/shard0/lib to classpath: /x1/jenkins/jenkins-slave/workspace/Lucene-Solr-Tests-master/solr/build/solr-core/test/J1/temp/solr.handler.component.DistributedFacetPivotLongTailTest_83027BED5969CE71-001/tempDir-001/shard0/lib
   [junit4]   2> 1907654 INFO  (TEST-DistributedFacetPivotLongTailTest.test-seed#[83027BED5969CE71]) [    ] o.a.s.h.c.HttpShardHandlerFactory created with socketTimeout : 90000,urlScheme : https,connTimeout : 15000,maxConnectionsPerHost : 20,maxConnections : 10000,corePoolSize : 0,maximumPoolSize : 2147483647,maxThreadIdleTime : 5,sizeOfQueue : -1,fairnessPolicy : false,
   [junit4]   2> 1907655 INFO  (TEST-DistributedFacetPivotLongTailTest.test-seed#[83027BED5969CE71]) [    ] o.a.s.u.UpdateShardHandler Creating UpdateShardHandler HTTP client with params: 
   [junit4]   2> 1907656 INFO  (TEST-DistributedFacetPivotLongTailTest.test-seed#[83027BED5969CE71]) [    ] o.a.s.l.LogWatcher SLF4J impl is org.slf4j.impl.Log4jLoggerFactory
   [junit4]   2> 1907656 INFO  (TEST-DistributedFacetPivotLongTailTest.test-seed#[83027BED5969CE71]) [    ] o.a.s.l.LogWatcher Registering Log Listener [Log4j (org.slf4j.impl.Log4jLoggerFactory)]
   [junit4]   2> 1907656 INFO  (TEST-DistributedFacetPivotLongTailTest.test-seed#[83027BED5969CE71]) [    ] o.a.s.c.CoreContainer Security conf doesn't exist. Skipping setup for authorization module.
   [junit4]   2> 1907656 INFO  (TEST-DistributedFacetPivotLongTailTest.test-seed#[83027BED5969CE71]) [    ] o.a.s.c.CoreContainer No authentication plugin used.
   [junit4]   2> 1907656 INFO  (TEST-DistributedFacetPivotLongTailTest.test-seed#[83027BED5969CE71]) [    ] o.a.s.c.CorePropertiesLocator Looking for core definitions underneath /x1/jenkins/jenkins-slave/workspace/Lucene-Solr-Tests-master/solr/build/solr-core/test/J1/temp/solr.handler.component.DistributedFacetPivotLongTailTest_83027BED5969CE71-001/tempDir-001/shard0/cores
   [junit4]   2> 1907657 INFO  (TEST-DistributedFacetPivotLongTailTest.test-seed#[83027BED5969CE71]) [    ] o.a.s.c.CoreDescriptor Created CoreDescriptor: {name=collection1, config=solrconfig.xml, loadOnStartup=true, schema=schema.xml, configSetProperties=configsetprops.json, transient=false, dataDir=data/, configSet=collection1}
   [junit4]   2> 1907657 INFO  (TEST-DistributedFacetPivotLongTailTest.test-seed#[83027BED5969CE71]) [    ] o.a.s.c.CorePropertiesLocator Found core collection1 in /x1/jenkins/jenkins-slave/workspace/Lucene-Solr-Tests-master/solr/build/solr-core/test/J1/temp/solr.handler.component.DistributedFacetPivotLongTailTest_83027BED5969CE71-001/tempDir-001/shard0/cores/collection1
   [junit4]   2> 1907657 INFO  (TEST-DistributedFacetPivotLongTailTest.test-seed#[83027BED5969CE71]) [    ] o.a.s.c.CorePropertiesLocator Found 1 core definitions
   [junit4]   2> 1907657 INFO  (coreLoadExecutor-6291-thread-1) [    ] o.a.s.c.SolrResourceLoader new SolrResourceLoader for directory: '/x1/jenkins/jenkins-slave/workspace/Lucene-Solr-Tests-master/solr/core/src/test-files/solr/collection1'
   [junit4]   2> 1907657 INFO  (TEST-DistributedFacetPivotLongTailTest.test-seed#[83027BED5969CE71]) [    ] o.a.s.s.SolrDispatchFilter user.dir=/x1/jenkins/jenkins-slave/workspace/Lucene-Solr-Tests-master/solr/build/solr-core/test/J1
   [junit4]   2> 1907657 INFO  (coreLoadExecutor-6291-thread-1) [    ] o.a.s.c.SolrResourceLoader JNDI not configured for solr (NoInitialContextEx)
   [junit4]   2> 1907657 INFO  (TEST-DistributedFacetPivotLongTailTest.test-seed#[83027BED5969CE71]) [    ] o.a.s.s.SolrDispatchFilter SolrDispatchFilter.init() done
   [junit4]   2> 1907657 INFO  (coreLoadExecutor-6291-thread-1) [    ] o.a.s.c.SolrResourceLoader solr home defaulted to 'solr/' (could not find system property or JNDI)
   [junit4]   2> 1907658 INFO  (coreLoadExecutor-6291-thread-1) [    ] o.a.s.c.SolrResourceLoader Adding 'file:/x1/jenkins/jenkins-slave/workspace/Lucene-Solr-Tests-master/solr/core/src/test-files/solr/collection1/lib/classes/' to classloader
   [junit4]   2> 1907658 INFO  (coreLoadExecutor-6291-thread-1) [    ] o.a.s.c.SolrResourceLoader Adding 'file:/x1/jenkins/jenkins-slave/workspace/Lucene-Solr-Tests-master/solr/core/src/test-files/solr/collection1/lib/README' to classloader
   [junit4]   2> 1907672 INFO  (coreLoadExecutor-6291-thread-1) [    ] o.a.s.c.SolrConfig current version of requestparams : -1
   [junit4]   2> 1907677 WARN  (coreLoadExecutor-6291-thread-1) [    ] o.a.s.c.Config Beginning with Solr 5.5, <mergePolicy> is deprecated, use <mergePolicyFactory> instead.
   [junit4]   2> 1907678 INFO  (coreLoadExecutor-6291-thread-1) [    ] o.a.s.c.SolrConfig Using Lucene MatchVersion: 7.0.0
   [junit4]   2> 1907691 INFO  (coreLoadExecutor-6291-thread-1) [    ] o.a.s.c.SolrConfig Loaded SolrConfig: solrconfig.xml
   [junit4]   2> 1907694 INFO  (coreLoadExecutor-6291-thread-1) [    ] o.a.s.s.IndexSchema [collection1] Schema name=test
   [junit4]   2> 1907779 INFO  (coreLoadExecutor-6291-thread-1) [    ] o.a.s.s.OpenExchangeRatesOrgProvider Initialized with rates=open-exchange-rates.json, refreshInterval=1440.
   [junit4]   2> 1907783 INFO  (coreLoadExecutor-6291-thread-1) [    ] o.a.s.s.IndexSchema default search field in schema is text
   [junit4]   2> 1907784 INFO  (coreL

[...truncated too long message...]

ints.permits(SSLAlgorithmConstraints.java:149)
   [junit4]    > 	at sun.security.ssl.SSLContextImpl.getApplicableCipherSuiteList(SSLContextImpl.java:349)
   [junit4]    > 	at sun.security.ssl.SSLContextImpl.getDefaultCipherSuiteList(SSLContextImpl.java:304)
   [junit4]    > 	at sun.security.ssl.SSLSocketImpl.init(SSLSocketImpl.java:626)
   [junit4]    > 	at sun.security.ssl.SSLSocketImpl.<init>(SSLSocketImpl.java:567)
   [junit4]    > 	at sun.security.ssl.SSLSocketFactoryImpl.createSocket(SSLSocketFactoryImpl.java:110)
   [junit4]    > 	at org.apache.http.conn.ssl.SSLConnectionSocketFactory.createLayeredSocket(SSLConnectionSocketFactory.java:363)
   [junit4]    > 	at org.apache.http.conn.ssl.SSLConnectionSocketFactory.connectSocket(SSLConnectionSocketFactory.java:353)
   [junit4]    > 	at org.apache.http.impl.conn.DefaultHttpClientConnectionOperator.connect(DefaultHttpClientConnectionOperator.java:134)
   [junit4]    > 	at org.apache.http.impl.conn.PoolingHttpClientConnectionManager.connect(PoolingHttpClientConnectionManager.java:353)
   [junit4]    > 	at org.apache.http.impl.execchain.MainClientExec.establishRoute(MainClientExec.java:380)
   [junit4]    > 	at org.apache.http.impl.execchain.MainClientExec.execute(MainClientExec.java:236)
   [junit4]    > 	at org.apache.http.impl.execchain.ProtocolExec.execute(ProtocolExec.java:184)
   [junit4]    > 	at org.apache.http.impl.execchain.RetryExec.execute(RetryExec.java:88)
   [junit4]    > 	at org.apache.http.impl.execchain.RedirectExec.execute(RedirectExec.java:110)
   [junit4]    > 	at org.apache.http.impl.client.InternalHttpClient.doExecute(InternalHttpClient.java:184)
   [junit4]    > 	at org.apache.http.impl.client.CloseableHttpClient.execute(CloseableHttpClient.java:82)
   [junit4]    > 	at org.apache.http.impl.client.CloseableHttpClient.execute(CloseableHttpClient.java:55)
   [junit4]    > 	at org.apache.solr.client.solrj.impl.HttpSolrClient.executeMethod(HttpSolrClient.java:511)
   [junit4]    > 	at org.apache.solr.client.solrj.impl.HttpSolrClient.request(HttpSolrClient.java:259)
   [junit4]    > 	at org.apache.solr.client.solrj.impl.HttpSolrClient.request(HttpSolrClient.java:248)
   [junit4]    > 	at org.apache.solr.client.solrj.SolrRequest.process(SolrRequest.java:149)
   [junit4]    > 	at org.apache.solr.client.solrj.SolrClient.add(SolrClient.java:173)
   [junit4]    > 	at org.apache.solr.client.solrj.SolrClient.add(SolrClient.java:138)
   [junit4]    > 	at org.apache.solr.client.solrj.SolrClient.add(SolrClient.java:152)
   [junit4]    > 	at org.apache.solr.handler.component.DistributedFacetPivotLongTailTest.test(DistributedFacetPivotLongTailTest.java:70)
   [junit4]   2> 1965103 INFO  (SUITE-DistributedFacetPivotLongTailTest-seed#[83027BED5969CE71]-worker) [    ] o.a.s.SolrTestCaseJ4 ###deleteCore
   [junit4]   2> NOTE: leaving temporary files on disk at: /x1/jenkins/jenkins-slave/workspace/Lucene-Solr-Tests-master/solr/build/solr-core/test/J1/temp/solr.handler.component.DistributedFacetPivotLongTailTest_83027BED5969CE71-001
   [junit4]   2> NOTE: test params are: codec=Asserting(Lucene62): {stat_i=FST50, range_facet_l_dv=Lucene50(blocksize=128), _version_=FST50, multiDefault=PostingsFormat(name=MockRandom), intDefault=FST50, foo_s=PostingsFormat(name=MockRandom), id=Lucene50(blocksize=128), range_facet_i_dv=PostingsFormat(name=MockRandom), range_facet_l=PostingsFormat(name=MockRandom), timestamp=PostingsFormat(name=MockRandom)}, docValues:{range_facet_l_dv=DocValuesFormat(name=Memory), range_facet_i_dv=DocValuesFormat(name=Lucene54), timestamp=DocValuesFormat(name=Lucene54)}, maxPointsInLeafNode=1423, maxMBSortInHeap=5.821133063610187, sim=ClassicSimilarity, locale=sr-CS, timezone=America/Montreal
   [junit4]   2> NOTE: Linux 3.13.0-85-generic amd64/Oracle Corporation 1.8.0_74 (64-bit)/cpus=4,threads=1,free=77975312,total=477626368
   [junit4]   2> NOTE: All tests run in this JVM: [WordBreakSolrSpellCheckerTest, SolrInfoMBeanTest, TestDynamicFieldResource, LeaderInitiatedRecoveryOnShardRestartTest, FileUtilsTest, DistribCursorPagingTest, TestRawTransformer, SoftAutoCommitTest, SpatialHeatmapFacetsTest, TestReloadDeadlock, SpellPossibilityIteratorTest, OutOfBoxZkACLAndCredentialsProvidersTest, SaslZkACLProviderTest, OpenCloseCoreStressTest, DateRangeFieldTest, SolrPluginUtilsTest, TestManagedSchema, TestFiltering, ZkStateReaderTest, NumericFieldsTest, TestTestInjection, TestGeoJSONResponseWriter, AliasIntegrationTest, CdcrUpdateLogTest, SpellCheckCollatorTest, CSVRequestHandlerTest, TestHashPartitioner, RuleEngineTest, DeleteReplicaTest, TestOverriddenPrefixQueryForCustomFieldType, TestBM25SimilarityFactory, HdfsThreadLeakTest, DistributedQueryComponentOptimizationTest, HLLSerializationTest, RestartWhileUpdatingTest, TestCollectionAPI, SpellingQueryConverterTest, SpellCheckComponentTest, DirectSolrSpellCheckerTest, OpenExchangeRatesOrgProviderTest, ZkControllerTest, DOMUtilTest, TestPartialUpdateDeduplication, TestStressVersions, TestDistributedGrouping, TestLMJelinekMercerSimilarityFactory, TestGraphTermsQParserPlugin, TestCodecSupport, TestBackupRepositoryFactory, BasicFunctionalityTest, RequestLoggingTest, MoreLikeThisHandlerTest, OverseerRolesTest, TestSolrConfigHandler, TestStandardQParsers, DistributedMLTComponentTest, CollectionReloadTest, TestAnalyzeInfixSuggestions, ClusterStateUpdateTest, SuggesterFSTTest, DistanceFunctionTest, TestObjectReleaseTracker, TestCopyFieldCollectionResource, TestUninvertingReader, UniqFieldsUpdateProcessorFactoryTest, SortByFunctionTest, TestLeaderInitiatedRecoveryThread, TestSolrCoreProperties, HdfsRecoveryZkTest, TestDocumentBuilder, TestRestoreCore, CollectionsAPIDistributedZkTest, TestLegacyFieldCache, TestSmileRequest, TestOnReconnectListenerSupport, AnalyticsQueryTest, TestDFRSimilarityFactory, HdfsBasicDistributedZkTest, TestHdfsBackupRestoreCore, TestEmbeddedSolrServerConstructors, TriLevelCompositeIdRoutingTest, MBeansHandlerTest, TestIntervalFaceting, TestLFUCache, CollectionsAPIAsyncDistributedZkTest, TestNRTOpen, TestLRUStatsCache, TestFieldTypeCollectionResource, TimeZoneUtilsTest, ConfigSetsAPITest, TestAuthorizationFramework, TestExceedMaxTermLength, TestSha256AuthenticationProvider, RankQueryTest, TestConfigSetsAPIZkFailure, TestFastLRUCache, TestSurroundQueryParser, BasicDistributedZkTest, UnloadDistributedZkTest, OverseerTest, RecoveryZkTest, ZkSolrClientTest, TestRandomDVFaceting, TestDistributedSearch, TestGroupingSearch, ConvertedLegacyTest, TestLazyCores, DistributedQueryElevationComponentTest, SolrRequestParserTest, TestStressLucene, SpatialFilterTest, NoCacheHeaderTest, TestUpdate, TestWordDelimiterFilterFactory, DirectUpdateHandlerOptimizeTest, TestSolrDeletionPolicy1, IndexBasedSpellCheckerTest, TestQueryUtils, StandardRequestHandlerTest, TestQueryTypes, TermsComponentTest, TestValueSourceCache, TermVectorComponentTest, IndexSchemaRuntimeFieldTest, IndexSchemaTest, JSONWriterTest, BinaryUpdateRequestHandlerTest, TestBinaryResponseWriter, TestQuerySenderListener, AlternateDirectoryTest, TestQuerySenderNoQuery, CopyFieldTest, TestMergePolicyConfig, MultiTermTest, TestElisionMultitermQuery, TestFuzzyAnalyzedSuggestions, NotRequiredUniqueKeyTest, TestLuceneMatchVersion, TestPhraseSuggestions, EchoParamsTest, TestLMDirichletSimilarityFactory, ScriptEngineTest, PreAnalyzedFieldTest, TestSystemIdResolver, ZkNodePropsTest, CircularListTest, TestRTGBase, DistributedIntervalFacetingTest, TestSimpleTrackingShardHandler, AsyncMigrateRouteKeyTest, ConcurrentDeleteAndCreateCollectionTest, ConnectionManagerTest, CreateCollectionCleanupTest, DeleteInactiveReplicaTest, DeleteShardTest, ForceLeaderTest, OverseerCollectionConfigSetProcessorTest, OverseerTaskQueueTest, RecoveryAfterSoftCommitTest, TestCloudInspectUtil, TestConfigSetsAPI, TestCryptoKeys, TestRebalanceLeaders, TestTolerantUpdateProcessorCloud, CoreAdminRequestStatusTest, CoreMergeIndexesAdminHandlerTest, InfoHandlerTest, SegmentsInfoRequestHandlerTest, DistributedDebugComponentTest, DistributedFacetPivotLargeTest, DistributedFacetPivotLongTailTest]
   [junit4] Completed [522/616 (2!)] on J1 in 58.15s, 1 test, 1 error <<< FAILURES!

[...truncated 290 lines...]
   [junit4] JVM J1: stdout was not empty, see: /x1/jenkins/jenkins-slave/workspace/Lucene-Solr-Tests-master/solr/build/solr-core/test/temp/junit4-J1-20160625_144529_084.sysout
   [junit4] >>> JVM J1 emitted unexpected output (verbatim) ----
   [junit4] java.lang.OutOfMemoryError: GC overhead limit exceeded
   [junit4] Dumping heap to /x1/jenkins/jenkins-slave/workspace/Lucene-Solr-Tests-master/heapdumps/java_pid31876.hprof ...
   [junit4] Heap dump file created [488431871 bytes in 4.081 secs]
   [junit4] <<< JVM J1: EOF ----

[...truncated 11 lines...]
BUILD FAILED
/x1/jenkins/jenkins-slave/workspace/Lucene-Solr-Tests-master/build.xml:740: The following error occurred while executing this line:
/x1/jenkins/jenkins-slave/workspace/Lucene-Solr-Tests-master/build.xml:684: The following error occurred while executing this line:
/x1/jenkins/jenkins-slave/workspace/Lucene-Solr-Tests-master/build.xml:59: The following error occurred while executing this line:
/x1/jenkins/jenkins-slave/workspace/Lucene-Solr-Tests-master/solr/build.xml:233: The following error occurred while executing this line:
/x1/jenkins/jenkins-slave/workspace/Lucene-Solr-Tests-master/solr/common-build.xml:530: The following error occurred while executing this line:
/x1/jenkins/jenkins-slave/workspace/Lucene-Solr-Tests-master/lucene/common-build.xml:1427: The following error occurred while executing this line:
/x1/jenkins/jenkins-slave/workspace/Lucene-Solr-Tests-master/lucene/common-build.xml:984: There were test failures: 616 suites (10 ignored), 2590 tests, 2 errors, 87 ignored (72 assumptions) [seed: 83027BED5969CE71]

Total time: 65 minutes 46 seconds
Build step 'Invoke Ant' marked build as failure
Archiving artifacts
Recording test results
Email was triggered for: Failure - Any
Sending email for trigger: Failure - Any




[JENKINS] Lucene-Solr-Tests-master - Build # 1228 - Still Failing

Posted by Apache Jenkins Server <je...@builds.apache.org>.
Build: https://builds.apache.org/job/Lucene-Solr-Tests-master/1228/

1 tests failed.
FAILED:  org.apache.lucene.spatial3d.TestGeo3DPoint.testGeo3DRelations

Error Message:
invalid bounds for shape=GeoStandardPath: {planetmodel=PlanetModel.WGS84, width=1.117010721276371(64.0), points={[[lat=2.18531083006635E-12, lon=-3.141592653589793([X=-1.0011188539924791, Y=-1.226017000107956E-16, Z=2.187755873813378E-12])], [lat=0.0, lon=-3.141592653589793([X=-1.0011188539924791, Y=-1.226017000107956E-16, Z=0.0])]]}}

Stack Trace:
java.lang.AssertionError: invalid bounds for shape=GeoStandardPath: {planetmodel=PlanetModel.WGS84, width=1.117010721276371(64.0), points={[[lat=2.18531083006635E-12, lon=-3.141592653589793([X=-1.0011188539924791, Y=-1.226017000107956E-16, Z=2.187755873813378E-12])], [lat=0.0, lon=-3.141592653589793([X=-1.0011188539924791, Y=-1.226017000107956E-16, Z=0.0])]]}}
	at __randomizedtesting.SeedInfo.seed([1F71744AE2101863:AF0E09DE6D5DB6FF]:0)
	at org.junit.Assert.fail(Assert.java:93)
	at org.apache.lucene.spatial3d.TestGeo3DPoint.testGeo3DRelations(TestGeo3DPoint.java:259)
	at sun.reflect.NativeMethodAccessorImpl.invoke0(Native Method)
	at sun.reflect.NativeMethodAccessorImpl.invoke(NativeMethodAccessorImpl.java:62)
	at sun.reflect.DelegatingMethodAccessorImpl.invoke(DelegatingMethodAccessorImpl.java:43)
	at java.lang.reflect.Method.invoke(Method.java:498)
	at com.carrotsearch.randomizedtesting.RandomizedRunner.invoke(RandomizedRunner.java:1764)
	at com.carrotsearch.randomizedtesting.RandomizedRunner$8.evaluate(RandomizedRunner.java:871)
	at com.carrotsearch.randomizedtesting.RandomizedRunner$9.evaluate(RandomizedRunner.java:907)
	at com.carrotsearch.randomizedtesting.RandomizedRunner$10.evaluate(RandomizedRunner.java:921)
	at org.apache.lucene.util.TestRuleSetupTeardownChained$1.evaluate(TestRuleSetupTeardownChained.java:49)
	at org.apache.lucene.util.AbstractBeforeAfterRule$1.evaluate(AbstractBeforeAfterRule.java:45)
	at org.apache.lucene.util.TestRuleThreadAndTestName$1.evaluate(TestRuleThreadAndTestName.java:48)
	at org.apache.lucene.util.TestRuleIgnoreAfterMaxFailures$1.evaluate(TestRuleIgnoreAfterMaxFailures.java:64)
	at org.apache.lucene.util.TestRuleMarkFailure$1.evaluate(TestRuleMarkFailure.java:47)
	at com.carrotsearch.randomizedtesting.rules.StatementAdapter.evaluate(StatementAdapter.java:36)
	at com.carrotsearch.randomizedtesting.ThreadLeakControl$StatementRunner.run(ThreadLeakControl.java:367)
	at com.carrotsearch.randomizedtesting.ThreadLeakControl.forkTimeoutingTask(ThreadLeakControl.java:809)
	at com.carrotsearch.randomizedtesting.ThreadLeakControl$3.evaluate(ThreadLeakControl.java:460)
	at com.carrotsearch.randomizedtesting.RandomizedRunner.runSingleTest(RandomizedRunner.java:880)
	at com.carrotsearch.randomizedtesting.RandomizedRunner$5.evaluate(RandomizedRunner.java:781)
	at com.carrotsearch.randomizedtesting.RandomizedRunner$6.evaluate(RandomizedRunner.java:816)
	at com.carrotsearch.randomizedtesting.RandomizedRunner$7.evaluate(RandomizedRunner.java:827)
	at org.apache.lucene.util.AbstractBeforeAfterRule$1.evaluate(AbstractBeforeAfterRule.java:45)
	at com.carrotsearch.randomizedtesting.rules.StatementAdapter.evaluate(StatementAdapter.java:36)
	at org.apache.lucene.util.TestRuleStoreClassName$1.evaluate(TestRuleStoreClassName.java:41)
	at com.carrotsearch.randomizedtesting.rules.NoShadowingOrOverridesOnMethodsRule$1.evaluate(NoShadowingOrOverridesOnMethodsRule.java:40)
	at com.carrotsearch.randomizedtesting.rules.NoShadowingOrOverridesOnMethodsRule$1.evaluate(NoShadowingOrOverridesOnMethodsRule.java:40)
	at com.carrotsearch.randomizedtesting.rules.StatementAdapter.evaluate(StatementAdapter.java:36)
	at com.carrotsearch.randomizedtesting.rules.StatementAdapter.evaluate(StatementAdapter.java:36)
	at com.carrotsearch.randomizedtesting.rules.StatementAdapter.evaluate(StatementAdapter.java:36)
	at org.apache.lucene.util.TestRuleAssertionsRequired$1.evaluate(TestRuleAssertionsRequired.java:53)
	at org.apache.lucene.util.TestRuleMarkFailure$1.evaluate(TestRuleMarkFailure.java:47)
	at org.apache.lucene.util.TestRuleIgnoreAfterMaxFailures$1.evaluate(TestRuleIgnoreAfterMaxFailures.java:64)
	at org.apache.lucene.util.TestRuleIgnoreTestSuites$1.evaluate(TestRuleIgnoreTestSuites.java:54)
	at com.carrotsearch.randomizedtesting.rules.StatementAdapter.evaluate(StatementAdapter.java:36)
	at com.carrotsearch.randomizedtesting.ThreadLeakControl$StatementRunner.run(ThreadLeakControl.java:367)
	at java.lang.Thread.run(Thread.java:745)




Build Log:
[...truncated 8937 lines...]
   [junit4] Suite: org.apache.lucene.spatial3d.TestGeo3DPoint
   [junit4]   1>     doc=1544 is contained by shape but is outside the returned XYZBounds
   [junit4]   1>       unquantized=[lat=-2.848117399637174E-91, lon=-1.1092122135274942([X=0.44586529864043345, Y=-0.8963498732568058, Z=-2.851304027160807E-91])]
   [junit4]   1>       quantized=[X=0.44586529870253566, Y=-0.8963498734280969, Z=-2.3309121299774915E-10]
   [junit4]   1>   shape=GeoStandardPath: {planetmodel=PlanetModel.WGS84, width=1.117010721276371(64.0), points={[[lat=2.18531083006635E-12, lon=-3.141592653589793([X=-1.0011188539924791, Y=-1.226017000107956E-16, Z=2.187755873813378E-12])], [lat=0.0, lon=-3.141592653589793([X=-1.0011188539924791, Y=-1.226017000107956E-16, Z=0.0])]]}}
   [junit4]   1>   bounds=XYZBounds: [xmin=-1.0011188549924792 xmax=0.4449938894797613 ymin=-1.0011188549924792 ymax=1.0011188549924792 zmin=-0.9977622930221051 zmax=0.9977622930221051]
   [junit4]   2> NOTE: reproduce with: ant test  -Dtestcase=TestGeo3DPoint -Dtests.method=testGeo3DRelations -Dtests.seed=1F71744AE2101863 -Dtests.multiplier=2 -Dtests.slow=true -Dtests.locale=pt-PT -Dtests.timezone=Europe/Berlin -Dtests.asserts=true -Dtests.file.encoding=ISO-8859-1
   [junit4] FAILURE 1.46s J1 | TestGeo3DPoint.testGeo3DRelations <<<
   [junit4]    > Throwable #1: java.lang.AssertionError: invalid bounds for shape=GeoStandardPath: {planetmodel=PlanetModel.WGS84, width=1.117010721276371(64.0), points={[[lat=2.18531083006635E-12, lon=-3.141592653589793([X=-1.0011188539924791, Y=-1.226017000107956E-16, Z=2.187755873813378E-12])], [lat=0.0, lon=-3.141592653589793([X=-1.0011188539924791, Y=-1.226017000107956E-16, Z=0.0])]]}}
   [junit4]    > 	at __randomizedtesting.SeedInfo.seed([1F71744AE2101863:AF0E09DE6D5DB6FF]:0)
   [junit4]    > 	at org.apache.lucene.spatial3d.TestGeo3DPoint.testGeo3DRelations(TestGeo3DPoint.java:259)
   [junit4]    > 	at java.lang.Thread.run(Thread.java:745)
   [junit4] IGNOR/A 0.00s J1 | TestGeo3DPoint.testRandomBig
   [junit4]    > Assumption #1: 'nightly' test group is disabled (@Nightly())
   [junit4]   2> NOTE: test params are: codec=Asserting(Lucene62), sim=RandomSimilarity(queryNorm=false,coord=yes): {}, locale=pt-PT, timezone=Europe/Berlin
   [junit4]   2> NOTE: Linux 3.13.0-85-generic amd64/Oracle Corporation 1.8.0_74 (64-bit)/cpus=4,threads=1,free=256210224,total=354418688
   [junit4]   2> NOTE: All tests run in this JVM: [TestGeo3DPoint]
   [junit4] Completed [10/11 (1!)] on J1 in 37.22s, 14 tests, 1 failure, 1 skipped <<< FAILURES!

[...truncated 14 lines...]
BUILD FAILED
/x1/jenkins/jenkins-slave/workspace/Lucene-Solr-Tests-master/build.xml:740: The following error occurred while executing this line:
/x1/jenkins/jenkins-slave/workspace/Lucene-Solr-Tests-master/build.xml:684: The following error occurred while executing this line:
/x1/jenkins/jenkins-slave/workspace/Lucene-Solr-Tests-master/build.xml:59: The following error occurred while executing this line:
/x1/jenkins/jenkins-slave/workspace/Lucene-Solr-Tests-master/lucene/build.xml:476: The following error occurred while executing this line:
/x1/jenkins/jenkins-slave/workspace/Lucene-Solr-Tests-master/lucene/common-build.xml:2161: The following error occurred while executing this line:
/x1/jenkins/jenkins-slave/workspace/Lucene-Solr-Tests-master/lucene/module-build.xml:58: The following error occurred while executing this line:
/x1/jenkins/jenkins-slave/workspace/Lucene-Solr-Tests-master/lucene/common-build.xml:1427: The following error occurred while executing this line:
/x1/jenkins/jenkins-slave/workspace/Lucene-Solr-Tests-master/lucene/common-build.xml:984: There were test failures: 11 suites, 58 tests, 1 failure, 1 ignored (1 assumption) [seed: 1F71744AE2101863]

Total time: 28 minutes 27 seconds
Build step 'Invoke Ant' marked build as failure
Archiving artifacts
Recording test results
Email was triggered for: Failure - Any
Sending email for trigger: Failure - Any