You are viewing a plain text version of this content. The canonical link for it is here.
Posted to dev@kafka.apache.org by Apache Jenkins Server <je...@builds.apache.org> on 2017/03/08 03:34:52 UTC

Build failed in Jenkins: kafka-trunk-jdk7 #1998

See <https://builds.apache.org/job/kafka-trunk-jdk7/1998/display/redirect?page=changes>

Changes:

[ismael] KAFKA-4841; NetworkClient should only consider a connection to have

------------------------------------------
[...truncated 918.89 KB...]
org.apache.kafka.connect.runtime.WorkerSinkTaskThreadedTest > testRewindOnRebalanceDuringPoll PASSED

org.apache.kafka.connect.runtime.WorkerSinkTaskThreadedTest > testCommitSuccessFollowedByFailure STARTED

org.apache.kafka.connect.runtime.WorkerSinkTaskThreadedTest > testCommitSuccessFollowedByFailure PASSED

org.apache.kafka.connect.runtime.distributed.WorkerCoordinatorTest > testLeaderPerformAssignmentSingleTaskConnectors STARTED

org.apache.kafka.connect.runtime.distributed.WorkerCoordinatorTest > testLeaderPerformAssignmentSingleTaskConnectors PASSED

org.apache.kafka.connect.runtime.distributed.WorkerCoordinatorTest > testNormalJoinGroupFollower STARTED

org.apache.kafka.connect.runtime.distributed.WorkerCoordinatorTest > testNormalJoinGroupFollower PASSED

org.apache.kafka.connect.runtime.distributed.WorkerCoordinatorTest > testMetadata STARTED

org.apache.kafka.connect.runtime.distributed.WorkerCoordinatorTest > testMetadata PASSED

org.apache.kafka.connect.runtime.distributed.WorkerCoordinatorTest > testLeaderPerformAssignment1 STARTED

org.apache.kafka.connect.runtime.distributed.WorkerCoordinatorTest > testLeaderPerformAssignment1 PASSED

org.apache.kafka.connect.runtime.distributed.WorkerCoordinatorTest > testLeaderPerformAssignment2 STARTED

org.apache.kafka.connect.runtime.distributed.WorkerCoordinatorTest > testLeaderPerformAssignment2 PASSED

org.apache.kafka.connect.runtime.distributed.WorkerCoordinatorTest > testJoinLeaderCannotAssign STARTED

org.apache.kafka.connect.runtime.distributed.WorkerCoordinatorTest > testJoinLeaderCannotAssign PASSED

org.apache.kafka.connect.runtime.distributed.WorkerCoordinatorTest > testRejoinGroup STARTED

org.apache.kafka.connect.runtime.distributed.WorkerCoordinatorTest > testRejoinGroup PASSED

org.apache.kafka.connect.runtime.distributed.WorkerCoordinatorTest > testNormalJoinGroupLeader STARTED

org.apache.kafka.connect.runtime.distributed.WorkerCoordinatorTest > testNormalJoinGroupLeader PASSED

org.apache.kafka.connect.runtime.distributed.DistributedHerderTest > testPutConnectorConfig STARTED

org.apache.kafka.connect.runtime.distributed.DistributedHerderTest > testPutConnectorConfig PASSED

org.apache.kafka.connect.runtime.distributed.DistributedHerderTest > testCreateConnector STARTED

org.apache.kafka.connect.runtime.distributed.DistributedHerderTest > testCreateConnector PASSED

org.apache.kafka.connect.runtime.distributed.DistributedHerderTest > testCreateConnectorFailedCustomValidation STARTED

org.apache.kafka.connect.runtime.distributed.DistributedHerderTest > testCreateConnectorFailedCustomValidation PASSED

org.apache.kafka.connect.runtime.distributed.DistributedHerderTest > testCreateConnectorAlreadyExists STARTED

org.apache.kafka.connect.runtime.distributed.DistributedHerderTest > testCreateConnectorAlreadyExists PASSED

org.apache.kafka.connect.runtime.distributed.DistributedHerderTest > testJoinAssignment STARTED

org.apache.kafka.connect.runtime.distributed.DistributedHerderTest > testJoinAssignment PASSED

org.apache.kafka.connect.runtime.distributed.DistributedHerderTest > testRebalance STARTED

org.apache.kafka.connect.runtime.distributed.DistributedHerderTest > testRebalance PASSED

org.apache.kafka.connect.runtime.distributed.DistributedHerderTest > testRebalanceFailedConnector STARTED

org.apache.kafka.connect.runtime.distributed.DistributedHerderTest > testRebalanceFailedConnector PASSED

org.apache.kafka.connect.runtime.distributed.DistributedHerderTest > testHaltCleansUpWorker STARTED

org.apache.kafka.connect.runtime.distributed.DistributedHerderTest > testHaltCleansUpWorker PASSED

org.apache.kafka.connect.runtime.distributed.DistributedHerderTest > testConnectorNameConflictsWithWorkerGroupId STARTED

org.apache.kafka.connect.runtime.distributed.DistributedHerderTest > testConnectorNameConflictsWithWorkerGroupId PASSED

org.apache.kafka.connect.runtime.distributed.DistributedHerderTest > testRestartUnknownConnector STARTED

org.apache.kafka.connect.runtime.distributed.DistributedHerderTest > testRestartUnknownConnector PASSED

org.apache.kafka.connect.runtime.distributed.DistributedHerderTest > testRestartConnectorRedirectToLeader STARTED

org.apache.kafka.connect.runtime.distributed.DistributedHerderTest > testRestartConnectorRedirectToLeader PASSED

org.apache.kafka.connect.runtime.distributed.DistributedHerderTest > testRestartConnectorRedirectToOwner STARTED

org.apache.kafka.connect.runtime.distributed.DistributedHerderTest > testRestartConnectorRedirectToOwner PASSED

org.apache.kafka.connect.runtime.distributed.DistributedHerderTest > testRestartUnknownTask STARTED

org.apache.kafka.connect.runtime.distributed.DistributedHerderTest > testRestartUnknownTask PASSED

org.apache.kafka.connect.runtime.distributed.DistributedHerderTest > testRequestProcessingOrder STARTED

org.apache.kafka.connect.runtime.distributed.DistributedHerderTest > testRequestProcessingOrder PASSED

org.apache.kafka.connect.runtime.distributed.DistributedHerderTest > testRestartTaskRedirectToLeader STARTED

org.apache.kafka.connect.runtime.distributed.DistributedHerderTest > testRestartTaskRedirectToLeader PASSED

org.apache.kafka.connect.runtime.distributed.DistributedHerderTest > testRestartTaskRedirectToOwner STARTED

org.apache.kafka.connect.runtime.distributed.DistributedHerderTest > testRestartTaskRedirectToOwner PASSED

org.apache.kafka.connect.runtime.distributed.DistributedHerderTest > testConnectorConfigAdded STARTED

org.apache.kafka.connect.runtime.distributed.DistributedHerderTest > testConnectorConfigAdded PASSED

org.apache.kafka.connect.runtime.distributed.DistributedHerderTest > testConnectorConfigUpdate STARTED

org.apache.kafka.connect.runtime.distributed.DistributedHerderTest > testConnectorConfigUpdate PASSED

org.apache.kafka.connect.runtime.distributed.DistributedHerderTest > testConnectorPaused STARTED

org.apache.kafka.connect.runtime.distributed.DistributedHerderTest > testConnectorPaused PASSED

org.apache.kafka.connect.runtime.distributed.DistributedHerderTest > testConnectorResumed STARTED

org.apache.kafka.connect.runtime.distributed.DistributedHerderTest > testConnectorResumed PASSED

org.apache.kafka.connect.runtime.distributed.DistributedHerderTest > testUnknownConnectorPaused STARTED

org.apache.kafka.connect.runtime.distributed.DistributedHerderTest > testUnknownConnectorPaused PASSED

org.apache.kafka.connect.runtime.distributed.DistributedHerderTest > testConnectorPausedRunningTaskOnly STARTED

org.apache.kafka.connect.runtime.distributed.DistributedHerderTest > testConnectorPausedRunningTaskOnly PASSED

org.apache.kafka.connect.runtime.distributed.DistributedHerderTest > testConnectorResumedRunningTaskOnly STARTED

org.apache.kafka.connect.runtime.distributed.DistributedHerderTest > testConnectorResumedRunningTaskOnly PASSED

org.apache.kafka.connect.runtime.distributed.DistributedHerderTest > testTaskConfigAdded STARTED

org.apache.kafka.connect.runtime.distributed.DistributedHerderTest > testTaskConfigAdded PASSED

org.apache.kafka.connect.runtime.distributed.DistributedHerderTest > testJoinLeaderCatchUpFails STARTED

org.apache.kafka.connect.runtime.distributed.DistributedHerderTest > testJoinLeaderCatchUpFails PASSED

org.apache.kafka.connect.runtime.distributed.DistributedHerderTest > testInconsistentConfigs STARTED

org.apache.kafka.connect.runtime.distributed.DistributedHerderTest > testInconsistentConfigs PASSED

org.apache.kafka.connect.runtime.distributed.DistributedHerderTest > testCreateConnectorFailedBasicValidation STARTED

org.apache.kafka.connect.runtime.distributed.DistributedHerderTest > testCreateConnectorFailedBasicValidation PASSED

org.apache.kafka.connect.runtime.distributed.DistributedHerderTest > testDestroyConnector STARTED

org.apache.kafka.connect.runtime.distributed.DistributedHerderTest > testDestroyConnector PASSED

org.apache.kafka.connect.runtime.distributed.DistributedHerderTest > testRestartConnector STARTED

org.apache.kafka.connect.runtime.distributed.DistributedHerderTest > testRestartConnector PASSED

org.apache.kafka.connect.runtime.distributed.DistributedHerderTest > testRestartTask STARTED

org.apache.kafka.connect.runtime.distributed.DistributedHerderTest > testRestartTask PASSED

org.apache.kafka.connect.runtime.distributed.DistributedHerderTest > testAccessors STARTED

org.apache.kafka.connect.runtime.distributed.DistributedHerderTest > testAccessors PASSED

org.apache.kafka.connect.runtime.ConnectorConfigTest > unconfiguredTransform STARTED

org.apache.kafka.connect.runtime.ConnectorConfigTest > unconfiguredTransform PASSED

org.apache.kafka.connect.runtime.ConnectorConfigTest > multipleTransformsOneDangling STARTED

org.apache.kafka.connect.runtime.ConnectorConfigTest > multipleTransformsOneDangling PASSED

org.apache.kafka.connect.runtime.ConnectorConfigTest > misconfiguredTransform STARTED

org.apache.kafka.connect.runtime.ConnectorConfigTest > misconfiguredTransform PASSED

org.apache.kafka.connect.runtime.ConnectorConfigTest > noTransforms STARTED

org.apache.kafka.connect.runtime.ConnectorConfigTest > noTransforms PASSED

org.apache.kafka.connect.runtime.ConnectorConfigTest > danglingTransformAlias STARTED

org.apache.kafka.connect.runtime.ConnectorConfigTest > danglingTransformAlias PASSED

org.apache.kafka.connect.runtime.ConnectorConfigTest > multipleTransforms STARTED

org.apache.kafka.connect.runtime.ConnectorConfigTest > multipleTransforms PASSED

org.apache.kafka.connect.runtime.ConnectorConfigTest > singleTransform STARTED

org.apache.kafka.connect.runtime.ConnectorConfigTest > singleTransform PASSED

org.apache.kafka.connect.runtime.ConnectorConfigTest > wrongTransformationType STARTED

org.apache.kafka.connect.runtime.ConnectorConfigTest > wrongTransformationType PASSED

org.apache.kafka.connect.util.ShutdownableThreadTest > testGracefulShutdown STARTED

org.apache.kafka.connect.util.ShutdownableThreadTest > testGracefulShutdown PASSED

org.apache.kafka.connect.util.ShutdownableThreadTest > testForcibleShutdown STARTED

org.apache.kafka.connect.util.ShutdownableThreadTest > testForcibleShutdown PASSED

org.apache.kafka.connect.util.KafkaBasedLogTest > testStartStop STARTED

org.apache.kafka.connect.util.KafkaBasedLogTest > testStartStop PASSED

org.apache.kafka.connect.util.KafkaBasedLogTest > testReloadOnStart STARTED

org.apache.kafka.connect.util.KafkaBasedLogTest > testReloadOnStart PASSED

org.apache.kafka.connect.util.KafkaBasedLogTest > testReloadOnStartWithNoNewRecordsPresent STARTED

org.apache.kafka.connect.util.KafkaBasedLogTest > testReloadOnStartWithNoNewRecordsPresent PASSED

org.apache.kafka.connect.util.KafkaBasedLogTest > testSendAndReadToEnd STARTED

org.apache.kafka.connect.util.KafkaBasedLogTest > testSendAndReadToEnd PASSED

org.apache.kafka.connect.util.KafkaBasedLogTest > testConsumerError STARTED

org.apache.kafka.connect.util.KafkaBasedLogTest > testConsumerError PASSED

org.apache.kafka.connect.util.KafkaBasedLogTest > testProducerError STARTED

org.apache.kafka.connect.util.KafkaBasedLogTest > testProducerError PASSED

org.apache.kafka.connect.util.TableTest > basicOperations STARTED

org.apache.kafka.connect.util.TableTest > basicOperations PASSED

201 tests completed, 1 failed
:connect:runtime:test FAILED

FAILURE: Build failed with an exception.

* What went wrong:
Execution failed for task ':connect:runtime:test'.
> There were failing tests. See the report at: file://<https://builds.apache.org/job/kafka-trunk-jdk7/ws/connect/runtime/build/reports/tests/test/index.html>

* Try:
Run with --stacktrace option to get the stack trace. Run with --info or --debug option to get more log output.

BUILD FAILED

Total time: 1 hrs 53 mins 35.99 secs
Build step 'Execute shell' marked build as failure
Recording test results
Setting GRADLE_2_4_RC_2_HOME=/home/jenkins/jenkins-slave/tools/hudson.plugins.gradle.GradleInstallation/Gradle_2.4-rc-2
Setting GRADLE_2_4_RC_2_HOME=/home/jenkins/jenkins-slave/tools/hudson.plugins.gradle.GradleInstallation/Gradle_2.4-rc-2

Jenkins build is back to normal : kafka-trunk-jdk7 #2000

Posted by Apache Jenkins Server <je...@builds.apache.org>.
See <https://builds.apache.org/job/kafka-trunk-jdk7/2000/display/redirect?page=changes>


Build failed in Jenkins: kafka-trunk-jdk7 #1999

Posted by Apache Jenkins Server <je...@builds.apache.org>.
See <https://builds.apache.org/job/kafka-trunk-jdk7/1999/display/redirect?page=changes>

Changes:

[wangguoz] KAFKA-4722: Add application.id to StreamThread name

------------------------------------------
[...truncated 848.58 KB...]
org.apache.kafka.streams.processor.internals.StateRestorerTest > shouldBeCompletedIfOffsetAndOffsetLimitAreZero PASSED

org.apache.kafka.streams.processor.internals.InternalTopicConfigTest > shouldHaveCompactionPropSetIfSupplied STARTED

org.apache.kafka.streams.processor.internals.InternalTopicConfigTest > shouldHaveCompactionPropSetIfSupplied PASSED

org.apache.kafka.streams.processor.internals.InternalTopicConfigTest > shouldThrowIfNameIsNull STARTED

org.apache.kafka.streams.processor.internals.InternalTopicConfigTest > shouldThrowIfNameIsNull PASSED

org.apache.kafka.streams.processor.internals.InternalTopicConfigTest > shouldConfigureRetentionMsWithAdditionalRetentionWhenCompactAndDelete STARTED

org.apache.kafka.streams.processor.internals.InternalTopicConfigTest > shouldConfigureRetentionMsWithAdditionalRetentionWhenCompactAndDelete PASSED

org.apache.kafka.streams.processor.internals.InternalTopicConfigTest > shouldBeCompactedIfCleanupPolicyCompactOrCompactAndDelete STARTED

org.apache.kafka.streams.processor.internals.InternalTopicConfigTest > shouldBeCompactedIfCleanupPolicyCompactOrCompactAndDelete PASSED

org.apache.kafka.streams.processor.internals.InternalTopicConfigTest > shouldNotBeCompactedWhenCleanupPolicyIsDelete STARTED

org.apache.kafka.streams.processor.internals.InternalTopicConfigTest > shouldNotBeCompactedWhenCleanupPolicyIsDelete PASSED

org.apache.kafka.streams.processor.internals.InternalTopicConfigTest > shouldHavePropertiesSuppliedByUser STARTED

org.apache.kafka.streams.processor.internals.InternalTopicConfigTest > shouldHavePropertiesSuppliedByUser PASSED

org.apache.kafka.streams.processor.internals.InternalTopicConfigTest > shouldUseCleanupPolicyFromConfigIfSupplied STARTED

org.apache.kafka.streams.processor.internals.InternalTopicConfigTest > shouldUseCleanupPolicyFromConfigIfSupplied PASSED

org.apache.kafka.streams.processor.internals.InternalTopicConfigTest > shouldNotConfigureRetentionMsWhenCompact STARTED

org.apache.kafka.streams.processor.internals.InternalTopicConfigTest > shouldNotConfigureRetentionMsWhenCompact PASSED

org.apache.kafka.streams.processor.internals.InternalTopicConfigTest > shouldNotConfigureRetentionMsWhenDelete STARTED

org.apache.kafka.streams.processor.internals.InternalTopicConfigTest > shouldNotConfigureRetentionMsWhenDelete PASSED

org.apache.kafka.streams.processor.TopologyBuilderTest > shouldNotAllowOffsetResetSourceWithDuplicateSourceName STARTED

org.apache.kafka.streams.processor.TopologyBuilderTest > shouldNotAllowOffsetResetSourceWithDuplicateSourceName PASSED

org.apache.kafka.streams.processor.TopologyBuilderTest > shouldNotAllowNullProcessorSupplier STARTED

org.apache.kafka.streams.processor.TopologyBuilderTest > shouldNotAllowNullProcessorSupplier PASSED

org.apache.kafka.streams.processor.TopologyBuilderTest > shouldNotSetApplicationIdToNull STARTED

org.apache.kafka.streams.processor.TopologyBuilderTest > shouldNotSetApplicationIdToNull PASSED

org.apache.kafka.streams.processor.TopologyBuilderTest > testSourceTopics STARTED

org.apache.kafka.streams.processor.TopologyBuilderTest > testSourceTopics PASSED

org.apache.kafka.streams.processor.TopologyBuilderTest > shouldNotAllowNullNameWhenAddingSink STARTED

org.apache.kafka.streams.processor.TopologyBuilderTest > shouldNotAllowNullNameWhenAddingSink PASSED

org.apache.kafka.streams.processor.TopologyBuilderTest > testNamedTopicMatchesAlreadyProvidedPattern STARTED

org.apache.kafka.streams.processor.TopologyBuilderTest > testNamedTopicMatchesAlreadyProvidedPattern PASSED

org.apache.kafka.streams.processor.TopologyBuilderTest > shouldAddInternalTopicConfigWithCompactAndDeleteSetForWindowStores STARTED

org.apache.kafka.streams.processor.TopologyBuilderTest > shouldAddInternalTopicConfigWithCompactAndDeleteSetForWindowStores PASSED

org.apache.kafka.streams.processor.TopologyBuilderTest > shouldAddInternalTopicConfigWithCompactForNonWindowStores STARTED

org.apache.kafka.streams.processor.TopologyBuilderTest > shouldAddInternalTopicConfigWithCompactForNonWindowStores PASSED

org.apache.kafka.streams.processor.TopologyBuilderTest > testAddSinkWithSameName STARTED

org.apache.kafka.streams.processor.TopologyBuilderTest > testAddSinkWithSameName PASSED

org.apache.kafka.streams.processor.TopologyBuilderTest > testAddSinkWithSelfParent STARTED

org.apache.kafka.streams.processor.TopologyBuilderTest > testAddSinkWithSelfParent PASSED

org.apache.kafka.streams.processor.TopologyBuilderTest > testAddProcessorWithSelfParent STARTED

org.apache.kafka.streams.processor.TopologyBuilderTest > testAddProcessorWithSelfParent PASSED

org.apache.kafka.streams.processor.TopologyBuilderTest > shouldAssociateStateStoreNameWhenStateStoreSupplierIsInternal STARTED

org.apache.kafka.streams.processor.TopologyBuilderTest > shouldAssociateStateStoreNameWhenStateStoreSupplierIsInternal PASSED

org.apache.kafka.streams.processor.TopologyBuilderTest > testAddStateStoreWithSink STARTED

org.apache.kafka.streams.processor.TopologyBuilderTest > testAddStateStoreWithSink PASSED

org.apache.kafka.streams.processor.TopologyBuilderTest > testTopicGroups STARTED

org.apache.kafka.streams.processor.TopologyBuilderTest > testTopicGroups PASSED

org.apache.kafka.streams.processor.TopologyBuilderTest > testBuild STARTED

org.apache.kafka.streams.processor.TopologyBuilderTest > testBuild PASSED

org.apache.kafka.streams.processor.TopologyBuilderTest > shouldNotAllowOffsetResetSourceWithoutTopics STARTED

org.apache.kafka.streams.processor.TopologyBuilderTest > shouldNotAllowOffsetResetSourceWithoutTopics PASSED

org.apache.kafka.streams.processor.TopologyBuilderTest > shouldNotAddNullStateStoreSupplier STARTED

org.apache.kafka.streams.processor.TopologyBuilderTest > shouldNotAddNullStateStoreSupplier PASSED

org.apache.kafka.streams.processor.TopologyBuilderTest > shouldNotAllowNullNameWhenAddingSource STARTED

org.apache.kafka.streams.processor.TopologyBuilderTest > shouldNotAllowNullNameWhenAddingSource PASSED

org.apache.kafka.streams.processor.TopologyBuilderTest > shouldNotAllowNullTopicWhenAddingSink STARTED

org.apache.kafka.streams.processor.TopologyBuilderTest > shouldNotAllowNullTopicWhenAddingSink PASSED

org.apache.kafka.streams.processor.TopologyBuilderTest > shouldAddSourceWithOffsetReset STARTED

org.apache.kafka.streams.processor.TopologyBuilderTest > shouldAddSourceWithOffsetReset PASSED

org.apache.kafka.streams.processor.TopologyBuilderTest > testAddStateStoreWithSource STARTED

org.apache.kafka.streams.processor.TopologyBuilderTest > testAddStateStoreWithSource PASSED

org.apache.kafka.streams.processor.TopologyBuilderTest > shouldThroughOnUnassignedStateStoreAccess STARTED

org.apache.kafka.streams.processor.TopologyBuilderTest > shouldThroughOnUnassignedStateStoreAccess PASSED

org.apache.kafka.streams.processor.TopologyBuilderTest > shouldNotAllowNullProcessorNameWhenConnectingProcessorAndStateStores STARTED

org.apache.kafka.streams.processor.TopologyBuilderTest > shouldNotAllowNullProcessorNameWhenConnectingProcessorAndStateStores PASSED

org.apache.kafka.streams.processor.TopologyBuilderTest > testAddSourceWithSameName STARTED

org.apache.kafka.streams.processor.TopologyBuilderTest > testAddSourceWithSameName PASSED

org.apache.kafka.streams.processor.TopologyBuilderTest > testAddMoreThanOnePatternSourceNode STARTED

org.apache.kafka.streams.processor.TopologyBuilderTest > testAddMoreThanOnePatternSourceNode PASSED

org.apache.kafka.streams.processor.TopologyBuilderTest > testAddProcessorWithSameName STARTED

org.apache.kafka.streams.processor.TopologyBuilderTest > testAddProcessorWithSameName PASSED

org.apache.kafka.streams.processor.TopologyBuilderTest > shouldSetCorrectSourceNodesWithRegexUpdatedTopics STARTED

org.apache.kafka.streams.processor.TopologyBuilderTest > shouldSetCorrectSourceNodesWithRegexUpdatedTopics PASSED

org.apache.kafka.streams.processor.TopologyBuilderTest > testAddSourceWithSameTopic STARTED

org.apache.kafka.streams.processor.TopologyBuilderTest > testAddSourceWithSameTopic PASSED

org.apache.kafka.streams.processor.TopologyBuilderTest > testTopicGroupsByStateStore STARTED

org.apache.kafka.streams.processor.TopologyBuilderTest > testTopicGroupsByStateStore PASSED

org.apache.kafka.streams.processor.TopologyBuilderTest > shouldAddSourceWithoutOffsetReset STARTED

org.apache.kafka.streams.processor.TopologyBuilderTest > shouldAddSourceWithoutOffsetReset PASSED

org.apache.kafka.streams.processor.TopologyBuilderTest > testAddStateStoreWithDuplicates STARTED

org.apache.kafka.streams.processor.TopologyBuilderTest > testAddStateStoreWithDuplicates PASSED

org.apache.kafka.streams.processor.TopologyBuilderTest > testPatternSourceTopic STARTED

org.apache.kafka.streams.processor.TopologyBuilderTest > testPatternSourceTopic PASSED

org.apache.kafka.streams.processor.TopologyBuilderTest > shouldAssociateStateStoreNameWhenStateStoreSupplierIsExternal STARTED

org.apache.kafka.streams.processor.TopologyBuilderTest > shouldAssociateStateStoreNameWhenStateStoreSupplierIsExternal PASSED

org.apache.kafka.streams.processor.TopologyBuilderTest > testAddSinkWithWrongParent STARTED

org.apache.kafka.streams.processor.TopologyBuilderTest > testAddSinkWithWrongParent PASSED

org.apache.kafka.streams.processor.TopologyBuilderTest > testPatternMatchesAlreadyProvidedTopicSource STARTED

org.apache.kafka.streams.processor.TopologyBuilderTest > testPatternMatchesAlreadyProvidedTopicSource PASSED

org.apache.kafka.streams.processor.TopologyBuilderTest > testAddSinkConnectedWithMultipleParent STARTED

org.apache.kafka.streams.processor.TopologyBuilderTest > testAddSinkConnectedWithMultipleParent PASSED

org.apache.kafka.streams.processor.TopologyBuilderTest > testSubscribeTopicNameAndPattern STARTED

org.apache.kafka.streams.processor.TopologyBuilderTest > testSubscribeTopicNameAndPattern PASSED

org.apache.kafka.streams.processor.TopologyBuilderTest > shouldAddPatternSourceWithoutOffsetReset STARTED

org.apache.kafka.streams.processor.TopologyBuilderTest > shouldAddPatternSourceWithoutOffsetReset PASSED

org.apache.kafka.streams.processor.TopologyBuilderTest > shouldNotAddNullInternalTopic STARTED

org.apache.kafka.streams.processor.TopologyBuilderTest > shouldNotAddNullInternalTopic PASSED

org.apache.kafka.streams.processor.TopologyBuilderTest > testAddProcessorWithWrongParent STARTED

org.apache.kafka.streams.processor.TopologyBuilderTest > testAddProcessorWithWrongParent PASSED

org.apache.kafka.streams.processor.TopologyBuilderTest > shouldNotAllowNullNameWhenAddingProcessor STARTED

org.apache.kafka.streams.processor.TopologyBuilderTest > shouldNotAllowNullNameWhenAddingProcessor PASSED

org.apache.kafka.streams.processor.TopologyBuilderTest > shouldAddSourcePatternWithOffsetReset STARTED

org.apache.kafka.streams.processor.TopologyBuilderTest > shouldAddSourcePatternWithOffsetReset PASSED

org.apache.kafka.streams.processor.TopologyBuilderTest > testAddStateStore STARTED

org.apache.kafka.streams.processor.TopologyBuilderTest > testAddStateStore PASSED

org.apache.kafka.streams.processor.TopologyBuilderTest > testAddSinkConnectedWithParent STARTED

org.apache.kafka.streams.processor.TopologyBuilderTest > testAddSinkConnectedWithParent PASSED

org.apache.kafka.streams.processor.TopologyBuilderTest > testAddStateStoreWithNonExistingProcessor STARTED

org.apache.kafka.streams.processor.TopologyBuilderTest > testAddStateStoreWithNonExistingProcessor PASSED

org.apache.kafka.streams.processor.TopologyBuilderTest > shouldAddInternalTopicConfigWithCleanupPolicyDeleteForInternalTopics STARTED

org.apache.kafka.streams.processor.TopologyBuilderTest > shouldAddInternalTopicConfigWithCleanupPolicyDeleteForInternalTopics PASSED

org.apache.kafka.streams.processor.TopologyBuilderTest > shouldCorrectlyMapStateStoreToInternalTopics STARTED

org.apache.kafka.streams.processor.TopologyBuilderTest > shouldCorrectlyMapStateStoreToInternalTopics PASSED

org.apache.kafka.streams.KeyValueTest > shouldHaveSaneEqualsAndHashCode STARTED

org.apache.kafka.streams.KeyValueTest > shouldHaveSaneEqualsAndHashCode PASSED

1018 tests completed, 1 failed
:streams:test FAILED

FAILURE: Build failed with an exception.

* What went wrong:
Execution failed for task ':streams:test'.
> There were failing tests. See the report at: file://<https://builds.apache.org/job/kafka-trunk-jdk7/ws/streams/build/reports/tests/test/index.html>

* Try:
Run with --stacktrace option to get the stack trace. Run with --info or --debug option to get more log output.

BUILD FAILED

Total time: 2 hrs 26 mins 43.002 secs
Build step 'Execute shell' marked build as failure
Recording test results
Setting GRADLE_2_4_RC_2_HOME=/home/jenkins/jenkins-slave/tools/hudson.plugins.gradle.GradleInstallation/Gradle_2.4-rc-2
Setting GRADLE_2_4_RC_2_HOME=/home/jenkins/jenkins-slave/tools/hudson.plugins.gradle.GradleInstallation/Gradle_2.4-rc-2