You are viewing a plain text version of this content. The canonical link for it is here.
Posted to builds@cassandra.apache.org by Apache Jenkins Server <je...@builds.apache.org> on 2021/08/04 12:20:06 UTC
Build complete: Cassandra-trunk #648 [UNSTABLE]
af1b770f1d019e6f4dcc66d7c76ae0623286a995
-------------------------------------------------------------------------------
Build Cassandra-trunk #648 Still Unstable
URL: https://ci-cassandra.apache.org/job/Cassandra-trunk/648/
-------------------------------------------------------------------------------
Changes:
[Marcus Eriksson] Avoid sending CDC column if not enabled
-------------------------------------------------------------------------------
Failed Tests:
16 tests failed.
FAILED: dtest-novnode.gossip_test.TestGossip.test_2dc_parallel_startup
FAILED: dtest.materialized_views_test.TestMaterializedViewsConsistency.test_multi_partition_consistent_reads_after_write
FAILED: org.apache.cassandra.distributed.upgrade.CompactStorageUpgradeTest.compactStorageHiddenColumnTest
FAILED: org.apache.cassandra.distributed.upgrade.CompactStorageUpgradeTest.compactStorageUpgradeTest
FAILED: org.apache.cassandra.distributed.upgrade.CompactStorageUpgradeTest.compactStorageHiddenColumnTest
FAILED: org.apache.cassandra.distributed.upgrade.MixedModeAvailabilityV22Test.testAvailabilityV22ToV30
FAILED: org.apache.cassandra.tools.SSTableExportTest.testPKArgOutOfOrder-compression
FAILED: org.apache.cassandra.tools.SSTableExportTest.testExcludePKArgOutOfOrder-compression
FAILED: org.apache.cassandra.tools.SSTableExportTest.testPKArgOutOfOrder
FAILED: org.apache.cassandra.tools.SSTableExportTest.testExcludePKArgOutOfOrder
FAILED: org.apache.cassandra.tools.SSTableExportTest.testPKArgOutOfOrder
FAILED: org.apache.cassandra.tools.SSTableExportTest.testExcludePKArgOutOfOrder
FAILED: org.apache.cassandra.tools.SSTableExportTest.testPKArgOutOfOrder-cdc
FAILED: org.apache.cassandra.tools.SSTableExportTest.testExcludePKArgOutOfOrder-cdc
FAILED: org.apache.cassandra.tools.SSTableExportTest.testPKArgOutOfOrder-cdc
FAILED: org.apache.cassandra.tools.SSTableExportTest.testExcludePKArgOutOfOrder-cdc
-------------------------------------------------------------------------------
For complete test report and logs see https://nightlies.apache.org/cassandra/Cassandra-trunk/648/