You are viewing a plain text version of this content. The canonical link for it is here.
Posted to builds@hbase.apache.org by Apache Jenkins Server <je...@builds.apache.org> on 2015/10/03 09:55:30 UTC

Build failed in Jenkins: HBase-1.0 #1070

See <https://builds.apache.org/job/HBase-1.0/1070/changes>

Changes:

[busbey] HBASE-14516 categorize hadoop-compat tests

------------------------------------------
[...truncated 4805 lines...]
   java.lang.Thread.State: WAITING (parking)
	at sun.misc.Unsafe.park(Native Method)
	- parking to wait for  <0x48d98380> (a java.util.concurrent.locks.AbstractQueuedSynchronizer$ConditionObject)
	at java.util.concurrent.locks.LockSupport.park(LockSupport.java:186)
	at java.util.concurrent.locks.AbstractQueuedSynchronizer$ConditionObject.await(AbstractQueuedSynchronizer.java:2043)
	at java.util.concurrent.LinkedBlockingQueue.take(LinkedBlockingQueue.java:442)
	at org.apache.hadoop.ipc.Server$Handler.run(Server.java:1408)

"IPC Server handler 1 on 39341" daemon prio=10 tid=0x277c2c00 nid=0x22e8 waiting on condition [0x27e5b000]
   java.lang.Thread.State: WAITING (parking)
	at sun.misc.Unsafe.park(Native Method)
	- parking to wait for  <0x48d98380> (a java.util.concurrent.locks.AbstractQueuedSynchronizer$ConditionObject)
	at java.util.concurrent.locks.LockSupport.park(LockSupport.java:186)
	at java.util.concurrent.locks.AbstractQueuedSynchronizer$ConditionObject.await(AbstractQueuedSynchronizer.java:2043)
	at java.util.concurrent.LinkedBlockingQueue.take(LinkedBlockingQueue.java:442)
	at org.apache.hadoop.ipc.Server$Handler.run(Server.java:1408)

"IPC Server handler 0 on 39341" daemon prio=10 tid=0x277c1400 nid=0x22e7 waiting on condition [0x27eac000]
   java.lang.Thread.State: WAITING (parking)
	at sun.misc.Unsafe.park(Native Method)
	- parking to wait for  <0x48d98380> (a java.util.concurrent.locks.AbstractQueuedSynchronizer$ConditionObject)
	at java.util.concurrent.locks.LockSupport.park(LockSupport.java:186)
	at java.util.concurrent.locks.AbstractQueuedSynchronizer$ConditionObject.await(AbstractQueuedSynchronizer.java:2043)
	at java.util.concurrent.LinkedBlockingQueue.take(LinkedBlockingQueue.java:442)
	at org.apache.hadoop.ipc.Server$Handler.run(Server.java:1408)

"IPC Server listener on 39341" daemon prio=10 tid=0x277c5c00 nid=0x22e6 runnable [0x27efd000]
   java.lang.Thread.State: RUNNABLE
	at sun.nio.ch.EPollArrayWrapper.epollWait(Native Method)
	at sun.nio.ch.EPollArrayWrapper.poll(EPollArrayWrapper.java:228)
	at sun.nio.ch.EPollSelectorImpl.doSelect(EPollSelectorImpl.java:81)
	at sun.nio.ch.SelectorImpl.lockAndDoSelect(SelectorImpl.java:87)
	- locked <0x48daed10> (a sun.nio.ch.Util$2)
	- locked <0x48daed20> (a java.util.Collections$UnmodifiableSet)
	- locked <0x48daecd0> (a sun.nio.ch.EPollSelectorImpl)
	at sun.nio.ch.SelectorImpl.select(SelectorImpl.java:98)
	at sun.nio.ch.SelectorImpl.select(SelectorImpl.java:102)
	at org.apache.hadoop.ipc.Server$Listener.run(Server.java:479)

"IPC Server Responder" daemon prio=10 tid=0x277b9c00 nid=0x22e5 runnable [0x2875c000]
   java.lang.Thread.State: RUNNABLE
	at sun.nio.ch.EPollArrayWrapper.epollWait(Native Method)
	at sun.nio.ch.EPollArrayWrapper.poll(EPollArrayWrapper.java:228)
	at sun.nio.ch.EPollSelectorImpl.doSelect(EPollSelectorImpl.java:81)
	at sun.nio.ch.SelectorImpl.lockAndDoSelect(SelectorImpl.java:87)
	- locked <0x48d6e720> (a sun.nio.ch.Util$2)
	- locked <0x48d6e730> (a java.util.Collections$UnmodifiableSet)
	- locked <0x48d6e6e0> (a sun.nio.ch.EPollSelectorImpl)
	at sun.nio.ch.SelectorImpl.select(SelectorImpl.java:98)
	at org.apache.hadoop.ipc.Server$Responder.run(Server.java:645)

"Timer-0" daemon prio=10 tid=0x277ad400 nid=0x22e4 in Object.wait() [0x287ad000]
   java.lang.Thread.State: TIMED_WAITING (on object monitor)
	at java.lang.Object.wait(Native Method)
	- waiting on <0x48da54f8> (a java.util.TaskQueue)
	at java.util.TimerThread.mainLoop(Timer.java:552)
	- locked <0x48da54f8> (a java.util.TaskQueue)
	at java.util.TimerThread.run(Timer.java:505)

"8523061@qtp-19565044-1 - Acceptor0 SelectChannelConnector@localhost:44806" prio=10 tid=0x2777f400 nid=0x22e3 runnable [0x287fe000]
   java.lang.Thread.State: RUNNABLE
	at sun.nio.ch.EPollArrayWrapper.epollWait(Native Method)
	at sun.nio.ch.EPollArrayWrapper.poll(EPollArrayWrapper.java:228)
	at sun.nio.ch.EPollSelectorImpl.doSelect(EPollSelectorImpl.java:81)
	at sun.nio.ch.SelectorImpl.lockAndDoSelect(SelectorImpl.java:87)
	- locked <0x48dad230> (a sun.nio.ch.Util$2)
	- locked <0x48dad240> (a java.util.Collections$UnmodifiableSet)
	- locked <0x48dad1f0> (a sun.nio.ch.EPollSelectorImpl)
	at sun.nio.ch.SelectorImpl.select(SelectorImpl.java:98)
	at org.mortbay.io.nio.SelectorManager$SelectSet.doSelect(SelectorManager.java:498)
	at org.mortbay.io.nio.SelectorManager.doSelect(SelectorManager.java:192)
	at org.mortbay.jetty.nio.SelectChannelConnector.accept(SelectChannelConnector.java:124)
	at org.mortbay.jetty.AbstractConnector$Acceptor.run(AbstractConnector.java:708)
	at org.mortbay.thread.QueuedThreadPool$PoolThread.run(QueuedThreadPool.java:582)

"13793525@qtp-19565044-0" prio=10 tid=0x2777e400 nid=0x22e2 in Object.wait() [0x28963000]
   java.lang.Thread.State: TIMED_WAITING (on object monitor)
	at java.lang.Object.wait(Native Method)
	- waiting on <0x48d6ebc8> (a org.mortbay.thread.QueuedThreadPool$PoolThread)
	at org.mortbay.thread.QueuedThreadPool$PoolThread.run(QueuedThreadPool.java:626)
	- locked <0x48d6ebc8> (a org.mortbay.thread.QueuedThreadPool$PoolThread)

"pool-1-thread-1" prio=10 tid=0x27719400 nid=0x22e1 runnable [0x2957d000]
   java.lang.Thread.State: RUNNABLE
	at sun.nio.ch.EPollArrayWrapper.epollWait(Native Method)
	at sun.nio.ch.EPollArrayWrapper.poll(EPollArrayWrapper.java:228)
	at sun.nio.ch.EPollSelectorImpl.doSelect(EPollSelectorImpl.java:81)
	at sun.nio.ch.SelectorImpl.lockAndDoSelect(SelectorImpl.java:87)
	- locked <0x48dbd8b8> (a sun.nio.ch.Util$2)
	- locked <0x48dbd8c8> (a java.util.Collections$UnmodifiableSet)
	- locked <0x48daf4a8> (a sun.nio.ch.EPollSelectorImpl)
	at sun.nio.ch.SelectorImpl.select(SelectorImpl.java:98)
	at sun.nio.ch.SelectorImpl.select(SelectorImpl.java:102)
	at org.apache.hadoop.ipc.Server$Listener$Reader.run(Server.java:373)
	- locked <0x48daf490> (a org.apache.hadoop.ipc.Server$Listener$Reader)
	at java.util.concurrent.ThreadPoolExecutor.runWorker(ThreadPoolExecutor.java:1145)
	at java.util.concurrent.ThreadPoolExecutor$Worker.run(ThreadPoolExecutor.java:615)
	at java.lang.Thread.run(Thread.java:724)

"org.apache.hadoop.hdfs.server.namenode.DecommissionManager$Monitor@19533ee" daemon prio=10 tid=0x281c0400 nid=0x22e0 waiting on condition [0x2977d000]
   java.lang.Thread.State: TIMED_WAITING (sleeping)
	at java.lang.Thread.sleep(Native Method)
	at org.apache.hadoop.hdfs.server.namenode.DecommissionManager$Monitor.run(DecommissionManager.java:65)
	at java.lang.Thread.run(Thread.java:724)

"org.apache.hadoop.hdfs.server.namenode.FSNamesystem$ReplicationMonitor@c60d36" daemon prio=10 tid=0x281bf400 nid=0x22df waiting on condition [0x2997d000]
   java.lang.Thread.State: TIMED_WAITING (sleeping)
	at java.lang.Thread.sleep(Native Method)
	at org.apache.hadoop.hdfs.server.namenode.FSNamesystem$ReplicationMonitor.run(FSNamesystem.java:3167)
	at java.lang.Thread.run(Thread.java:724)

"org.apache.hadoop.hdfs.server.namenode.LeaseManager$Monitor@1d94153" daemon prio=10 tid=0x281be800 nid=0x22de waiting on condition [0x2a368000]
   java.lang.Thread.State: TIMED_WAITING (sleeping)
	at java.lang.Thread.sleep(Native Method)
	at org.apache.hadoop.hdfs.server.namenode.LeaseManager$Monitor.run(LeaseManager.java:368)
	at java.lang.Thread.run(Thread.java:724)

"org.apache.hadoop.hdfs.server.namenode.FSNamesystem$HeartbeatMonitor@15152f9" daemon prio=10 tid=0x281bd400 nid=0x22dd waiting on condition [0x3247d000]
   java.lang.Thread.State: TIMED_WAITING (sleeping)
	at java.lang.Thread.sleep(Native Method)
	at org.apache.hadoop.hdfs.server.namenode.FSNamesystem$HeartbeatMonitor.run(FSNamesystem.java:3146)
	at java.lang.Thread.run(Thread.java:724)

"org.apache.hadoop.hdfs.server.namenode.PendingReplicationBlocks$PendingReplicationMonitor@12d7308" daemon prio=10 tid=0x281b9400 nid=0x22dc waiting on condition [0x3267d000]
   java.lang.Thread.State: TIMED_WAITING (sleeping)
	at java.lang.Thread.sleep(Native Method)
	at org.apache.hadoop.hdfs.server.namenode.PendingReplicationBlocks$PendingReplicationMonitor.run(PendingReplicationBlocks.java:197)
	at java.lang.Thread.run(Thread.java:724)

"Service Thread" daemon prio=10 tid=0x2a1f7c00 nid=0x22d7 runnable [0x00000000]
   java.lang.Thread.State: RUNNABLE

"C2 CompilerThread1" daemon prio=10 tid=0x2a1f5c00 nid=0x22d6 waiting on condition [0x00000000]
   java.lang.Thread.State: RUNNABLE

"C2 CompilerThread0" daemon prio=10 tid=0x2a1f3c00 nid=0x22d5 waiting on condition [0x00000000]
   java.lang.Thread.State: RUNNABLE

"Signal Dispatcher" daemon prio=10 tid=0x2a1f2400 nid=0x22d4 runnable [0x00000000]
   java.lang.Thread.State: RUNNABLE

"Finalizer" daemon prio=10 tid=0x2a1b7000 nid=0x22d3 in Object.wait() [0x3367d000]
   java.lang.Thread.State: WAITING (on object monitor)
	at java.lang.Object.wait(Native Method)
	- waiting on <0x48c66010> (a java.lang.ref.ReferenceQueue$Lock)
	at java.lang.ref.ReferenceQueue.remove(ReferenceQueue.java:135)
	- locked <0x48c66010> (a java.lang.ref.ReferenceQueue$Lock)
	at java.lang.ref.ReferenceQueue.remove(ReferenceQueue.java:151)
	at java.lang.ref.Finalizer$FinalizerThread.run(Finalizer.java:189)

"Reference Handler" daemon prio=10 tid=0x2a1b5400 nid=0x22d2 in Object.wait() [0x3387d000]
   java.lang.Thread.State: WAITING (on object monitor)
	at java.lang.Object.wait(Native Method)
	- waiting on <0x48c65c78> (a java.lang.ref.Reference$Lock)
	at java.lang.Object.wait(Object.java:503)
	at java.lang.ref.Reference$ReferenceHandler.run(Reference.java:133)
	- locked <0x48c65c78> (a java.lang.ref.Reference$Lock)

"main" prio=10 tid=0xf6806800 nid=0x22c3 waiting on condition [0xf696c000]
   java.lang.Thread.State: TIMED_WAITING (sleeping)
	at java.lang.Thread.sleep(Native Method)
	at org.apache.hadoop.mapred.JobClient.monitorAndPrintJob(JobClient.java:1387)
	at org.apache.hadoop.mapreduce.Job.waitForCompletion(Job.java:583)
	at org.apache.hadoop.hbase.mapreduce.WALPlayer.run(WALPlayer.java:310)
	at org.apache.hadoop.hbase.mapreduce.TestWALPlayer.testWALPlayer(TestWALPlayer.java:118)
	at sun.reflect.NativeMethodAccessorImpl.invoke0(Native Method)
	at sun.reflect.NativeMethodAccessorImpl.invoke(NativeMethodAccessorImpl.java:57)
	at sun.reflect.DelegatingMethodAccessorImpl.invoke(DelegatingMethodAccessorImpl.java:43)
	at java.lang.reflect.Method.invoke(Method.java:606)
	at org.junit.runners.model.FrameworkMethod$1.runReflectiveCall(FrameworkMethod.java:47)
	at org.junit.internal.runners.model.ReflectiveCallable.run(ReflectiveCallable.java:12)
	at org.junit.runners.model.FrameworkMethod.invokeExplosively(FrameworkMethod.java:44)
	at org.junit.internal.runners.statements.InvokeMethod.evaluate(InvokeMethod.java:17)
	at org.junit.runners.ParentRunner.runLeaf(ParentRunner.java:271)
	at org.junit.runners.BlockJUnit4ClassRunner.runChild(BlockJUnit4ClassRunner.java:70)
	at org.junit.runners.BlockJUnit4ClassRunner.runChild(BlockJUnit4ClassRunner.java:50)
	at org.junit.runners.ParentRunner$3.run(ParentRunner.java:238)
	at org.junit.runners.ParentRunner$1.schedule(ParentRunner.java:63)
	at org.junit.runners.ParentRunner.runChildren(ParentRunner.java:236)
	at org.junit.runners.ParentRunner.access$000(ParentRunner.java:53)
	at org.junit.runners.ParentRunner$2.evaluate(ParentRunner.java:229)
	at org.junit.internal.runners.statements.RunBefores.evaluate(RunBefores.java:26)
	at org.junit.internal.runners.statements.RunAfters.evaluate(RunAfters.java:27)
	at org.junit.runners.ParentRunner.run(ParentRunner.java:309)
	at org.junit.runners.Suite.runChild(Suite.java:127)
	at org.junit.runners.Suite.runChild(Suite.java:26)
	at org.junit.runners.ParentRunner$3.run(ParentRunner.java:238)
	at org.junit.runners.ParentRunner$1.schedule(ParentRunner.java:63)
	at org.junit.runners.ParentRunner.runChildren(ParentRunner.java:236)
	at org.junit.runners.ParentRunner.access$000(ParentRunner.java:53)
	at org.junit.runners.ParentRunner$2.evaluate(ParentRunner.java:229)
	at org.junit.runners.ParentRunner.run(ParentRunner.java:309)
	at org.junit.runner.JUnitCore.run(JUnitCore.java:160)
	at org.junit.runner.JUnitCore.run(JUnitCore.java:138)
	at org.apache.maven.surefire.junitcore.JUnitCoreWrapper.createRequestAndRun(JUnitCoreWrapper.java:108)
	at org.apache.maven.surefire.junitcore.JUnitCoreWrapper.executeEager(JUnitCoreWrapper.java:78)
	at org.apache.maven.surefire.junitcore.JUnitCoreWrapper.execute(JUnitCoreWrapper.java:54)
	at org.apache.maven.surefire.junitcore.JUnitCoreProvider.invoke(JUnitCoreProvider.java:144)
	at org.apache.maven.surefire.booter.ForkedBooter.invokeProviderInSameClassLoader(ForkedBooter.java:203)
	at org.apache.maven.surefire.booter.ForkedBooter.runSuitesInProcess(ForkedBooter.java:155)
	at org.apache.maven.surefire.booter.ForkedBooter.main(ForkedBooter.java:103)

"VM Thread" prio=10 tid=0x2a0f8c00 nid=0x22d1 runnable 

"GC task thread#0 (ParallelGC)" prio=10 tid=0xf6810c00 nid=0x22c4 runnable 

"GC task thread#1 (ParallelGC)" prio=10 tid=0xf6812000 nid=0x22c5 runnable 

"GC task thread#2 (ParallelGC)" prio=10 tid=0xf6813800 nid=0x22c6 runnable 

"GC task thread#3 (ParallelGC)" prio=10 tid=0xf6815000 nid=0x22c7 runnable 

"GC task thread#4 (ParallelGC)" prio=10 tid=0xf6816400 nid=0x22c8 runnable 

"GC task thread#5 (ParallelGC)" prio=10 tid=0xf6817c00 nid=0x22c9 runnable 

"GC task thread#6 (ParallelGC)" prio=10 tid=0xf6819400 nid=0x22ca runnable 

"GC task thread#7 (ParallelGC)" prio=10 tid=0xf681a800 nid=0x22cb runnable 

"GC task thread#8 (ParallelGC)" prio=10 tid=0xf681c000 nid=0x22cc runnable 

"GC task thread#9 (ParallelGC)" prio=10 tid=0xf681d800 nid=0x22cd runnable 

"GC task thread#10 (ParallelGC)" prio=10 tid=0xf681ec00 nid=0x22ce runnable 

"GC task thread#11 (ParallelGC)" prio=10 tid=0xf6820400 nid=0x22cf runnable 

"GC task thread#12 (ParallelGC)" prio=10 tid=0xf6821c00 nid=0x22d0 runnable 

"VM Periodic Task Thread" prio=10 tid=0x2a1f9800 nid=0x22d8 waiting on condition 

JNI global references: 202

+ echo '************ END  zombies jstack extract'
************ END  zombies jstack extract
+ JIRA_COMMENT='

     {color:red}-1 core zombie tests{color}.  There are 1 zombie test(s): 	at org.apache.hadoop.hbase.mapreduce.TestWALPlayer.testWALPlayer(TestWALPlayer.java:118)'
+ BAD=1
+ jps
+ grep surefirebooter
+ cut -d ' ' -f 1
+ xargs kill -9
POST BUILD TASK : SUCCESS
END OF POST BUILD TASK : 0
Archiving artifacts
Recording test results
Updating HBASE-14516

Jenkins build is back to normal : HBase-1.0 #1079

Posted by Apache Jenkins Server <je...@builds.apache.org>.
See <https://builds.apache.org/job/HBase-1.0/1079/changes>


Build failed in Jenkins: HBase-1.0 #1078

Posted by Apache Jenkins Server <je...@builds.apache.org>.
See <https://builds.apache.org/job/HBase-1.0/1078/changes>

Changes:

[enis] HBASE-14501 NPE in replication with TDE

------------------------------------------
[...truncated 1925 lines...]
Running org.apache.hadoop.hbase.regionserver.wal.TestLogRollPeriod
Running org.apache.hadoop.hbase.regionserver.wal.TestLogRollAbort
Tests run: 6, Failures: 0, Errors: 0, Skipped: 0, Time elapsed: 5.159 sec - in org.apache.hadoop.hbase.regionserver.wal.TestFSHLog
Running org.apache.hadoop.hbase.regionserver.wal.TestSecureWALReplay
Running org.apache.hadoop.hbase.regionserver.wal.TestWALReplayCompressed
Tests run: 2, Failures: 0, Errors: 0, Skipped: 0, Time elapsed: 21.898 sec - in org.apache.hadoop.hbase.regionserver.wal.TestLogRollAbort
Running org.apache.hadoop.hbase.regionserver.wal.TestWALReplay
Tests run: 9, Failures: 0, Errors: 0, Skipped: 0, Time elapsed: 39.937 sec - in org.apache.hadoop.hbase.regionserver.wal.TestSecureWALReplay
Running org.apache.hadoop.hbase.regionserver.wal.TestDurability
Tests run: 9, Failures: 0, Errors: 0, Skipped: 0, Time elapsed: 37.007 sec - in org.apache.hadoop.hbase.regionserver.wal.TestWALReplayCompressed
Tests run: 2, Failures: 0, Errors: 0, Skipped: 0, Time elapsed: 51.597 sec - in org.apache.hadoop.hbase.regionserver.wal.TestLogRollPeriod
Tests run: 2, Failures: 0, Errors: 0, Skipped: 0, Time elapsed: 2.404 sec - in org.apache.hadoop.hbase.regionserver.wal.TestDurability
Running org.apache.hadoop.hbase.regionserver.TestParallelPut
Running org.apache.hadoop.hbase.regionserver.TestMajorCompaction
Running org.apache.hadoop.hbase.regionserver.wal.TestProtobufLog
Tests run: 1, Failures: 0, Errors: 0, Skipped: 0, Time elapsed: 1.594 sec - in org.apache.hadoop.hbase.regionserver.wal.TestProtobufLog
Running org.apache.hadoop.hbase.regionserver.TestRegionReplicas
Tests run: 9, Failures: 0, Errors: 0, Skipped: 0, Time elapsed: 37.855 sec - in org.apache.hadoop.hbase.regionserver.wal.TestWALReplay
Running org.apache.hadoop.hbase.regionserver.TestEncryptionKeyRotation
Tests run: 2, Failures: 0, Errors: 0, Skipped: 0, Time elapsed: 13.093 sec - in org.apache.hadoop.hbase.regionserver.TestEncryptionKeyRotation
Running org.apache.hadoop.hbase.regionserver.TestFlushRegionEntry
Tests run: 1, Failures: 0, Errors: 0, Skipped: 0, Time elapsed: 0.816 sec - in org.apache.hadoop.hbase.regionserver.TestFlushRegionEntry
Running org.apache.hadoop.hbase.regionserver.TestZKLessSplitOnCluster
Tests run: 7, Failures: 0, Errors: 0, Skipped: 0, Time elapsed: 48.427 sec - in org.apache.hadoop.hbase.regionserver.TestMajorCompaction
Running org.apache.hadoop.hbase.regionserver.TestCompactionState
Tests run: 2, Failures: 0, Errors: 0, Skipped: 0, Time elapsed: 82.401 sec - in org.apache.hadoop.hbase.regionserver.TestParallelPut
Tests run: 16, Failures: 0, Errors: 0, Skipped: 0, Time elapsed: 35.89 sec - in org.apache.hadoop.hbase.regionserver.TestZKLessSplitOnCluster
Running org.apache.hadoop.hbase.regionserver.TestFSErrorsExposed
Running org.apache.hadoop.hbase.regionserver.TestDefaultMemStore
Tests run: 5, Failures: 0, Errors: 0, Skipped: 0, Time elapsed: 29.052 sec - in org.apache.hadoop.hbase.regionserver.TestCompactionState
Running org.apache.hadoop.hbase.regionserver.TestRegionServerMetrics
Tests run: 9, Failures: 0, Errors: 0, Skipped: 0, Time elapsed: 7.084 sec - in org.apache.hadoop.hbase.regionserver.TestRegionServerMetrics
Running org.apache.hadoop.hbase.regionserver.TestGetClosestAtOrBefore
Tests run: 3, Failures: 0, Errors: 0, Skipped: 0, Time elapsed: 1.906 sec - in org.apache.hadoop.hbase.regionserver.TestGetClosestAtOrBefore
Running org.apache.hadoop.hbase.regionserver.TestRSKilledWhenInitializing
Tests run: 3, Failures: 0, Errors: 0, Skipped: 0, Time elapsed: 36.252 sec - in org.apache.hadoop.hbase.regionserver.TestFSErrorsExposed
Running org.apache.hadoop.hbase.regionserver.TestReversibleScanners
Tests run: 23, Failures: 0, Errors: 0, Skipped: 0, Time elapsed: 40.011 sec - in org.apache.hadoop.hbase.regionserver.TestDefaultMemStore
Running org.apache.hadoop.hbase.regionserver.TestRecoveredEdits
Tests run: 5, Failures: 0, Errors: 0, Skipped: 0, Time elapsed: 3.936 sec - in org.apache.hadoop.hbase.regionserver.TestReversibleScanners
Tests run: 1, Failures: 0, Errors: 0, Skipped: 0, Time elapsed: 17.743 sec - in org.apache.hadoop.hbase.regionserver.TestRSKilledWhenInitializing
Running org.apache.hadoop.hbase.regionserver.TestRegionServerNoMaster
Tests run: 1, Failures: 0, Errors: 0, Skipped: 0, Time elapsed: 11.999 sec - in org.apache.hadoop.hbase.regionserver.TestRecoveredEdits
Running org.apache.hadoop.hbase.regionserver.TestScannerRetriableFailure
Running org.apache.hadoop.hbase.regionserver.TestScannerWithBulkload
Tests run: 3, Failures: 0, Errors: 0, Skipped: 0, Time elapsed: 5.683 sec - in org.apache.hadoop.hbase.regionserver.TestScannerWithBulkload
Running org.apache.hadoop.hbase.regionserver.TestClusterId
Tests run: 9, Failures: 0, Errors: 0, Skipped: 0, Time elapsed: 17.831 sec - in org.apache.hadoop.hbase.regionserver.TestRegionServerNoMaster
Running org.apache.hadoop.hbase.regionserver.TestCompaction
Tests run: 1, Failures: 0, Errors: 0, Skipped: 0, Time elapsed: 33.615 sec - in org.apache.hadoop.hbase.regionserver.TestScannerRetriableFailure
Tests run: 5, Failures: 0, Errors: 0, Skipped: 0, Time elapsed: 22.923 sec - in org.apache.hadoop.hbase.regionserver.TestCompaction
Tests run: 2, Failures: 0, Errors: 0, Skipped: 0, Time elapsed: 27.794 sec - in org.apache.hadoop.hbase.regionserver.TestClusterId
Tests run: 7, Failures: 0, Errors: 0, Skipped: 0, Time elapsed: 171.097 sec - in org.apache.hadoop.hbase.regionserver.TestRegionReplicas
Running org.apache.hadoop.hbase.regionserver.TestSeekOptimizations
Running org.apache.hadoop.hbase.regionserver.TestHRegion
Running org.apache.hadoop.hbase.regionserver.TestRegionFavoredNodes
Running org.apache.hadoop.hbase.regionserver.TestServerCustomProtocol
Tests run: 6, Failures: 0, Errors: 0, Skipped: 0, Time elapsed: 5.64 sec - in org.apache.hadoop.hbase.regionserver.TestSeekOptimizations
Running org.apache.hadoop.hbase.regionserver.TestAtomicOperation
Tests run: 5, Failures: 0, Errors: 0, Skipped: 0, Time elapsed: 253.574 sec - in org.apache.hadoop.hbase.regionserver.wal.TestLogRolling
Tests run: 1, Failures: 0, Errors: 0, Skipped: 0, Time elapsed: 10.955 sec - in org.apache.hadoop.hbase.regionserver.TestRegionFavoredNodes
Running org.apache.hadoop.hbase.regionserver.TestCompactionWithCoprocessor
Running org.apache.hadoop.hbase.regionserver.TestSplitTransactionOnCluster
Tests run: 7, Failures: 0, Errors: 0, Skipped: 0, Time elapsed: 16.531 sec - in org.apache.hadoop.hbase.regionserver.TestServerCustomProtocol
Running org.apache.hadoop.hbase.regionserver.TestHRegionServerBulkLoad
Tests run: 5, Failures: 0, Errors: 0, Skipped: 0, Time elapsed: 30.335 sec - in org.apache.hadoop.hbase.regionserver.TestCompactionWithCoprocessor
Tests run: 6, Failures: 0, Errors: 0, Skipped: 0, Time elapsed: 53.361 sec - in org.apache.hadoop.hbase.regionserver.TestAtomicOperation
Running org.apache.hadoop.hbase.regionserver.TestZKLessMergeOnCluster
Tests run: 1, Failures: 0, Errors: 0, Skipped: 0, Time elapsed: 43.131 sec - in org.apache.hadoop.hbase.regionserver.TestHRegionServerBulkLoad
Tests run: 16, Failures: 0, Errors: 0, Skipped: 0, Time elapsed: 49.594 sec - in org.apache.hadoop.hbase.regionserver.TestSplitTransactionOnCluster
Tests run: 3, Failures: 0, Errors: 0, Skipped: 0, Time elapsed: 11.865 sec - in org.apache.hadoop.hbase.regionserver.TestZKLessMergeOnCluster
Running org.apache.hadoop.hbase.TestRegionRebalancing
Running org.apache.hadoop.hbase.regionserver.TestRegionServerOnlineConfigChange
Tests run: 2, Failures: 0, Errors: 0, Skipped: 0, Time elapsed: 1.397 sec - in org.apache.hadoop.hbase.regionserver.TestRegionServerOnlineConfigChange
Running org.apache.hadoop.hbase.regionserver.TestEncryptionRandomKeying
Running org.apache.hadoop.hbase.regionserver.TestEndToEndSplitTransaction
Tests run: 1, Failures: 0, Errors: 0, Skipped: 0, Time elapsed: 1.42 sec - in org.apache.hadoop.hbase.regionserver.TestEncryptionRandomKeying
Running org.apache.hadoop.hbase.io.encoding.TestEncodedSeekers
Running org.apache.hadoop.hbase.io.encoding.TestDataBlockEncoders
Tests run: 2, Failures: 0, Errors: 0, Skipped: 0, Time elapsed: 14.599 sec - in org.apache.hadoop.hbase.regionserver.TestEndToEndSplitTransaction
Running org.apache.hadoop.hbase.io.encoding.TestChangingEncoding
Tests run: 2, Failures: 0, Errors: 0, Skipped: 0, Time elapsed: 30.606 sec - in org.apache.hadoop.hbase.TestRegionRebalancing
Running org.apache.hadoop.hbase.io.encoding.TestLoadAndSwitchEncodeOnDisk
Tests run: 1, Failures: 0, Errors: 0, Skipped: 0, Time elapsed: 22.42 sec - in org.apache.hadoop.hbase.io.encoding.TestLoadAndSwitchEncodeOnDisk
Running org.apache.hadoop.hbase.io.encoding.TestBufferedDataBlockEncoder
Tests run: 96, Failures: 0, Errors: 0, Skipped: 0, Time elapsed: 140.586 sec - in org.apache.hadoop.hbase.regionserver.TestHRegion
Running org.apache.hadoop.hbase.io.hfile.TestCacheOnWrite
Tests run: 1, Failures: 0, Errors: 0, Skipped: 0, Time elapsed: 17.592 sec - in org.apache.hadoop.hbase.io.encoding.TestBufferedDataBlockEncoder
Running org.apache.hadoop.hbase.io.hfile.TestCacheConfig
Tests run: 6, Failures: 0, Errors: 0, Skipped: 0, Time elapsed: 1.782 sec - in org.apache.hadoop.hbase.io.hfile.TestCacheConfig
Running org.apache.hadoop.hbase.io.hfile.TestHFileSeek
Tests run: 1, Failures: 0, Errors: 0, Skipped: 0, Time elapsed: 1.845 sec - in org.apache.hadoop.hbase.io.hfile.TestHFileSeek
Tests run: 3, Failures: 0, Errors: 0, Skipped: 0, Time elapsed: 56.475 sec - in org.apache.hadoop.hbase.io.encoding.TestChangingEncoding
Running org.apache.hadoop.hbase.io.hfile.TestHFileBlock
Running org.apache.hadoop.hbase.io.hfile.TestForceCacheImportantBlocks
Tests run: 4, Failures: 0, Errors: 0, Skipped: 0, Time elapsed: 40.999 sec - in org.apache.hadoop.hbase.io.hfile.TestForceCacheImportantBlocks
Running org.apache.hadoop.hbase.io.hfile.TestScannerSelectionUsingTTL
Tests run: 20, Failures: 0, Errors: 0, Skipped: 0, Time elapsed: 141.115 sec - in org.apache.hadoop.hbase.io.encoding.TestEncodedSeekers
Running org.apache.hadoop.hbase.io.hfile.TestHFileBlockIndex
Tests run: 10, Failures: 0, Errors: 0, Skipped: 0, Time elapsed: 11.881 sec - in org.apache.hadoop.hbase.io.hfile.TestHFileBlockIndex
Running org.apache.hadoop.hbase.io.TestFileLink
Tests run: 3, Failures: 0, Errors: 0, Skipped: 0, Time elapsed: 14.384 sec - in org.apache.hadoop.hbase.io.TestFileLink
Tests run: 28, Failures: 0, Errors: 0, Skipped: 0, Time elapsed: 93.918 sec - in org.apache.hadoop.hbase.io.hfile.TestHFileBlock
Running org.apache.hadoop.hbase.security.access.TestAccessController
Running org.apache.hadoop.hbase.security.access.TestTablePermissions
Tests run: 6, Failures: 0, Errors: 0, Skipped: 0, Time elapsed: 62.866 sec - in org.apache.hadoop.hbase.io.hfile.TestScannerSelectionUsingTTL
Tests run: 7, Failures: 0, Errors: 0, Skipped: 0, Time elapsed: 16.281 sec - in org.apache.hadoop.hbase.security.access.TestTablePermissions
Running org.apache.hadoop.hbase.security.access.TestCellACLs
Tests run: 2, Failures: 0, Errors: 0, Skipped: 0, Time elapsed: 6.387 sec - in org.apache.hadoop.hbase.security.access.TestCellACLs
Tests run: 54, Failures: 0, Errors: 0, Skipped: 0, Time elapsed: 27.45 sec - in org.apache.hadoop.hbase.security.access.TestAccessController
Running org.apache.hadoop.hbase.security.access.TestAccessControlFilter
Tests run: 1, Failures: 0, Errors: 0, Skipped: 0, Time elapsed: 1.85 sec - in org.apache.hadoop.hbase.security.access.TestAccessControlFilter
Tests run: 72, Failures: 0, Errors: 0, Skipped: 0, Time elapsed: 150.923 sec - in org.apache.hadoop.hbase.io.hfile.TestCacheOnWrite
Running org.apache.hadoop.hbase.security.access.TestCellACLWithMultipleVersions
Running org.apache.hadoop.hbase.security.access.TestNamespaceCommands
Running org.apache.hadoop.hbase.security.access.TestAccessController2
Tests run: 7, Failures: 0, Errors: 0, Skipped: 0, Time elapsed: 4.094 sec - in org.apache.hadoop.hbase.security.access.TestNamespaceCommands
Running org.apache.hadoop.hbase.security.access.TestZKPermissionsWatcher
Tests run: 1, Failures: 0, Errors: 0, Skipped: 0, Time elapsed: 3.979 sec - in org.apache.hadoop.hbase.security.access.TestZKPermissionsWatcher
Tests run: 5, Failures: 0, Errors: 0, Skipped: 0, Time elapsed: 10.397 sec - in org.apache.hadoop.hbase.security.access.TestAccessController2
Running org.apache.hadoop.hbase.security.access.TestWithDisabledAuthorization
Tests run: 8, Failures: 0, Errors: 0, Skipped: 0, Time elapsed: 19.384 sec - in org.apache.hadoop.hbase.security.access.TestCellACLWithMultipleVersions
Running org.apache.hadoop.hbase.security.access.TestScanEarlyTermination
Tests run: 1, Failures: 0, Errors: 0, Skipped: 0, Time elapsed: 2.164 sec - in org.apache.hadoop.hbase.security.access.TestScanEarlyTermination
Running org.apache.hadoop.hbase.security.visibility.TestVisibilityLablesWithGroups
Tests run: 1, Failures: 0, Errors: 0, Skipped: 0, Time elapsed: 1.912 sec - in org.apache.hadoop.hbase.security.visibility.TestVisibilityLablesWithGroups
Tests run: 6, Failures: 0, Errors: 0, Skipped: 0, Time elapsed: 14.631 sec - in org.apache.hadoop.hbase.security.access.TestWithDisabledAuthorization
Running org.apache.hadoop.hbase.security.visibility.TestVisibilityLabelsWithDeletes
Running org.apache.hadoop.hbase.security.visibility.TestVisibilityLabelsWithDefaultVisLabelService
Running org.apache.hadoop.hbase.security.visibility.TestVisibilityLabelsWithCustomVisLabService
Running org.apache.hadoop.hbase.security.visibility.TestDefaultScanLabelGeneratorStack
Tests run: 1, Failures: 0, Errors: 0, Skipped: 0, Time elapsed: 1.468 sec - in org.apache.hadoop.hbase.security.visibility.TestDefaultScanLabelGeneratorStack
Tests run: 19, Failures: 0, Errors: 0, Skipped: 0, Time elapsed: 12.469 sec - in org.apache.hadoop.hbase.security.visibility.TestVisibilityLabelsWithCustomVisLabService
Tests run: 28, Failures: 0, Errors: 0, Skipped: 0, Time elapsed: 263.039 sec - in org.apache.hadoop.hbase.io.encoding.TestDataBlockEncoders
Tests run: 23, Failures: 0, Errors: 0, Skipped: 0, Time elapsed: 16.057 sec - in org.apache.hadoop.hbase.security.visibility.TestVisibilityLabelsWithDefaultVisLabelService
Running org.apache.hadoop.hbase.security.visibility.TestVisibilityWithCheckAuths
Tests run: 2, Failures: 0, Errors: 0, Skipped: 0, Time elapsed: 2.638 sec - in org.apache.hadoop.hbase.security.visibility.TestVisibilityWithCheckAuths
Running org.apache.hadoop.hbase.security.visibility.TestVisibilityLabelsReplication
Running org.apache.hadoop.hbase.security.visibility.TestVisibilityLabelsOpWithDifferentUsersNoACL
Running org.apache.hadoop.hbase.security.visibility.TestVisibilityLabelsWithSLGStack
Running org.apache.hadoop.hbase.security.visibility.TestEnforcingScanLabelGenerator
Tests run: 1, Failures: 0, Errors: 0, Skipped: 0, Time elapsed: 1.87 sec - in org.apache.hadoop.hbase.security.visibility.TestVisibilityLabelsOpWithDifferentUsersNoACL
Tests run: 1, Failures: 0, Errors: 0, Skipped: 0, Time elapsed: 1.932 sec - in org.apache.hadoop.hbase.security.visibility.TestVisibilityLabelsWithSLGStack
Running org.apache.hadoop.hbase.security.visibility.TestVisibilityLabelReplicationWithExpAsString
Tests run: 1, Failures: 0, Errors: 0, Skipped: 0, Time elapsed: 1.371 sec - in org.apache.hadoop.hbase.security.visibility.TestEnforcingScanLabelGenerator
Tests run: 39, Failures: 0, Errors: 0, Skipped: 0, Time elapsed: 40.688 sec - in org.apache.hadoop.hbase.security.visibility.TestVisibilityLabelsWithDeletes
Tests run: 1, Failures: 0, Errors: 0, Skipped: 0, Time elapsed: 17.622 sec - in org.apache.hadoop.hbase.security.visibility.TestVisibilityLabelsReplication
Running org.apache.hadoop.hbase.security.visibility.TestWithDisabledAuthorization
Running org.apache.hadoop.hbase.security.visibility.TestVisibilityLabelsWithACL
Running org.apache.hadoop.hbase.security.token.TestZKSecretWatcher
Tests run: 2, Failures: 0, Errors: 0, Skipped: 0, Time elapsed: 1.924 sec - in org.apache.hadoop.hbase.security.visibility.TestWithDisabledAuthorization
Tests run: 5, Failures: 0, Errors: 0, Skipped: 0, Time elapsed: 3.783 sec - in org.apache.hadoop.hbase.security.visibility.TestVisibilityLabelsWithACL
Running org.apache.hadoop.hbase.TestHBaseOnOtherDfsCluster
Running org.apache.hadoop.hbase.security.token.TestTokenAuthentication
Tests run: 3, Failures: 0, Errors: 0, Skipped: 0, Time elapsed: 0.414 sec - in org.apache.hadoop.hbase.security.token.TestTokenAuthentication
Tests run: 1, Failures: 0, Errors: 0, Skipped: 0, Time elapsed: 17.978 sec - in org.apache.hadoop.hbase.security.visibility.TestVisibilityLabelReplicationWithExpAsString
Tests run: 1, Failures: 0, Errors: 0, Skipped: 0, Time elapsed: 9.28 sec - in org.apache.hadoop.hbase.TestHBaseOnOtherDfsCluster
Tests run: 1, Failures: 0, Errors: 0, Skipped: 0, Time elapsed: 13.252 sec - in org.apache.hadoop.hbase.security.token.TestZKSecretWatcher

Results :


Tests in error: 
  TestDistributedLogSplitting.testLogReplayWithMetaRSDown:405->abortRSAndVerifyRecovery:414 » Runtime


Tests run: 2240, Failures: 0, Errors: 1, Skipped: 18

[INFO] ------------------------------------------------------------------------
[INFO] Reactor Summary:
[INFO] 
[INFO] Apache HBase ...................................... SUCCESS [3.932s]
[INFO] Apache HBase - Checkstyle ......................... SUCCESS [0.804s]
[INFO] Apache HBase - Resource Bundle .................... SUCCESS [0.203s]
[INFO] Apache HBase - Annotations ........................ SUCCESS [1.247s]
[INFO] Apache HBase - Common ............................. SUCCESS [57.722s]
[INFO] Apache HBase - Protocol ........................... SUCCESS [9.242s]
[INFO] Apache HBase - Client ............................. SUCCESS [1:19.840s]
[INFO] Apache HBase - Hadoop Compatibility ............... SUCCESS [7.334s]
[INFO] Apache HBase - Hadoop Two Compatibility ........... SUCCESS [6.831s]
[INFO] Apache HBase - Prefix Tree ........................ SUCCESS [8.866s]
[INFO] Apache HBase - Server ............................. FAILURE [1:06:20.166s]
[INFO] Apache HBase - Testing Util ....................... SKIPPED
[INFO] Apache HBase - Thrift ............................. SKIPPED
[INFO] Apache HBase - Rest ............................... SKIPPED
[INFO] Apache HBase - Shell .............................. SKIPPED
[INFO] Apache HBase - Integration Tests .................. SKIPPED
[INFO] Apache HBase - Examples ........................... SKIPPED
[INFO] Apache HBase - Assembly ........................... SKIPPED
[INFO] ------------------------------------------------------------------------
[INFO] BUILD FAILURE
[INFO] ------------------------------------------------------------------------
[INFO] Total time: 1:09:17.733s
[INFO] Finished at: Tue Oct 13 05:45:22 UTC 2015
[INFO] Final Memory: 46M/495M
[INFO] ------------------------------------------------------------------------
[ERROR] Failed to execute goal org.apache.maven.plugins:maven-surefire-plugin:2.18:test (secondPartTestsExecution) on project hbase-server: There are test failures.
[ERROR] 
[ERROR] Please refer to <https://builds.apache.org/job/HBase-1.0/ws/hbase-server/target/surefire-reports> for the individual test results.
[ERROR] -> [Help 1]
[ERROR] 
[ERROR] To see the full stack trace of the errors, re-run Maven with the -e switch.
[ERROR] Re-run Maven using the -X switch to enable full debug logging.
[ERROR] 
[ERROR] For more information about the errors and possible solutions, please read the following articles:
[ERROR] [Help 1] http://cwiki.apache.org/confluence/display/MAVEN/MojoFailureException
[ERROR] 
[ERROR] After correcting the problems, you can resume the build with the command
[ERROR]   mvn <goals> -rf :hbase-server
Build step 'Invoke top-level Maven targets' marked build as failure
Performing Post build task...
Match found for :.* : True
Logical operation result is TRUE
Running script  :   ZOMBIE_TESTS_COUNT=`jps | grep surefirebooter | wc -l`
  if [[ $ZOMBIE_TESTS_COUNT != 0 ]] ; then
    #It seems sometimes the tests are not dying immediately. Let's give them 10s
    echo "Suspicious java process found - waiting 10s to see if there are just slow to stop"
    sleep 10   
    ZOMBIE_TESTS_COUNT=`jps | grep surefirebooter | wc -l`
    if [[ $ZOMBIE_TESTS_COUNT != 0 ]] ; then
      echo "There are $ZOMBIE_TESTS_COUNT zombie tests, they should have been killed by surefire but survived"
      echo "************ BEGIN zombies jstack extract"
      ZB_STACK=`jps | grep surefirebooter | cut -d ' ' -f 1 | xargs -n 1 jstack | grep ".test" | grep "\.java"`
      jps | grep surefirebooter | cut -d ' ' -f 1 | xargs -n 1 jstack
      echo "************ END  zombies jstack extract"
      JIRA_COMMENT="$JIRA_COMMENT

     {color:red}-1 core zombie tests{color}.  There are ${ZOMBIE_TESTS_COUNT} zombie test(s): ${ZB_STACK}"
      BAD=1
      jps | grep surefirebooter | cut -d ' ' -f 1 | xargs kill -9
    else
      echo "We're ok: there is no zombie test, but some tests took some time to stop"
    fi
  else
    echo "We're ok: there is no zombie test"
  fi
[HBase-1.0] $ /bin/bash -xe /tmp/hudson6947780676031149786.sh
++ jps
++ grep surefirebooter
++ wc -l
+ ZOMBIE_TESTS_COUNT=0
+ [[ 0 != 0 ]]
+ echo 'We'\''re ok: there is no zombie test'
We're ok: there is no zombie test
POST BUILD TASK : SUCCESS
END OF POST BUILD TASK : 0
Archiving artifacts
Recording test results
Updating HBASE-14501

Build failed in Jenkins: HBase-1.0 #1077

Posted by Apache Jenkins Server <je...@builds.apache.org>.
See <https://builds.apache.org/job/HBase-1.0/1077/changes>

Changes:

[stack] HBASE-14582 Regionserver status webpage bucketcache list can become huge

[matteo.bertozzi] HBASE-14577 HBase shell help for scan and returning a column family has

------------------------------------------
[...truncated 1922 lines...]
Running org.apache.hadoop.hbase.client.TestCloneSnapshotFromClientWithRegionReplicas
Tests run: 5, Failures: 0, Errors: 0, Skipped: 0, Time elapsed: 10.524 sec - in org.apache.hadoop.hbase.client.TestSnapshotFromClientWithRegionReplicas
Running org.apache.hadoop.hbase.client.TestUpdateConfiguration
Tests run: 2, Failures: 0, Errors: 0, Skipped: 0, Time elapsed: 0.181 sec - in org.apache.hadoop.hbase.client.TestUpdateConfiguration
Running org.apache.hadoop.hbase.client.TestPutWithDelete
Tests run: 1, Failures: 0, Errors: 0, Skipped: 0, Time elapsed: 2.177 sec - in org.apache.hadoop.hbase.client.TestPutWithDelete
Tests run: 12, Failures: 0, Errors: 0, Skipped: 0, Time elapsed: 96.095 sec - in org.apache.hadoop.hbase.client.TestReplicasClient
Running org.apache.hadoop.hbase.client.TestClientPushback
Tests run: 1, Failures: 0, Errors: 0, Skipped: 0, Time elapsed: 1.12 sec - in org.apache.hadoop.hbase.client.TestClientPushback
Running org.apache.hadoop.hbase.client.TestFromClientSide3
Running org.apache.hadoop.hbase.client.TestCheckAndMutate
Tests run: 1, Failures: 0, Errors: 0, Skipped: 0, Time elapsed: 1.819 sec - in org.apache.hadoop.hbase.client.TestCheckAndMutate
Running org.apache.hadoop.hbase.client.replication.TestReplicationAdminWithClusters
Tests run: 8, Failures: 0, Errors: 0, Skipped: 0, Time elapsed: 11.885 sec - in org.apache.hadoop.hbase.client.replication.TestReplicationAdminWithClusters
Running org.apache.hadoop.hbase.client.replication.TestReplicationAdmin
Tests run: 5, Failures: 0, Errors: 0, Skipped: 0, Time elapsed: 0.391 sec - in org.apache.hadoop.hbase.client.replication.TestReplicationAdmin
Tests run: 5, Failures: 0, Errors: 0, Skipped: 0, Time elapsed: 80.999 sec - in org.apache.hadoop.hbase.client.TestCloneSnapshotFromClientWithRegionReplicas
Running org.apache.hadoop.hbase.client.TestClientScannerRPCTimeout
Tests run: 9, Failures: 0, Errors: 0, Skipped: 0, Time elapsed: 51.111 sec - in org.apache.hadoop.hbase.client.TestFromClientSide3
Tests run: 82, Failures: 0, Errors: 0, Skipped: 4, Time elapsed: 90.158 sec - in org.apache.hadoop.hbase.client.TestFromClientSide
Running org.apache.hadoop.hbase.client.TestHTablePool$TestHTableThreadLocalPool
Tests run: 9, Failures: 0, Errors: 0, Skipped: 0, Time elapsed: 2.95 sec - in org.apache.hadoop.hbase.client.TestHTablePool$TestHTableThreadLocalPool
Tests run: 1, Failures: 0, Errors: 0, Skipped: 0, Time elapsed: 7.71 sec - in org.apache.hadoop.hbase.client.TestClientScannerRPCTimeout
Running org.apache.hadoop.hbase.client.TestFromClientSideWithCoprocessor
Running org.apache.hadoop.hbase.client.TestAdmin2
Running org.apache.hadoop.hbase.client.TestRpcControllerFactory
Running org.apache.hadoop.hbase.client.TestClientOperationInterrupt
Tests run: 21, Failures: 0, Errors: 0, Skipped: 3, Time elapsed: 145.53 sec - in org.apache.hadoop.hbase.client.TestHCM
Tests run: 1, Failures: 0, Errors: 0, Skipped: 0, Time elapsed: 2.137 sec - in org.apache.hadoop.hbase.client.TestRpcControllerFactory
Running org.apache.hadoop.hbase.client.TestRestoreSnapshotFromClient
Running org.apache.hadoop.hbase.migration.TestNamespaceUpgrade
Tests run: 5, Failures: 0, Errors: 0, Skipped: 0, Time elapsed: 16.75 sec - in org.apache.hadoop.hbase.migration.TestNamespaceUpgrade
Running org.apache.hadoop.hbase.migration.TestUpgradeTo96
Tests run: 5, Failures: 0, Errors: 0, Skipped: 0, Time elapsed: 2.274 sec - in org.apache.hadoop.hbase.migration.TestUpgradeTo96
Running org.apache.hadoop.hbase.master.TestMasterFailoverBalancerPersistence
Tests run: 23, Failures: 0, Errors: 0, Skipped: 0, Time elapsed: 54.815 sec - in org.apache.hadoop.hbase.client.TestAdmin2
Running org.apache.hadoop.hbase.master.TestMasterFailover
Tests run: 1, Failures: 0, Errors: 0, Skipped: 0, Time elapsed: 54.401 sec - in org.apache.hadoop.hbase.client.TestClientOperationInterrupt
Tests run: 1, Failures: 0, Errors: 0, Skipped: 0, Time elapsed: 13.087 sec - in org.apache.hadoop.hbase.master.TestMasterFailoverBalancerPersistence
Running org.apache.hadoop.hbase.master.TestOpenedRegionHandler
Running org.apache.hadoop.hbase.master.TestAssignmentManagerOnCluster
Tests run: 2, Failures: 0, Errors: 0, Skipped: 0, Time elapsed: 13.083 sec - in org.apache.hadoop.hbase.master.TestOpenedRegionHandler
Running org.apache.hadoop.hbase.master.TestMasterShutdown
Tests run: 82, Failures: 0, Errors: 0, Skipped: 4, Time elapsed: 90.572 sec - in org.apache.hadoop.hbase.client.TestFromClientSideWithCoprocessor
Tests run: 2, Failures: 0, Errors: 0, Skipped: 0, Time elapsed: 16.394 sec - in org.apache.hadoop.hbase.master.TestMasterShutdown
Running org.apache.hadoop.hbase.master.TestMasterNoCluster
Running org.apache.hadoop.hbase.master.TestMasterFileSystem
Tests run: 2, Failures: 0, Errors: 0, Skipped: 0, Time elapsed: 0.826 sec - in org.apache.hadoop.hbase.master.TestMasterFileSystem
Tests run: 5, Failures: 0, Errors: 0, Skipped: 0, Time elapsed: 83.892 sec - in org.apache.hadoop.hbase.client.TestRestoreSnapshotFromClient
Running org.apache.hadoop.hbase.master.balancer.TestStochasticLoadBalancer
Running org.apache.hadoop.hbase.master.balancer.TestDefaultLoadBalancer
Tests run: 1, Failures: 0, Errors: 0, Skipped: 0, Time elapsed: 1.836 sec - in org.apache.hadoop.hbase.master.balancer.TestDefaultLoadBalancer
Running org.apache.hadoop.hbase.master.balancer.TestBaseLoadBalancer
Tests run: 21, Failures: 0, Errors: 0, Skipped: 0, Time elapsed: 36.311 sec - in org.apache.hadoop.hbase.master.TestAssignmentManagerOnCluster
Tests run: 7, Failures: 0, Errors: 0, Skipped: 0, Time elapsed: 0.778 sec - in org.apache.hadoop.hbase.master.balancer.TestBaseLoadBalancer
Running org.apache.hadoop.hbase.master.TestActiveMasterManager
Tests run: 3, Failures: 0, Errors: 0, Skipped: 0, Time elapsed: 13.084 sec - in org.apache.hadoop.hbase.master.TestMasterNoCluster
Tests run: 2, Failures: 0, Errors: 0, Skipped: 0, Time elapsed: 1.415 sec - in org.apache.hadoop.hbase.master.TestActiveMasterManager
Running org.apache.hadoop.hbase.master.TestRestartCluster
Running org.apache.hadoop.hbase.master.TestMasterTransitions
Tests run: 3, Failures: 0, Errors: 0, Skipped: 3, Time elapsed: 0.002 sec - in org.apache.hadoop.hbase.master.TestMasterTransitions
Running org.apache.hadoop.hbase.master.TestTableLockManager
Running org.apache.hadoop.hbase.master.TestRegionPlacement2
Tests run: 2, Failures: 0, Errors: 0, Skipped: 0, Time elapsed: 2.192 sec - in org.apache.hadoop.hbase.master.TestRegionPlacement2
Tests run: 7, Failures: 0, Errors: 0, Skipped: 0, Time elapsed: 70.28 sec - in org.apache.hadoop.hbase.master.TestMasterFailover
Running org.apache.hadoop.hbase.master.handler.TestTableDescriptorModification
Tests run: 3, Failures: 0, Errors: 0, Skipped: 0, Time elapsed: 4.056 sec - in org.apache.hadoop.hbase.master.handler.TestTableDescriptorModification
Running org.apache.hadoop.hbase.master.handler.TestEnableTableHandler
Running org.apache.hadoop.hbase.master.handler.TestTableDeleteFamilyHandler
Tests run: 1, Failures: 0, Errors: 0, Skipped: 0, Time elapsed: 1.152 sec - in org.apache.hadoop.hbase.master.handler.TestTableDeleteFamilyHandler
Running org.apache.hadoop.hbase.master.handler.TestCreateTableHandler
Tests run: 3, Failures: 0, Errors: 0, Skipped: 0, Time elapsed: 36.429 sec - in org.apache.hadoop.hbase.master.TestRestartCluster
Running org.apache.hadoop.hbase.master.handler.TestCreateTableHandler2
Tests run: 1, Failures: 0, Errors: 0, Skipped: 0, Time elapsed: 10.649 sec - in org.apache.hadoop.hbase.master.handler.TestCreateTableHandler2
Running org.apache.hadoop.hbase.master.TestGetLastFlushedSequenceId
Tests run: 3, Failures: 0, Errors: 0, Skipped: 0, Time elapsed: 26.201 sec - in org.apache.hadoop.hbase.master.handler.TestEnableTableHandler
Running org.apache.hadoop.hbase.master.TestRollingRestart
Tests run: 3, Failures: 0, Errors: 0, Skipped: 0, Time elapsed: 27.051 sec - in org.apache.hadoop.hbase.master.handler.TestCreateTableHandler
Running org.apache.hadoop.hbase.master.TestHMasterRPCException
Tests run: 1, Failures: 0, Errors: 0, Skipped: 0, Time elapsed: 3.03 sec - in org.apache.hadoop.hbase.master.TestHMasterRPCException
Tests run: 1, Failures: 0, Errors: 0, Skipped: 0, Time elapsed: 15.606 sec - in org.apache.hadoop.hbase.master.TestGetLastFlushedSequenceId
Running org.apache.hadoop.hbase.master.TestSplitLogManager
Tests run: 1, Failures: 0, Errors: 0, Skipped: 0, Time elapsed: 20.372 sec - in org.apache.hadoop.hbase.master.TestRollingRestart
Running org.apache.hadoop.hbase.master.TestClusterStatusPublisher
Running org.apache.hadoop.hbase.master.TestMaster
Tests run: 3, Failures: 0, Errors: 0, Skipped: 0, Time elapsed: 0.572 sec - in org.apache.hadoop.hbase.master.TestClusterStatusPublisher
Running org.apache.hadoop.hbase.master.TestGetInfoPort
Tests run: 4, Failures: 0, Errors: 0, Skipped: 0, Time elapsed: 6.535 sec - in org.apache.hadoop.hbase.master.TestMaster
Tests run: 5, Failures: 0, Errors: 0, Skipped: 0, Time elapsed: 80.33 sec - in org.apache.hadoop.hbase.master.TestTableLockManager
Running org.apache.hadoop.hbase.master.TestDeadServer
Tests run: 3, Failures: 0, Errors: 0, Skipped: 0, Time elapsed: 0.309 sec - in org.apache.hadoop.hbase.master.TestDeadServer
Running org.apache.hadoop.hbase.master.TestAssignmentManager
Tests run: 1, Failures: 0, Errors: 0, Skipped: 0, Time elapsed: 8.78 sec - in org.apache.hadoop.hbase.master.TestGetInfoPort
Running org.apache.hadoop.hbase.master.TestMasterStatusServlet
Tests run: 20, Failures: 0, Errors: 0, Skipped: 0, Time elapsed: 4.358 sec - in org.apache.hadoop.hbase.master.TestAssignmentManager
Tests run: 4, Failures: 0, Errors: 0, Skipped: 0, Time elapsed: 1.672 sec - in org.apache.hadoop.hbase.master.TestMasterStatusServlet
Running org.apache.hadoop.hbase.master.TestZKBasedOpenCloseRegion
Running org.apache.hadoop.hbase.master.cleaner.TestHFileCleaner
Tests run: 3, Failures: 0, Errors: 0, Skipped: 0, Time elapsed: 0.951 sec - in org.apache.hadoop.hbase.master.cleaner.TestHFileCleaner
Tests run: 3, Failures: 0, Errors: 0, Skipped: 0, Time elapsed: 2.783 sec - in org.apache.hadoop.hbase.master.TestZKBasedOpenCloseRegion
Running org.apache.hadoop.hbase.master.cleaner.TestLogsCleaner
Running org.apache.hadoop.hbase.master.cleaner.TestSnapshotFromMaster
Running org.apache.hadoop.hbase.master.TestZKLessAMOnCluster
Tests run: 1, Failures: 0, Errors: 0, Skipped: 0, Time elapsed: 11.196 sec - in org.apache.hadoop.hbase.master.cleaner.TestLogsCleaner
Tests run: 4, Failures: 0, Errors: 0, Skipped: 0, Time elapsed: 10.6 sec - in org.apache.hadoop.hbase.master.cleaner.TestSnapshotFromMaster
Running org.apache.hadoop.hbase.master.TestDistributedLogSplitting
Running org.apache.hadoop.hbase.master.TestMasterMetrics
Tests run: 2, Failures: 0, Errors: 0, Skipped: 0, Time elapsed: 1.494 sec - in org.apache.hadoop.hbase.master.TestMasterMetrics
Running org.apache.hadoop.hbase.master.TestMasterOperationsForRegionReplicas
Tests run: 21, Failures: 0, Errors: 0, Skipped: 0, Time elapsed: 31.323 sec - in org.apache.hadoop.hbase.master.TestZKLessAMOnCluster
Running org.apache.hadoop.hbase.master.TestMasterRestartAfterDisablingTable
Tests run: 2, Failures: 0, Errors: 0, Skipped: 0, Time elapsed: 13.577 sec - in org.apache.hadoop.hbase.master.TestMasterOperationsForRegionReplicas
Tests run: 1, Failures: 0, Errors: 0, Skipped: 0, Time elapsed: 13.009 sec - in org.apache.hadoop.hbase.master.TestMasterRestartAfterDisablingTable
Running org.apache.hadoop.hbase.master.TestRegionPlacement
Running org.apache.hadoop.hbase.master.TestAssignmentListener
Tests run: 2, Failures: 0, Errors: 0, Skipped: 0, Time elapsed: 5.81 sec - in org.apache.hadoop.hbase.master.TestAssignmentListener
Tests run: 2, Failures: 0, Errors: 0, Skipped: 0, Time elapsed: 17.411 sec - in org.apache.hadoop.hbase.master.TestRegionPlacement
Running org.apache.hadoop.hbase.master.TestMasterMetricsWrapper
Tests run: 1, Failures: 0, Errors: 0, Skipped: 0, Time elapsed: 2.13 sec - in org.apache.hadoop.hbase.master.TestMasterMetricsWrapper
Running org.apache.hadoop.hbase.master.snapshot.TestSnapshotFileCache
Tests run: 15, Failures: 0, Errors: 0, Skipped: 0, Time elapsed: 133.912 sec - in org.apache.hadoop.hbase.master.TestSplitLogManager
Running org.apache.hadoop.hbase.snapshot.TestSnapshotClientRetries
Running org.apache.hadoop.hbase.snapshot.TestExportSnapshot
Tests run: 5, Failures: 0, Errors: 0, Skipped: 0, Time elapsed: 29.245 sec - in org.apache.hadoop.hbase.master.snapshot.TestSnapshotFileCache
Running org.apache.hadoop.hbase.snapshot.TestFlushSnapshotFromClient
Tests run: 2, Failures: 0, Errors: 0, Skipped: 0, Time elapsed: 18.367 sec - in org.apache.hadoop.hbase.snapshot.TestSnapshotClientRetries
Running org.apache.hadoop.hbase.snapshot.TestSnapshotDescriptionUtils
Tests run: 2, Failures: 0, Errors: 0, Skipped: 0, Time elapsed: 0.173 sec - in org.apache.hadoop.hbase.snapshot.TestSnapshotDescriptionUtils
Running org.apache.hadoop.hbase.snapshot.TestRestoreFlushSnapshotFromClient
Tests run: 9, Failures: 0, Errors: 0, Skipped: 0, Time elapsed: 38.837 sec - in org.apache.hadoop.hbase.snapshot.TestFlushSnapshotFromClient
Tests run: 18, Failures: 0, Errors: 1, Skipped: 0, Time elapsed: 147.966 sec <<< FAILURE! - in org.apache.hadoop.hbase.master.TestDistributedLogSplitting
testLogReplayWithMetaRSDown(org.apache.hadoop.hbase.master.TestDistributedLogSplitting)  Time elapsed: 9.287 sec  <<< ERROR!
java.lang.RuntimeException: java.lang.OutOfMemoryError: unable to create new native thread
	at java.lang.Thread.start0(Native Method)
	at java.lang.Thread.start(Thread.java:693)
	at java.util.concurrent.ThreadPoolExecutor.addWorker(ThreadPoolExecutor.java:949)
	at java.util.concurrent.ThreadPoolExecutor.execute(ThreadPoolExecutor.java:1360)
	at org.apache.hadoop.hbase.util.BoundedCompletionService.submit(BoundedCompletionService.java:69)
	at org.apache.hadoop.hbase.client.ScannerCallableWithReplicas.addCallsForCurrentReplica(ScannerCallableWithReplicas.java:266)
	at org.apache.hadoop.hbase.client.ScannerCallableWithReplicas.call(ScannerCallableWithReplicas.java:161)
	at org.apache.hadoop.hbase.client.ScannerCallableWithReplicas.call(ScannerCallableWithReplicas.java:56)
	at org.apache.hadoop.hbase.client.RpcRetryingCaller.callWithoutRetries(RpcRetryingCaller.java:200)
	at org.apache.hadoop.hbase.client.ClientScanner.call(ClientScanner.java:299)
	at org.apache.hadoop.hbase.client.ClientScanner.nextScanner(ClientScanner.java:278)
	at org.apache.hadoop.hbase.client.ClientScanner.possiblyNextScanner(ClientScanner.java:224)
	at org.apache.hadoop.hbase.client.ClientScanner.loadCache(ClientScanner.java:511)
	at org.apache.hadoop.hbase.client.ClientScanner.next(ClientScanner.java:343)
	at org.apache.hadoop.hbase.client.AbstractClientScanner$1.hasNext(AbstractClientScanner.java:94)
	at org.apache.hadoop.hbase.HBaseTestingUtility.countRows(HBaseTestingUtility.java:2154)
	at org.apache.hadoop.hbase.master.TestDistributedLogSplitting.abortRSAndVerifyRecovery(TestDistributedLogSplitting.java:414)
	at org.apache.hadoop.hbase.master.TestDistributedLogSplitting.testLogReplayWithMetaRSDown(TestDistributedLogSplitting.java:405)

Tests run: 5, Failures: 0, Errors: 0, Skipped: 0, Time elapsed: 49.99 sec - in org.apache.hadoop.hbase.snapshot.TestRestoreFlushSnapshotFromClient
Running org.apache.hadoop.hbase.snapshot.TestSecureExportSnapshot
Tests run: 9, Failures: 0, Errors: 0, Skipped: 0, Time elapsed: 286.014 sec - in org.apache.hadoop.hbase.snapshot.TestExportSnapshot
Tests run: 9, Failures: 0, Errors: 0, Skipped: 0, Time elapsed: 277.707 sec - in org.apache.hadoop.hbase.snapshot.TestSecureExportSnapshot
Tests run: 23, Failures: 0, Errors: 0, Skipped: 0, Time elapsed: 572.328 sec - in org.apache.hadoop.hbase.master.balancer.TestStochasticLoadBalancer

Results :


Tests in error: 
  TestDistributedLogSplitting.testLogReplayWithMetaRSDown:405->abortRSAndVerifyRecovery:414 » Runtime


Tests run: 2240, Failures: 0, Errors: 1, Skipped: 18

[INFO] ------------------------------------------------------------------------
[INFO] Reactor Summary:
[INFO] 
[INFO] Apache HBase ...................................... SUCCESS [4.214s]
[INFO] Apache HBase - Checkstyle ......................... SUCCESS [0.868s]
[INFO] Apache HBase - Resource Bundle .................... SUCCESS [0.184s]
[INFO] Apache HBase - Annotations ........................ SUCCESS [0.953s]
[INFO] Apache HBase - Common ............................. SUCCESS [58.500s]
[INFO] Apache HBase - Protocol ........................... SUCCESS [9.308s]
[INFO] Apache HBase - Client ............................. SUCCESS [1:22.764s]
[INFO] Apache HBase - Hadoop Compatibility ............... SUCCESS [7.871s]
[INFO] Apache HBase - Hadoop Two Compatibility ........... SUCCESS [7.510s]
[INFO] Apache HBase - Prefix Tree ........................ SUCCESS [8.828s]
[INFO] Apache HBase - Server ............................. FAILURE [1:10:22.151s]
[INFO] Apache HBase - Testing Util ....................... SKIPPED
[INFO] Apache HBase - Thrift ............................. SKIPPED
[INFO] Apache HBase - Rest ............................... SKIPPED
[INFO] Apache HBase - Shell .............................. SKIPPED
[INFO] Apache HBase - Integration Tests .................. SKIPPED
[INFO] Apache HBase - Examples ........................... SKIPPED
[INFO] Apache HBase - Assembly ........................... SKIPPED
[INFO] ------------------------------------------------------------------------
[INFO] BUILD FAILURE
[INFO] ------------------------------------------------------------------------
[INFO] Total time: 1:13:24.808s
[INFO] Finished at: Mon Oct 12 22:14:41 UTC 2015
[INFO] Final Memory: 46M/461M
[INFO] ------------------------------------------------------------------------
[ERROR] Failed to execute goal org.apache.maven.plugins:maven-surefire-plugin:2.18:test (secondPartTestsExecution) on project hbase-server: There are test failures.
[ERROR] 
[ERROR] Please refer to <https://builds.apache.org/job/HBase-1.0/ws/hbase-server/target/surefire-reports> for the individual test results.
[ERROR] -> [Help 1]
[ERROR] 
[ERROR] To see the full stack trace of the errors, re-run Maven with the -e switch.
[ERROR] Re-run Maven using the -X switch to enable full debug logging.
[ERROR] 
[ERROR] For more information about the errors and possible solutions, please read the following articles:
[ERROR] [Help 1] http://cwiki.apache.org/confluence/display/MAVEN/MojoFailureException
[ERROR] 
[ERROR] After correcting the problems, you can resume the build with the command
[ERROR]   mvn <goals> -rf :hbase-server
Build step 'Invoke top-level Maven targets' marked build as failure
Performing Post build task...
Match found for :.* : True
Logical operation result is TRUE
Running script  :   ZOMBIE_TESTS_COUNT=`jps | grep surefirebooter | wc -l`
  if [[ $ZOMBIE_TESTS_COUNT != 0 ]] ; then
    #It seems sometimes the tests are not dying immediately. Let's give them 10s
    echo "Suspicious java process found - waiting 10s to see if there are just slow to stop"
    sleep 10   
    ZOMBIE_TESTS_COUNT=`jps | grep surefirebooter | wc -l`
    if [[ $ZOMBIE_TESTS_COUNT != 0 ]] ; then
      echo "There are $ZOMBIE_TESTS_COUNT zombie tests, they should have been killed by surefire but survived"
      echo "************ BEGIN zombies jstack extract"
      ZB_STACK=`jps | grep surefirebooter | cut -d ' ' -f 1 | xargs -n 1 jstack | grep ".test" | grep "\.java"`
      jps | grep surefirebooter | cut -d ' ' -f 1 | xargs -n 1 jstack
      echo "************ END  zombies jstack extract"
      JIRA_COMMENT="$JIRA_COMMENT

     {color:red}-1 core zombie tests{color}.  There are ${ZOMBIE_TESTS_COUNT} zombie test(s): ${ZB_STACK}"
      BAD=1
      jps | grep surefirebooter | cut -d ' ' -f 1 | xargs kill -9
    else
      echo "We're ok: there is no zombie test, but some tests took some time to stop"
    fi
  else
    echo "We're ok: there is no zombie test"
  fi
[HBase-1.0] $ /bin/bash -xe /tmp/hudson7960730566373156564.sh
++ jps
++ grep surefirebooter
++ wc -l
+ ZOMBIE_TESTS_COUNT=0
+ [[ 0 != 0 ]]
+ echo 'We'\''re ok: there is no zombie test'
We're ok: there is no zombie test
POST BUILD TASK : SUCCESS
END OF POST BUILD TASK : 0
Archiving artifacts
Recording test results
Updating HBASE-14582
Updating HBASE-14577

Build failed in Jenkins: HBase-1.0 #1076

Posted by Apache Jenkins Server <je...@builds.apache.org>.
See <https://builds.apache.org/job/HBase-1.0/1076/changes>

Changes:

[tedyu] HBASE-14578 URISyntaxException during snapshot restore for table with

------------------------------------------
[...truncated 4787 lines...]
	- parking to wait for  <0x48a1ba60> (a java.util.concurrent.locks.AbstractQueuedSynchronizer$ConditionObject)
	at java.util.concurrent.locks.LockSupport.park(LockSupport.java:186)
	at java.util.concurrent.locks.AbstractQueuedSynchronizer$ConditionObject.await(AbstractQueuedSynchronizer.java:2043)
	at java.util.concurrent.LinkedBlockingQueue.take(LinkedBlockingQueue.java:442)
	at org.apache.hadoop.ipc.Server$Handler.run(Server.java:1408)

"IPC Server handler 1 on 42351" daemon prio=10 tid=0x275c3c00 nid=0x3dce waiting on condition [0x2835c000]
   java.lang.Thread.State: WAITING (parking)
	at sun.misc.Unsafe.park(Native Method)
	- parking to wait for  <0x48a1ba60> (a java.util.concurrent.locks.AbstractQueuedSynchronizer$ConditionObject)
	at java.util.concurrent.locks.LockSupport.park(LockSupport.java:186)
	at java.util.concurrent.locks.AbstractQueuedSynchronizer$ConditionObject.await(AbstractQueuedSynchronizer.java:2043)
	at java.util.concurrent.LinkedBlockingQueue.take(LinkedBlockingQueue.java:442)
	at org.apache.hadoop.ipc.Server$Handler.run(Server.java:1408)

"IPC Server handler 0 on 42351" daemon prio=10 tid=0x275c2400 nid=0x3dcd waiting on condition [0x283ad000]
   java.lang.Thread.State: WAITING (parking)
	at sun.misc.Unsafe.park(Native Method)
	- parking to wait for  <0x48a1ba60> (a java.util.concurrent.locks.AbstractQueuedSynchronizer$ConditionObject)
	at java.util.concurrent.locks.LockSupport.park(LockSupport.java:186)
	at java.util.concurrent.locks.AbstractQueuedSynchronizer$ConditionObject.await(AbstractQueuedSynchronizer.java:2043)
	at java.util.concurrent.LinkedBlockingQueue.take(LinkedBlockingQueue.java:442)
	at org.apache.hadoop.ipc.Server$Handler.run(Server.java:1408)

"IPC Server listener on 42351" daemon prio=10 tid=0x275b5800 nid=0x3dcc runnable [0x283fe000]
   java.lang.Thread.State: RUNNABLE
	at sun.nio.ch.EPollArrayWrapper.epollWait(Native Method)
	at sun.nio.ch.EPollArrayWrapper.poll(EPollArrayWrapper.java:228)
	at sun.nio.ch.EPollSelectorImpl.doSelect(EPollSelectorImpl.java:81)
	at sun.nio.ch.SelectorImpl.lockAndDoSelect(SelectorImpl.java:87)
	- locked <0x48a32ee0> (a sun.nio.ch.Util$2)
	- locked <0x48a32ed0> (a java.util.Collections$UnmodifiableSet)
	- locked <0x48a32a90> (a sun.nio.ch.EPollSelectorImpl)
	at sun.nio.ch.SelectorImpl.select(SelectorImpl.java:98)
	at sun.nio.ch.SelectorImpl.select(SelectorImpl.java:102)
	at org.apache.hadoop.ipc.Server$Listener.run(Server.java:479)

"IPC Server Responder" daemon prio=10 tid=0x275c5800 nid=0x3dcb runnable [0x2855c000]
   java.lang.Thread.State: RUNNABLE
	at sun.nio.ch.EPollArrayWrapper.epollWait(Native Method)
	at sun.nio.ch.EPollArrayWrapper.poll(EPollArrayWrapper.java:228)
	at sun.nio.ch.EPollSelectorImpl.doSelect(EPollSelectorImpl.java:81)
	at sun.nio.ch.SelectorImpl.lockAndDoSelect(SelectorImpl.java:87)
	- locked <0x48a38a28> (a sun.nio.ch.Util$2)
	- locked <0x48a38a18> (a java.util.Collections$UnmodifiableSet)
	- locked <0x48a38818> (a sun.nio.ch.EPollSelectorImpl)
	at sun.nio.ch.SelectorImpl.select(SelectorImpl.java:98)
	at org.apache.hadoop.ipc.Server$Responder.run(Server.java:645)

"Timer-0" daemon prio=10 tid=0x275ab800 nid=0x3dca in Object.wait() [0x285ad000]
   java.lang.Thread.State: TIMED_WAITING (on object monitor)
	at java.lang.Object.wait(Native Method)
	- waiting on <0x48a760f0> (a java.util.TaskQueue)
	at java.util.TimerThread.mainLoop(Timer.java:552)
	- locked <0x48a760f0> (a java.util.TaskQueue)
	at java.util.TimerThread.run(Timer.java:505)

"30479658@qtp-31146248-1 - Acceptor0 SelectChannelConnector@localhost:58756" prio=10 tid=0x27588c00 nid=0x3dc8 runnable [0x285fe000]
   java.lang.Thread.State: RUNNABLE
	at sun.nio.ch.EPollArrayWrapper.epollWait(Native Method)
	at sun.nio.ch.EPollArrayWrapper.poll(EPollArrayWrapper.java:228)
	at sun.nio.ch.EPollSelectorImpl.doSelect(EPollSelectorImpl.java:81)
	at sun.nio.ch.SelectorImpl.lockAndDoSelect(SelectorImpl.java:87)
	- locked <0x48a3c6f8> (a sun.nio.ch.Util$2)
	- locked <0x48a3c6e8> (a java.util.Collections$UnmodifiableSet)
	- locked <0x48a39328> (a sun.nio.ch.EPollSelectorImpl)
	at sun.nio.ch.SelectorImpl.select(SelectorImpl.java:98)
	at org.mortbay.io.nio.SelectorManager$SelectSet.doSelect(SelectorManager.java:498)
	at org.mortbay.io.nio.SelectorManager.doSelect(SelectorManager.java:192)
	at org.mortbay.jetty.nio.SelectChannelConnector.accept(SelectChannelConnector.java:124)
	at org.mortbay.jetty.AbstractConnector$Acceptor.run(AbstractConnector.java:708)
	at org.mortbay.thread.QueuedThreadPool$PoolThread.run(QueuedThreadPool.java:582)

"10767070@qtp-31146248-0" prio=10 tid=0x2758c400 nid=0x3dc7 in Object.wait() [0x28963000]
   java.lang.Thread.State: TIMED_WAITING (on object monitor)
	at java.lang.Object.wait(Native Method)
	- waiting on <0x48a38ec0> (a org.mortbay.thread.QueuedThreadPool$PoolThread)
	at org.mortbay.thread.QueuedThreadPool$PoolThread.run(QueuedThreadPool.java:626)
	- locked <0x48a38ec0> (a org.mortbay.thread.QueuedThreadPool$PoolThread)

"pool-1-thread-1" prio=10 tid=0x27fec800 nid=0x3dc6 runnable [0x2957d000]
   java.lang.Thread.State: RUNNABLE
	at sun.nio.ch.EPollArrayWrapper.epollWait(Native Method)
	at sun.nio.ch.EPollArrayWrapper.poll(EPollArrayWrapper.java:228)
	at sun.nio.ch.EPollSelectorImpl.doSelect(EPollSelectorImpl.java:81)
	at sun.nio.ch.SelectorImpl.lockAndDoSelect(SelectorImpl.java:87)
	- locked <0x48a31160> (a sun.nio.ch.Util$2)
	- locked <0x48a31150> (a java.util.Collections$UnmodifiableSet)
	- locked <0x48a308e8> (a sun.nio.ch.EPollSelectorImpl)
	at sun.nio.ch.SelectorImpl.select(SelectorImpl.java:98)
	at sun.nio.ch.SelectorImpl.select(SelectorImpl.java:102)
	at org.apache.hadoop.ipc.Server$Listener$Reader.run(Server.java:373)
	- locked <0x48a330b0> (a org.apache.hadoop.ipc.Server$Listener$Reader)
	at java.util.concurrent.ThreadPoolExecutor.runWorker(ThreadPoolExecutor.java:1145)
	at java.util.concurrent.ThreadPoolExecutor$Worker.run(ThreadPoolExecutor.java:615)
	at java.lang.Thread.run(Thread.java:724)

"org.apache.hadoop.hdfs.server.namenode.DecommissionManager$Monitor@347ccf" daemon prio=10 tid=0x27fbc800 nid=0x3dc5 waiting on condition [0x2977d000]
   java.lang.Thread.State: TIMED_WAITING (sleeping)
	at java.lang.Thread.sleep(Native Method)
	at org.apache.hadoop.hdfs.server.namenode.DecommissionManager$Monitor.run(DecommissionManager.java:65)
	at java.lang.Thread.run(Thread.java:724)

"org.apache.hadoop.hdfs.server.namenode.FSNamesystem$ReplicationMonitor@80188f" daemon prio=10 tid=0x27fbb800 nid=0x3dc4 waiting on condition [0x2997d000]
   java.lang.Thread.State: TIMED_WAITING (sleeping)
	at java.lang.Thread.sleep(Native Method)
	at org.apache.hadoop.hdfs.server.namenode.FSNamesystem$ReplicationMonitor.run(FSNamesystem.java:3167)
	at java.lang.Thread.run(Thread.java:724)

"org.apache.hadoop.hdfs.server.namenode.LeaseManager$Monitor@68a622" daemon prio=10 tid=0x27fbac00 nid=0x3dc3 waiting on condition [0x2a368000]
   java.lang.Thread.State: TIMED_WAITING (sleeping)
	at java.lang.Thread.sleep(Native Method)
	at org.apache.hadoop.hdfs.server.namenode.LeaseManager$Monitor.run(LeaseManager.java:368)
	at java.lang.Thread.run(Thread.java:724)

"org.apache.hadoop.hdfs.server.namenode.FSNamesystem$HeartbeatMonitor@6237a0" daemon prio=10 tid=0x27fb9400 nid=0x3dc2 waiting on condition [0x3247d000]
   java.lang.Thread.State: TIMED_WAITING (sleeping)
	at java.lang.Thread.sleep(Native Method)
	at org.apache.hadoop.hdfs.server.namenode.FSNamesystem$HeartbeatMonitor.run(FSNamesystem.java:3146)
	at java.lang.Thread.run(Thread.java:724)

"org.apache.hadoop.hdfs.server.namenode.PendingReplicationBlocks$PendingReplicationMonitor@18186ab" daemon prio=10 tid=0x27fb6400 nid=0x3dc1 waiting on condition [0x32660000]
   java.lang.Thread.State: TIMED_WAITING (sleeping)
	at java.lang.Thread.sleep(Native Method)
	at org.apache.hadoop.hdfs.server.namenode.PendingReplicationBlocks$PendingReplicationMonitor.run(PendingReplicationBlocks.java:197)
	at java.lang.Thread.run(Thread.java:724)

"Service Thread" daemon prio=10 tid=0x2a1f7c00 nid=0x3dbc runnable [0x00000000]
   java.lang.Thread.State: RUNNABLE

"C2 CompilerThread1" daemon prio=10 tid=0x2a1f5c00 nid=0x3dbb waiting on condition [0x00000000]
   java.lang.Thread.State: RUNNABLE

"C2 CompilerThread0" daemon prio=10 tid=0x2a1f3c00 nid=0x3dba waiting on condition [0x00000000]
   java.lang.Thread.State: RUNNABLE

"Signal Dispatcher" daemon prio=10 tid=0x2a1f2400 nid=0x3db9 runnable [0x00000000]
   java.lang.Thread.State: RUNNABLE

"Finalizer" daemon prio=10 tid=0x2a1b7000 nid=0x3db8 in Object.wait() [0x3367d000]
   java.lang.Thread.State: WAITING (on object monitor)
	at java.lang.Object.wait(Native Method)
	- waiting on <0x48cb3b98> (a java.lang.ref.ReferenceQueue$Lock)
	at java.lang.ref.ReferenceQueue.remove(ReferenceQueue.java:135)
	- locked <0x48cb3b98> (a java.lang.ref.ReferenceQueue$Lock)
	at java.lang.ref.ReferenceQueue.remove(ReferenceQueue.java:151)
	at java.lang.ref.Finalizer$FinalizerThread.run(Finalizer.java:189)

"Reference Handler" daemon prio=10 tid=0x2a1b5400 nid=0x3db7 in Object.wait() [0x3397d000]
   java.lang.Thread.State: WAITING (on object monitor)
	at java.lang.Object.wait(Native Method)
	- waiting on <0x48cbe038> (a java.lang.ref.Reference$Lock)
	at java.lang.Object.wait(Object.java:503)
	at java.lang.ref.Reference$ReferenceHandler.run(Reference.java:133)
	- locked <0x48cbe038> (a java.lang.ref.Reference$Lock)

"main" prio=10 tid=0xf6706800 nid=0x3da8 waiting on condition [0xf6933000]
   java.lang.Thread.State: TIMED_WAITING (sleeping)
	at java.lang.Thread.sleep(Native Method)
	at org.apache.hadoop.mapred.JobClient$NetworkedJob.waitForCompletion(JobClient.java:341)
	at org.apache.hadoop.mapreduce.Job.waitForCompletion(Job.java:585)
	at org.apache.hadoop.hbase.mapreduce.TestImportExport.runExport(TestImportExport.java:133)
	at org.apache.hadoop.hbase.mapreduce.TestImportExport.testWithMultipleDeleteFamilyMarkersOfSameRowSameFamily(TestImportExport.java:378)
	at sun.reflect.NativeMethodAccessorImpl.invoke0(Native Method)
	at sun.reflect.NativeMethodAccessorImpl.invoke(NativeMethodAccessorImpl.java:57)
	at sun.reflect.DelegatingMethodAccessorImpl.invoke(DelegatingMethodAccessorImpl.java:43)
	at java.lang.reflect.Method.invoke(Method.java:606)
	at org.junit.runners.model.FrameworkMethod$1.runReflectiveCall(FrameworkMethod.java:47)
	at org.junit.internal.runners.model.ReflectiveCallable.run(ReflectiveCallable.java:12)
	at org.junit.runners.model.FrameworkMethod.invokeExplosively(FrameworkMethod.java:44)
	at org.junit.internal.runners.statements.InvokeMethod.evaluate(InvokeMethod.java:17)
	at org.junit.internal.runners.statements.RunBefores.evaluate(RunBefores.java:26)
	at org.junit.internal.runners.statements.RunAfters.evaluate(RunAfters.java:27)
	at org.junit.runners.ParentRunner.runLeaf(ParentRunner.java:271)
	at org.junit.runners.BlockJUnit4ClassRunner.runChild(BlockJUnit4ClassRunner.java:70)
	at org.junit.runners.BlockJUnit4ClassRunner.runChild(BlockJUnit4ClassRunner.java:50)
	at org.junit.runners.ParentRunner$3.run(ParentRunner.java:238)
	at org.junit.runners.ParentRunner$1.schedule(ParentRunner.java:63)
	at org.junit.runners.ParentRunner.runChildren(ParentRunner.java:236)
	at org.junit.runners.ParentRunner.access$000(ParentRunner.java:53)
	at org.junit.runners.ParentRunner$2.evaluate(ParentRunner.java:229)
	at org.junit.internal.runners.statements.RunBefores.evaluate(RunBefores.java:26)
	at org.junit.internal.runners.statements.RunAfters.evaluate(RunAfters.java:27)
	at org.junit.runners.ParentRunner.run(ParentRunner.java:309)
	at org.junit.runners.Suite.runChild(Suite.java:127)
	at org.junit.runners.Suite.runChild(Suite.java:26)
	at org.junit.runners.ParentRunner$3.run(ParentRunner.java:238)
	at org.junit.runners.ParentRunner$1.schedule(ParentRunner.java:63)
	at org.junit.runners.ParentRunner.runChildren(ParentRunner.java:236)
	at org.junit.runners.ParentRunner.access$000(ParentRunner.java:53)
	at org.junit.runners.ParentRunner$2.evaluate(ParentRunner.java:229)
	at org.junit.runners.ParentRunner.run(ParentRunner.java:309)
	at org.junit.runner.JUnitCore.run(JUnitCore.java:160)
	at org.junit.runner.JUnitCore.run(JUnitCore.java:138)
	at org.apache.maven.surefire.junitcore.JUnitCoreWrapper.createRequestAndRun(JUnitCoreWrapper.java:108)
	at org.apache.maven.surefire.junitcore.JUnitCoreWrapper.executeEager(JUnitCoreWrapper.java:78)
	at org.apache.maven.surefire.junitcore.JUnitCoreWrapper.execute(JUnitCoreWrapper.java:54)
	at org.apache.maven.surefire.junitcore.JUnitCoreProvider.invoke(JUnitCoreProvider.java:144)
	at org.apache.maven.surefire.booter.ForkedBooter.invokeProviderInSameClassLoader(ForkedBooter.java:203)
	at org.apache.maven.surefire.booter.ForkedBooter.runSuitesInProcess(ForkedBooter.java:155)
	at org.apache.maven.surefire.booter.ForkedBooter.main(ForkedBooter.java:103)

"VM Thread" prio=10 tid=0x2a0f8c00 nid=0x3db6 runnable 

"GC task thread#0 (ParallelGC)" prio=10 tid=0xf6710c00 nid=0x3da9 runnable 

"GC task thread#1 (ParallelGC)" prio=10 tid=0xf6712000 nid=0x3daa runnable 

"GC task thread#2 (ParallelGC)" prio=10 tid=0xf6713800 nid=0x3dab runnable 

"GC task thread#3 (ParallelGC)" prio=10 tid=0xf6715000 nid=0x3dac runnable 

"GC task thread#4 (ParallelGC)" prio=10 tid=0xf6716400 nid=0x3dad runnable 

"GC task thread#5 (ParallelGC)" prio=10 tid=0xf6717c00 nid=0x3dae runnable 

"GC task thread#6 (ParallelGC)" prio=10 tid=0xf6719400 nid=0x3daf runnable 

"GC task thread#7 (ParallelGC)" prio=10 tid=0xf671a800 nid=0x3db0 runnable 

"GC task thread#8 (ParallelGC)" prio=10 tid=0xf671c000 nid=0x3db1 runnable 

"GC task thread#9 (ParallelGC)" prio=10 tid=0xf671d800 nid=0x3db2 runnable 

"GC task thread#10 (ParallelGC)" prio=10 tid=0xf671ec00 nid=0x3db3 runnable 

"GC task thread#11 (ParallelGC)" prio=10 tid=0xf6720400 nid=0x3db4 runnable 

"GC task thread#12 (ParallelGC)" prio=10 tid=0xf6721c00 nid=0x3db5 runnable 

"VM Periodic Task Thread" prio=10 tid=0x2a1f9c00 nid=0x3dbd waiting on condition 

JNI global references: 241

+ echo '************ END  zombies jstack extract'
************ END  zombies jstack extract
+ JIRA_COMMENT='

     {color:red}-1 core zombie tests{color}.  There are 1 zombie test(s): 	at org.apache.hadoop.hbase.mapreduce.TestImportExport.testWithMultipleDeleteFamilyMarkersOfSameRowSameFamily(TestImportExport.java:378)'
+ BAD=1
+ jps
+ grep surefirebooter
+ cut -d ' ' -f 1
+ xargs kill -9
POST BUILD TASK : SUCCESS
END OF POST BUILD TASK : 0
Archiving artifacts
Recording test results
Updating HBASE-14578

Build failed in Jenkins: HBase-1.0 #1075

Posted by Apache Jenkins Server <je...@builds.apache.org>.
See <https://builds.apache.org/job/HBase-1.0/1075/changes>

Changes:

[apurtell] HBASE-14581 Znode cleanup throws auth exception in secure mode

------------------------------------------
[...truncated 1907 lines...]
Tests run: 3, Failures: 0, Errors: 0, Skipped: 0, Time elapsed: 5.806 sec - in org.apache.hadoop.hbase.client.TestTimestampsFilter
Tests run: 4, Failures: 0, Errors: 0, Skipped: 0, Time elapsed: 12.546 sec - in org.apache.hadoop.hbase.client.TestSnapshotMetadata
Running org.apache.hadoop.hbase.client.TestUpdateConfiguration
Tests run: 2, Failures: 0, Errors: 0, Skipped: 0, Time elapsed: 0.211 sec - in org.apache.hadoop.hbase.client.TestUpdateConfiguration
Running org.apache.hadoop.hbase.client.TestHTablePool$TestHTableReusablePool
Running org.apache.hadoop.hbase.client.TestSnapshotFromClientWithRegionReplicas
Tests run: 3, Failures: 0, Errors: 0, Skipped: 0, Time elapsed: 43.662 sec - in org.apache.hadoop.hbase.client.TestTableSnapshotScanner
Running org.apache.hadoop.hbase.client.TestFromClientSideWithCoprocessor
Tests run: 9, Failures: 0, Errors: 0, Skipped: 0, Time elapsed: 6.48 sec - in org.apache.hadoop.hbase.client.TestHTablePool$TestHTableReusablePool
Running org.apache.hadoop.hbase.client.TestHTablePool$TestHTableThreadLocalPool
Tests run: 9, Failures: 0, Errors: 0, Skipped: 0, Time elapsed: 2.344 sec - in org.apache.hadoop.hbase.client.TestHTablePool$TestHTableThreadLocalPool
Tests run: 5, Failures: 0, Errors: 0, Skipped: 0, Time elapsed: 63.196 sec - in org.apache.hadoop.hbase.client.TestCloneSnapshotFromClient
Running org.apache.hadoop.hbase.client.TestSnapshotCloneIndependence
Tests run: 5, Failures: 0, Errors: 0, Skipped: 0, Time elapsed: 11.801 sec - in org.apache.hadoop.hbase.client.TestSnapshotFromClientWithRegionReplicas
Running org.apache.hadoop.hbase.client.TestAdmin1
Running org.apache.hadoop.hbase.client.TestCloneSnapshotFromClientWithRegionReplicas
Tests run: 8, Failures: 0, Errors: 0, Skipped: 0, Time elapsed: 48.668 sec - in org.apache.hadoop.hbase.client.TestSnapshotCloneIndependence
Running org.apache.hadoop.hbase.client.TestHCM
Tests run: 24, Failures: 0, Errors: 0, Skipped: 0, Time elapsed: 58.892 sec - in org.apache.hadoop.hbase.client.TestAdmin1
Running org.apache.hadoop.hbase.client.TestShortCircuitConnection
Tests run: 1, Failures: 0, Errors: 0, Skipped: 0, Time elapsed: 2.072 sec - in org.apache.hadoop.hbase.client.TestShortCircuitConnection
Tests run: 5, Failures: 0, Errors: 0, Skipped: 0, Time elapsed: 70.993 sec - in org.apache.hadoop.hbase.client.TestCloneSnapshotFromClientWithRegionReplicas
Tests run: 82, Failures: 0, Errors: 0, Skipped: 4, Time elapsed: 91.834 sec - in org.apache.hadoop.hbase.client.TestFromClientSideWithCoprocessor
Running org.apache.hadoop.hbase.client.TestHTablePool$TestHTableReusablePool
Running org.apache.hadoop.hbase.client.TestFromClientSide3
Tests run: 9, Failures: 0, Errors: 0, Skipped: 0, Time elapsed: 3.435 sec - in org.apache.hadoop.hbase.client.TestHTablePool$TestHTableReusablePool
Running org.apache.hadoop.hbase.client.TestFastFail
Running org.apache.hadoop.hbase.client.TestReplicasClient
Tests run: 1, Failures: 0, Errors: 0, Skipped: 0, Time elapsed: 13.151 sec - in org.apache.hadoop.hbase.client.TestFastFail
Running org.apache.hadoop.hbase.client.TestRestoreSnapshotFromClientWithRegionReplicas
Running org.apache.hadoop.hbase.client.TestSizeFailures
Tests run: 9, Failures: 0, Errors: 0, Skipped: 0, Time elapsed: 42.996 sec - in org.apache.hadoop.hbase.client.TestFromClientSide3
Running org.apache.hadoop.hbase.client.TestAdmin2
Tests run: 2, Failures: 0, Errors: 0, Skipped: 0, Time elapsed: 42.377 sec - in org.apache.hadoop.hbase.client.TestSizeFailures
Running org.apache.hadoop.hbase.client.TestFromClientSideNoCodec
Tests run: 2, Failures: 0, Errors: 0, Skipped: 0, Time elapsed: 1.822 sec - in org.apache.hadoop.hbase.client.TestFromClientSideNoCodec
Running org.apache.hadoop.hbase.TestZooKeeper
Tests run: 12, Failures: 0, Errors: 0, Skipped: 0, Time elapsed: 96.155 sec - in org.apache.hadoop.hbase.client.TestReplicasClient
Tests run: 23, Failures: 0, Errors: 0, Skipped: 0, Time elapsed: 55.624 sec - in org.apache.hadoop.hbase.client.TestAdmin2
Running org.apache.hadoop.hbase.TestAcidGuarantees
Tests run: 21, Failures: 0, Errors: 0, Skipped: 3, Time elapsed: 143.136 sec - in org.apache.hadoop.hbase.client.TestHCM
Running org.apache.hadoop.hbase.TestHBaseTestingUtility
Tests run: 5, Failures: 0, Errors: 0, Skipped: 0, Time elapsed: 86.152 sec - in org.apache.hadoop.hbase.client.TestRestoreSnapshotFromClientWithRegionReplicas
Running org.apache.hadoop.hbase.zookeeper.TestHQuorumPeer
Tests run: 3, Failures: 0, Errors: 0, Skipped: 0, Time elapsed: 1.344 sec - in org.apache.hadoop.hbase.zookeeper.TestHQuorumPeer
Running org.apache.hadoop.hbase.zookeeper.TestRecoverableZooKeeper
Running org.apache.hadoop.hbase.trace.TestHTraceHooks
Tests run: 1, Failures: 0, Errors: 0, Skipped: 0, Time elapsed: 1.284 sec - in org.apache.hadoop.hbase.zookeeper.TestRecoverableZooKeeper
Tests run: 1, Failures: 0, Errors: 0, Skipped: 0, Time elapsed: 2.053 sec - in org.apache.hadoop.hbase.trace.TestHTraceHooks
Running org.apache.hadoop.hbase.zookeeper.TestZooKeeperNodeTracker
Tests run: 3, Failures: 0, Errors: 0, Skipped: 0, Time elapsed: 1.212 sec - in org.apache.hadoop.hbase.zookeeper.TestZooKeeperNodeTracker
Running org.apache.hadoop.hbase.zookeeper.TestZKMulti
Running org.apache.hadoop.hbase.zookeeper.TestZKLeaderManager
Tests run: 12, Failures: 0, Errors: 0, Skipped: 0, Time elapsed: 1.774 sec - in org.apache.hadoop.hbase.zookeeper.TestZKMulti
Tests run: 1, Failures: 0, Errors: 0, Skipped: 0, Time elapsed: 0.127 sec - in org.apache.hadoop.hbase.zookeeper.TestZKLeaderManager
Running org.apache.hadoop.hbase.zookeeper.lock.TestZKInterProcessReadWriteLock
Running org.apache.hadoop.hbase.zookeeper.TestZKTableStateManager
Tests run: 1, Failures: 0, Errors: 0, Skipped: 0, Time elapsed: 0.757 sec - in org.apache.hadoop.hbase.zookeeper.TestZKTableStateManager
Running org.apache.hadoop.hbase.zookeeper.TestZooKeeperACL
Tests run: 7, Failures: 0, Errors: 0, Skipped: 0, Time elapsed: 0.396 sec - in org.apache.hadoop.hbase.zookeeper.TestZooKeeperACL
Running org.apache.hadoop.hbase.mapreduce.TestLoadIncrementalHFiles
Tests run: 6, Failures: 0, Errors: 0, Skipped: 0, Time elapsed: 24.584 sec - in org.apache.hadoop.hbase.zookeeper.lock.TestZKInterProcessReadWriteLock
Tests run: 9, Failures: 0, Errors: 0, Skipped: 0, Time elapsed: 50.606 sec - in org.apache.hadoop.hbase.TestHBaseTestingUtility
Running org.apache.hadoop.hbase.mapreduce.TestCellCounter
Running org.apache.hadoop.hbase.mapreduce.TestImportTSVWithOperationAttributes
Tests run: 3, Failures: 0, Errors: 0, Skipped: 0, Time elapsed: 82.672 sec - in org.apache.hadoop.hbase.TestAcidGuarantees
Tests run: 16, Failures: 0, Errors: 0, Skipped: 0, Time elapsed: 51.508 sec - in org.apache.hadoop.hbase.mapreduce.TestLoadIncrementalHFiles
Running org.apache.hadoop.hbase.mapreduce.TestSecureLoadIncrementalHFilesSplitRecovery
Tests run: 5, Failures: 0, Errors: 0, Skipped: 0, Time elapsed: 17.345 sec - in org.apache.hadoop.hbase.mapreduce.TestSecureLoadIncrementalHFilesSplitRecovery
Running org.apache.hadoop.hbase.mapreduce.TestTableInputFormat
Running org.apache.hadoop.hbase.mapreduce.TestLoadIncrementalHFilesSplitRecovery
Tests run: 5, Failures: 0, Errors: 0, Skipped: 0, Time elapsed: 16.635 sec - in org.apache.hadoop.hbase.mapreduce.TestLoadIncrementalHFilesSplitRecovery
Running org.apache.hadoop.hbase.mapreduce.TestLoadIncrementalHFilesUseSecurityEndPoint
Tests run: 11, Failures: 0, Errors: 0, Skipped: 0, Time elapsed: 160.624 sec - in org.apache.hadoop.hbase.TestZooKeeper
Running org.apache.hadoop.hbase.mapreduce.TestHLogRecordReader
Tests run: 2, Failures: 0, Errors: 0, Skipped: 0, Time elapsed: 0.815 sec - in org.apache.hadoop.hbase.mapreduce.TestHLogRecordReader
Tests run: 2, Failures: 0, Errors: 0, Skipped: 0, Time elapsed: 76.743 sec - in org.apache.hadoop.hbase.mapreduce.TestImportTSVWithOperationAttributes
Running org.apache.hadoop.hbase.mapreduce.TestHFileOutputFormat
Running org.apache.hadoop.hbase.mapreduce.TestHRegionPartitioner
Tests run: 1, Failures: 0, Errors: 0, Skipped: 0, Time elapsed: 2.762 sec - in org.apache.hadoop.hbase.mapreduce.TestHRegionPartitioner
Tests run: 16, Failures: 0, Errors: 0, Skipped: 0, Time elapsed: 50.62 sec - in org.apache.hadoop.hbase.mapreduce.TestLoadIncrementalHFilesUseSecurityEndPoint
Tests run: 8, Failures: 0, Errors: 0, Skipped: 0, Time elapsed: 83.508 sec - in org.apache.hadoop.hbase.mapreduce.TestTableInputFormat
Running org.apache.hadoop.hbase.mapreduce.TestSecureLoadIncrementalHFiles
Running org.apache.hadoop.hbase.mapreduce.TestTableInputFormatScan2
Running org.apache.hadoop.hbase.mapreduce.TestImportTsv
Tests run: 7, Failures: 0, Errors: 0, Skipped: 0, Time elapsed: 170.507 sec - in org.apache.hadoop.hbase.mapreduce.TestCellCounter
Tests run: 16, Failures: 0, Errors: 0, Skipped: 0, Time elapsed: 51.085 sec - in org.apache.hadoop.hbase.mapreduce.TestSecureLoadIncrementalHFiles
Running org.apache.hadoop.hbase.mapreduce.TestTableMapReduce
Running org.apache.hadoop.hbase.mapreduce.TestWALPlayer
Tests run: 4, Failures: 0, Errors: 0, Skipped: 0, Time elapsed: 60.278 sec - in org.apache.hadoop.hbase.mapreduce.TestWALPlayer
Running org.apache.hadoop.hbase.mapreduce.TestImportExport
Tests run: 2, Failures: 0, Errors: 0, Skipped: 0, Time elapsed: 145.813 sec - in org.apache.hadoop.hbase.mapreduce.TestTableMapReduce
Running org.apache.hadoop.hbase.mapreduce.TestRowCounter
Tests run: 13, Failures: 0, Errors: 0, Skipped: 1, Time elapsed: 279.982 sec - in org.apache.hadoop.hbase.mapreduce.TestHFileOutputFormat
Tests run: 7, Failures: 0, Errors: 0, Skipped: 0, Time elapsed: 238.416 sec - in org.apache.hadoop.hbase.mapreduce.TestTableInputFormatScan2
Running org.apache.hadoop.hbase.mapreduce.TestImportTSVWithVisibilityLabels
Running org.apache.hadoop.hbase.mapreduce.TestImportTSVWithTTLs
Tests run: 11, Failures: 0, Errors: 0, Skipped: 0, Time elapsed: 257.567 sec - in org.apache.hadoop.hbase.mapreduce.TestImportTsv
Running org.apache.hadoop.hbase.mapreduce.TestHFileOutputFormat2
Tests run: 1, Failures: 0, Errors: 0, Skipped: 0, Time elapsed: 54.405 sec - in org.apache.hadoop.hbase.mapreduce.TestImportTSVWithTTLs
Running org.apache.hadoop.hbase.mapreduce.TestWALRecordReader
Tests run: 2, Failures: 0, Errors: 0, Skipped: 0, Time elapsed: 0.738 sec - in org.apache.hadoop.hbase.mapreduce.TestWALRecordReader
Running org.apache.hadoop.hbase.mapreduce.TestTableInputFormatScan1
Tests run: 5, Failures: 0, Errors: 0, Skipped: 0, Time elapsed: 157.823 sec - in org.apache.hadoop.hbase.mapreduce.TestImportTSVWithVisibilityLabels
Tests run: 6, Failures: 0, Errors: 0, Skipped: 0, Time elapsed: 186.643 sec - in org.apache.hadoop.hbase.mapreduce.TestRowCounter
Running org.apache.hadoop.hbase.mapreduce.TestTableSnapshotInputFormat
Running org.apache.hadoop.hbase.mapreduce.TestMultithreadedTableMapper
Tests run: 12, Failures: 0, Errors: 0, Skipped: 0, Time elapsed: 364.742 sec - in org.apache.hadoop.hbase.mapreduce.TestImportExport
Running org.apache.hadoop.hbase.mapreduce.TestTimeRangeMapRed
Tests run: 13, Failures: 0, Errors: 0, Skipped: 1, Time elapsed: 281.736 sec - in org.apache.hadoop.hbase.mapreduce.TestHFileOutputFormat2
Tests run: 1, Failures: 0, Errors: 0, Skipped: 0, Time elapsed: 113.417 sec - in org.apache.hadoop.hbase.mapreduce.TestMultithreadedTableMapper
Running org.apache.hadoop.hbase.mapreduce.TestCopyTable
Tests run: 7, Failures: 0, Errors: 0, Skipped: 0, Time elapsed: 220.649 sec - in org.apache.hadoop.hbase.mapreduce.TestTableInputFormatScan1
Running org.apache.hadoop.hbase.mapreduce.TestMultiTableInputFormat
Running org.apache.hadoop.hbase.TestMetaTableAccessor
Tests run: 10, Failures: 0, Errors: 0, Skipped: 0, Time elapsed: 8.382 sec - in org.apache.hadoop.hbase.TestMetaTableAccessor
Running org.apache.hadoop.hbase.io.TestFileLink
Tests run: 1, Failures: 0, Errors: 0, Skipped: 0, Time elapsed: 66.166 sec - in org.apache.hadoop.hbase.mapreduce.TestTimeRangeMapRed
Running org.apache.hadoop.hbase.io.hfile.TestHFileBlockIndex
Tests run: 3, Failures: 0, Errors: 0, Skipped: 0, Time elapsed: 16.582 sec - in org.apache.hadoop.hbase.io.TestFileLink
Running org.apache.hadoop.hbase.io.hfile.TestScannerSelectionUsingTTL
Tests run: 10, Failures: 0, Errors: 0, Skipped: 0, Time elapsed: 10.35 sec - in org.apache.hadoop.hbase.io.hfile.TestHFileBlockIndex
Running org.apache.hadoop.hbase.io.hfile.TestHFileSeek
Tests run: 1, Failures: 0, Errors: 0, Skipped: 0, Time elapsed: 2.106 sec - in org.apache.hadoop.hbase.io.hfile.TestHFileSeek
Running org.apache.hadoop.hbase.io.hfile.TestHFileBlock
Tests run: 6, Failures: 0, Errors: 0, Skipped: 0, Time elapsed: 62.936 sec - in org.apache.hadoop.hbase.io.hfile.TestScannerSelectionUsingTTL
Running org.apache.hadoop.hbase.io.hfile.TestCacheConfig
Tests run: 6, Failures: 0, Errors: 0, Skipped: 0, Time elapsed: 2.079 sec - in org.apache.hadoop.hbase.io.hfile.TestCacheConfig
Running org.apache.hadoop.hbase.io.hfile.TestForceCacheImportantBlocks
Tests run: 5, Failures: 0, Errors: 0, Skipped: 0, Time elapsed: 130.138 sec - in org.apache.hadoop.hbase.mapreduce.TestCopyTable
Running org.apache.hadoop.hbase.io.hfile.TestCacheOnWrite
Tests run: 8, Failures: 0, Errors: 0, Skipped: 0, Time elapsed: 298.731 sec - in org.apache.hadoop.hbase.mapreduce.TestTableSnapshotInputFormat
Running org.apache.hadoop.hbase.io.encoding.TestLoadAndSwitchEncodeOnDisk
Tests run: 28, Failures: 0, Errors: 0, Skipped: 0, Time elapsed: 95.777 sec - in org.apache.hadoop.hbase.io.hfile.TestHFileBlock
Running org.apache.hadoop.hbase.io.encoding.TestChangingEncoding
Tests run: 4, Failures: 0, Errors: 0, Skipped: 0, Time elapsed: 42.046 sec - in org.apache.hadoop.hbase.io.hfile.TestForceCacheImportantBlocks
Tests run: 4, Failures: 0, Errors: 0, Skipped: 0, Time elapsed: 151.381 sec - in org.apache.hadoop.hbase.mapreduce.TestMultiTableInputFormat
Running org.apache.hadoop.hbase.io.encoding.TestEncodedSeekers
Running org.apache.hadoop.hbase.io.encoding.TestDataBlockEncoders
Tests run: 1, Failures: 0, Errors: 0, Skipped: 0, Time elapsed: 22.671 sec - in org.apache.hadoop.hbase.io.encoding.TestLoadAndSwitchEncodeOnDisk
Running org.apache.hadoop.hbase.io.encoding.TestBufferedDataBlockEncoder
Tests run: 1, Failures: 0, Errors: 0, Skipped: 0, Time elapsed: 17.295 sec - in org.apache.hadoop.hbase.io.encoding.TestBufferedDataBlockEncoder
Running org.apache.hadoop.hbase.filter.TestScanRowPrefix
Tests run: 1, Failures: 0, Errors: 0, Skipped: 0, Time elapsed: 1.792 sec - in org.apache.hadoop.hbase.filter.TestScanRowPrefix
Running org.apache.hadoop.hbase.filter.TestFilterWithScanLimits
Tests run: 1, Failures: 0, Errors: 0, Skipped: 0, Time elapsed: 1.221 sec - in org.apache.hadoop.hbase.filter.TestFilterWithScanLimits
Tests run: 3, Failures: 0, Errors: 0, Skipped: 0, Time elapsed: 55.455 sec - in org.apache.hadoop.hbase.io.encoding.TestChangingEncoding
Running org.apache.hadoop.hbase.filter.TestFilterWrapper
Tests run: 1, Failures: 0, Errors: 0, Skipped: 0, Time elapsed: 1.511 sec - in org.apache.hadoop.hbase.filter.TestFilterWrapper
Running org.apache.hadoop.hbase.filter.TestFuzzyRowFilterEndToEnd
Running org.apache.hadoop.hbase.filter.TestColumnRangeFilter
Tests run: 1, Failures: 0, Errors: 0, Skipped: 0, Time elapsed: 6.84 sec - in org.apache.hadoop.hbase.filter.TestColumnRangeFilter
Running org.apache.hadoop.hbase.filter.TestFuzzyRowAndColumnRangeFilter
Tests run: 1, Failures: 0, Errors: 0, Skipped: 0, Time elapsed: 1.664 sec - in org.apache.hadoop.hbase.filter.TestFuzzyRowAndColumnRangeFilter
Tests run: 72, Failures: 0, Errors: 0, Skipped: 0, Time elapsed: 135.425 sec - in org.apache.hadoop.hbase.io.hfile.TestCacheOnWrite
Tests run: 20, Failures: 0, Errors: 0, Skipped: 0, Time elapsed: 131.554 sec - in org.apache.hadoop.hbase.io.encoding.TestEncodedSeekers
Tests run: 28, Failures: 0, Errors: 0, Skipped: 0, Time elapsed: 239.346 sec - in org.apache.hadoop.hbase.io.encoding.TestDataBlockEncoders
Tests run: 2, Failures: 0, Errors: 0, Skipped: 0, Time elapsed: 205.033 sec - in org.apache.hadoop.hbase.filter.TestFuzzyRowFilterEndToEnd

Results :

Failed tests: 
  TestReplicationEndpoint.testReplicationEndpointReturnsFalseOnReplicate:145 Waiting timed out after [60,000] msec



Tests run: 2240, Failures: 1, Errors: 0, Skipped: 18

[INFO] ------------------------------------------------------------------------
[INFO] Reactor Summary:
[INFO] 
[INFO] Apache HBase ...................................... SUCCESS [4.007s]
[INFO] Apache HBase - Checkstyle ......................... SUCCESS [0.829s]
[INFO] Apache HBase - Resource Bundle .................... SUCCESS [0.231s]
[INFO] Apache HBase - Annotations ........................ SUCCESS [1.161s]
[INFO] Apache HBase - Common ............................. SUCCESS [59.253s]
[INFO] Apache HBase - Protocol ........................... SUCCESS [9.267s]
[INFO] Apache HBase - Client ............................. SUCCESS [1:20.087s]
[INFO] Apache HBase - Hadoop Compatibility ............... SUCCESS [7.215s]
[INFO] Apache HBase - Hadoop Two Compatibility ........... SUCCESS [6.507s]
[INFO] Apache HBase - Prefix Tree ........................ SUCCESS [8.420s]
[INFO] Apache HBase - Server ............................. FAILURE [1:05:23.557s]
[INFO] Apache HBase - Testing Util ....................... SKIPPED
[INFO] Apache HBase - Thrift ............................. SKIPPED
[INFO] Apache HBase - Rest ............................... SKIPPED
[INFO] Apache HBase - Shell .............................. SKIPPED
[INFO] Apache HBase - Integration Tests .................. SKIPPED
[INFO] Apache HBase - Examples ........................... SKIPPED
[INFO] Apache HBase - Assembly ........................... SKIPPED
[INFO] ------------------------------------------------------------------------
[INFO] BUILD FAILURE
[INFO] ------------------------------------------------------------------------
[INFO] Total time: 1:08:22.423s
[INFO] Finished at: Sat Oct 10 19:48:52 UTC 2015
[INFO] Final Memory: 47M/602M
[INFO] ------------------------------------------------------------------------
[ERROR] Failed to execute goal org.apache.maven.plugins:maven-surefire-plugin:2.18:test (secondPartTestsExecution) on project hbase-server: There are test failures.
[ERROR] 
[ERROR] Please refer to <https://builds.apache.org/job/HBase-1.0/ws/hbase-server/target/surefire-reports> for the individual test results.
[ERROR] -> [Help 1]
[ERROR] 
[ERROR] To see the full stack trace of the errors, re-run Maven with the -e switch.
[ERROR] Re-run Maven using the -X switch to enable full debug logging.
[ERROR] 
[ERROR] For more information about the errors and possible solutions, please read the following articles:
[ERROR] [Help 1] http://cwiki.apache.org/confluence/display/MAVEN/MojoFailureException
[ERROR] 
[ERROR] After correcting the problems, you can resume the build with the command
[ERROR]   mvn <goals> -rf :hbase-server
Build step 'Invoke top-level Maven targets' marked build as failure
Performing Post build task...
Match found for :.* : True
Logical operation result is TRUE
Running script  :   ZOMBIE_TESTS_COUNT=`jps | grep surefirebooter | wc -l`
  if [[ $ZOMBIE_TESTS_COUNT != 0 ]] ; then
    #It seems sometimes the tests are not dying immediately. Let's give them 10s
    echo "Suspicious java process found - waiting 10s to see if there are just slow to stop"
    sleep 10   
    ZOMBIE_TESTS_COUNT=`jps | grep surefirebooter | wc -l`
    if [[ $ZOMBIE_TESTS_COUNT != 0 ]] ; then
      echo "There are $ZOMBIE_TESTS_COUNT zombie tests, they should have been killed by surefire but survived"
      echo "************ BEGIN zombies jstack extract"
      ZB_STACK=`jps | grep surefirebooter | cut -d ' ' -f 1 | xargs -n 1 jstack | grep ".test" | grep "\.java"`
      jps | grep surefirebooter | cut -d ' ' -f 1 | xargs -n 1 jstack
      echo "************ END  zombies jstack extract"
      JIRA_COMMENT="$JIRA_COMMENT

     {color:red}-1 core zombie tests{color}.  There are ${ZOMBIE_TESTS_COUNT} zombie test(s): ${ZB_STACK}"
      BAD=1
      jps | grep surefirebooter | cut -d ' ' -f 1 | xargs kill -9
    else
      echo "We're ok: there is no zombie test, but some tests took some time to stop"
    fi
  else
    echo "We're ok: there is no zombie test"
  fi
[HBase-1.0] $ /bin/bash -xe /tmp/hudson4897810621517508464.sh
++ jps
++ grep surefirebooter
++ wc -l
+ ZOMBIE_TESTS_COUNT=0
+ [[ 0 != 0 ]]
+ echo 'We'\''re ok: there is no zombie test'
We're ok: there is no zombie test
POST BUILD TASK : SUCCESS
END OF POST BUILD TASK : 0
Archiving artifacts
Recording test results
Updating HBASE-14581

Build failed in Jenkins: HBase-1.0 #1074

Posted by Apache Jenkins Server <je...@builds.apache.org>.
See <https://builds.apache.org/job/HBase-1.0/1074/changes>

Changes:

[stack] HBASE-14571 Purge TestProcessBasedCluster; it does nothing and then

------------------------------------------
[...truncated 1902 lines...]
Running org.apache.hadoop.hbase.coprocessor.TestCoprocessorTableEndpoint
Tests run: 1, Failures: 0, Errors: 0, Skipped: 0, Time elapsed: 14.229 sec - in org.apache.hadoop.hbase.coprocessor.TestRegionServerCoprocessorExceptionWithRemove
Tests run: 7, Failures: 0, Errors: 0, Skipped: 0, Time elapsed: 8.62 sec - in org.apache.hadoop.hbase.coprocessor.TestMasterObserver
Running org.apache.hadoop.hbase.coprocessor.TestRegionServerCoprocessorExceptionWithAbort
Tests run: 2, Failures: 0, Errors: 0, Skipped: 0, Time elapsed: 3.821 sec - in org.apache.hadoop.hbase.coprocessor.TestCoprocessorTableEndpoint
Running org.apache.hadoop.hbase.coprocessor.TestDoubleColumnInterpreter
Running org.apache.hadoop.hbase.coprocessor.TestCoprocessorEndpoint
Tests run: 6, Failures: 0, Errors: 0, Skipped: 0, Time elapsed: 1.771 sec - in org.apache.hadoop.hbase.coprocessor.TestCoprocessorEndpoint
Tests run: 38, Failures: 0, Errors: 0, Skipped: 0, Time elapsed: 5.756 sec - in org.apache.hadoop.hbase.coprocessor.TestDoubleColumnInterpreter
Tests run: 2, Failures: 0, Errors: 0, Skipped: 0, Time elapsed: 18.578 sec - in org.apache.hadoop.hbase.coprocessor.TestRegionServerCoprocessorExceptionWithAbort
Running org.apache.hadoop.hbase.coprocessor.TestMasterCoprocessorExceptionWithRemove
Running org.apache.hadoop.hbase.coprocessor.TestBatchCoprocessorEndpoint
Running org.apache.hadoop.hbase.coprocessor.TestRowProcessorEndpoint
Tests run: 4, Failures: 0, Errors: 0, Skipped: 0, Time elapsed: 1.971 sec - in org.apache.hadoop.hbase.coprocessor.TestBatchCoprocessorEndpoint
Tests run: 1, Failures: 0, Errors: 0, Skipped: 0, Time elapsed: 4.867 sec - in org.apache.hadoop.hbase.coprocessor.TestMasterCoprocessorExceptionWithRemove
Tests run: 4, Failures: 0, Errors: 0, Skipped: 0, Time elapsed: 6.777 sec - in org.apache.hadoop.hbase.coprocessor.TestRowProcessorEndpoint
Running org.apache.hadoop.hbase.coprocessor.TestRegionObserverInterface
Running org.apache.hadoop.hbase.coprocessor.TestOpenTableInCoprocessor
Tests run: 2, Failures: 0, Errors: 0, Skipped: 0, Time elapsed: 3.186 sec - in org.apache.hadoop.hbase.coprocessor.TestOpenTableInCoprocessor
Running org.apache.hadoop.hbase.coprocessor.TestBigDecimalColumnInterpreter
Tests run: 38, Failures: 0, Errors: 0, Skipped: 0, Time elapsed: 5.053 sec - in org.apache.hadoop.hbase.coprocessor.TestBigDecimalColumnInterpreter
Running org.apache.hadoop.hbase.coprocessor.TestCoprocessorStop
Running org.apache.hadoop.hbase.coprocessor.TestAggregateProtocol
Tests run: 44, Failures: 0, Errors: 0, Skipped: 0, Time elapsed: 5.573 sec - in org.apache.hadoop.hbase.coprocessor.TestAggregateProtocol
Tests run: 1, Failures: 0, Errors: 0, Skipped: 0, Time elapsed: 15.62 sec - in org.apache.hadoop.hbase.coprocessor.TestCoprocessorStop
Tests run: 14, Failures: 0, Errors: 0, Skipped: 0, Time elapsed: 37.794 sec - in org.apache.hadoop.hbase.coprocessor.TestRegionObserverInterface
Running org.apache.hadoop.hbase.coprocessor.TestRegionObserverBypass
Running org.apache.hadoop.hbase.coprocessor.TestHTableWrapper
Running org.apache.hadoop.hbase.backup.example.TestZooKeeperTableArchiveClient
Tests run: 1, Failures: 0, Errors: 0, Skipped: 0, Time elapsed: 2.674 sec - in org.apache.hadoop.hbase.coprocessor.TestHTableWrapper
Tests run: 2, Failures: 0, Errors: 0, Skipped: 0, Time elapsed: 3.033 sec - in org.apache.hadoop.hbase.coprocessor.TestRegionObserverBypass
Running org.apache.hadoop.hbase.regionserver.TestHRegionServerBulkLoad
Tests run: 3, Failures: 0, Errors: 0, Skipped: 0, Time elapsed: 4.446 sec - in org.apache.hadoop.hbase.backup.example.TestZooKeeperTableArchiveClient
Running org.apache.hadoop.hbase.backup.TestHFileArchiving
Running org.apache.hadoop.hbase.regionserver.TestScannerRetriableFailure
Tests run: 1, Failures: 0, Errors: 0, Skipped: 0, Time elapsed: 41.433 sec - in org.apache.hadoop.hbase.regionserver.TestHRegionServerBulkLoad
Tests run: 1, Failures: 0, Errors: 0, Skipped: 0, Time elapsed: 34.841 sec - in org.apache.hadoop.hbase.regionserver.TestScannerRetriableFailure
Tests run: 5, Failures: 0, Errors: 0, Skipped: 0, Time elapsed: 42.752 sec - in org.apache.hadoop.hbase.backup.TestHFileArchiving
Running org.apache.hadoop.hbase.regionserver.TestReversibleScanners
Tests run: 5, Failures: 0, Errors: 0, Skipped: 0, Time elapsed: 6.695 sec - in org.apache.hadoop.hbase.regionserver.TestReversibleScanners
Running org.apache.hadoop.hbase.regionserver.TestRegionFavoredNodes
Running org.apache.hadoop.hbase.regionserver.TestEndToEndSplitTransaction
Running org.apache.hadoop.hbase.regionserver.TestRegionServerNoMaster
Tests run: 1, Failures: 0, Errors: 0, Skipped: 0, Time elapsed: 12.453 sec - in org.apache.hadoop.hbase.regionserver.TestRegionFavoredNodes
Running org.apache.hadoop.hbase.regionserver.TestClusterId
Tests run: 2, Failures: 0, Errors: 0, Skipped: 0, Time elapsed: 16.902 sec - in org.apache.hadoop.hbase.regionserver.TestEndToEndSplitTransaction
Running org.apache.hadoop.hbase.regionserver.TestMajorCompaction
Tests run: 9, Failures: 0, Errors: 0, Skipped: 0, Time elapsed: 17.882 sec - in org.apache.hadoop.hbase.regionserver.TestRegionServerNoMaster
Running org.apache.hadoop.hbase.regionserver.TestServerCustomProtocol
Tests run: 2, Failures: 0, Errors: 0, Skipped: 0, Time elapsed: 27.829 sec - in org.apache.hadoop.hbase.regionserver.TestClusterId
Running org.apache.hadoop.hbase.regionserver.TestEncryptionKeyRotation
Tests run: 7, Failures: 0, Errors: 0, Skipped: 0, Time elapsed: 14.845 sec - in org.apache.hadoop.hbase.regionserver.TestServerCustomProtocol
Running org.apache.hadoop.hbase.regionserver.TestPriorityRpc
Tests run: 3, Failures: 0, Errors: 0, Skipped: 0, Time elapsed: 2.462 sec - in org.apache.hadoop.hbase.regionserver.TestPriorityRpc
Running org.apache.hadoop.hbase.regionserver.TestBlocksRead
Tests run: 4, Failures: 0, Errors: 0, Skipped: 0, Time elapsed: 2.005 sec - in org.apache.hadoop.hbase.regionserver.TestBlocksRead
Running org.apache.hadoop.hbase.regionserver.TestSplitLogWorker
Tests run: 2, Failures: 0, Errors: 0, Skipped: 0, Time elapsed: 13.145 sec - in org.apache.hadoop.hbase.regionserver.TestEncryptionKeyRotation
Tests run: 7, Failures: 0, Errors: 0, Skipped: 0, Time elapsed: 48.814 sec - in org.apache.hadoop.hbase.regionserver.TestMajorCompaction
Running org.apache.hadoop.hbase.regionserver.TestZKLessMergeOnCluster
Tests run: 9, Failures: 0, Errors: 0, Skipped: 0, Time elapsed: 321.28 sec - in org.apache.hadoop.hbase.snapshot.TestSecureExportSnapshot
Running org.apache.hadoop.hbase.regionserver.TestJoinedScanners
Running org.apache.hadoop.hbase.regionserver.TestZKLessSplitOnCluster
Tests run: 3, Failures: 0, Errors: 0, Skipped: 0, Time elapsed: 11.284 sec - in org.apache.hadoop.hbase.regionserver.TestZKLessMergeOnCluster
Tests run: 7, Failures: 0, Errors: 0, Skipped: 0, Time elapsed: 22.263 sec - in org.apache.hadoop.hbase.regionserver.TestSplitLogWorker
Running org.apache.hadoop.hbase.regionserver.TestMinorCompaction
Tests run: 6, Failures: 0, Errors: 0, Skipped: 0, Time elapsed: 4.434 sec - in org.apache.hadoop.hbase.regionserver.TestMinorCompaction
Running org.apache.hadoop.hbase.regionserver.TestRegionServerMetrics
Tests run: 9, Failures: 0, Errors: 0, Skipped: 0, Time elapsed: 6.045 sec - in org.apache.hadoop.hbase.regionserver.TestRegionServerMetrics
Tests run: 1, Failures: 0, Errors: 0, Skipped: 0, Time elapsed: 23.733 sec - in org.apache.hadoop.hbase.regionserver.TestJoinedScanners
Running org.apache.hadoop.hbase.regionserver.TestTags
Running org.apache.hadoop.hbase.regionserver.TestHRegionOnCluster
Running org.apache.hadoop.hbase.regionserver.TestRowTooBig
Tests run: 9, Failures: 0, Errors: 0, Skipped: 0, Time elapsed: 317.397 sec - in org.apache.hadoop.hbase.snapshot.TestExportSnapshot
Tests run: 1, Failures: 0, Errors: 0, Skipped: 0, Time elapsed: 12.315 sec - in org.apache.hadoop.hbase.regionserver.TestHRegionOnCluster
Tests run: 16, Failures: 0, Errors: 0, Skipped: 0, Time elapsed: 38.764 sec - in org.apache.hadoop.hbase.regionserver.TestZKLessSplitOnCluster
Running org.apache.hadoop.hbase.regionserver.TestSeekOptimizations
Running org.apache.hadoop.hbase.regionserver.TestSCVFWithMiniCluster
Tests run: 5, Failures: 0, Errors: 0, Skipped: 0, Time elapsed: 0.34 sec - in org.apache.hadoop.hbase.regionserver.TestSCVFWithMiniCluster
Tests run: 6, Failures: 0, Errors: 0, Skipped: 0, Time elapsed: 5.165 sec - in org.apache.hadoop.hbase.regionserver.TestSeekOptimizations
Running org.apache.hadoop.hbase.regionserver.TestCompactionState
Running org.apache.hadoop.hbase.regionserver.TestCompactionWithCoprocessor
Tests run: 2, Failures: 0, Errors: 0, Skipped: 0, Time elapsed: 14.634 sec - in org.apache.hadoop.hbase.regionserver.TestRowTooBig
Running org.apache.hadoop.hbase.regionserver.TestStoreScanner
Tests run: 16, Failures: 0, Errors: 0, Skipped: 0, Time elapsed: 1.116 sec - in org.apache.hadoop.hbase.regionserver.TestStoreScanner
Running org.apache.hadoop.hbase.regionserver.TestCacheOnWriteInSchema
Tests run: 3, Failures: 0, Errors: 0, Skipped: 0, Time elapsed: 2.931 sec - in org.apache.hadoop.hbase.regionserver.TestCacheOnWriteInSchema
Tests run: 4, Failures: 0, Errors: 0, Skipped: 0, Time elapsed: 32.579 sec - in org.apache.hadoop.hbase.regionserver.TestTags
Running org.apache.hadoop.hbase.regionserver.wal.TestReadOldRootAndMetaEdits
Tests run: 1, Failures: 0, Errors: 0, Skipped: 0, Time elapsed: 0.301 sec - in org.apache.hadoop.hbase.regionserver.wal.TestReadOldRootAndMetaEdits
Running org.apache.hadoop.hbase.regionserver.TestRegionReplicas
Running org.apache.hadoop.hbase.regionserver.wal.TestFSHLog
Running org.apache.hadoop.hbase.regionserver.wal.TestWALReplayCompressed
Tests run: 6, Failures: 0, Errors: 0, Skipped: 0, Time elapsed: 4.691 sec - in org.apache.hadoop.hbase.regionserver.wal.TestFSHLog
Tests run: 5, Failures: 0, Errors: 0, Skipped: 0, Time elapsed: 25.278 sec - in org.apache.hadoop.hbase.regionserver.TestCompactionWithCoprocessor
Tests run: 5, Failures: 0, Errors: 0, Skipped: 0, Time elapsed: 28.015 sec - in org.apache.hadoop.hbase.regionserver.TestCompactionState
Running org.apache.hadoop.hbase.regionserver.wal.TestLogRollAbort
Running org.apache.hadoop.hbase.regionserver.wal.TestSecureWALReplay
Running org.apache.hadoop.hbase.regionserver.wal.TestWALReplay
Tests run: 2, Failures: 0, Errors: 0, Skipped: 0, Time elapsed: 22.865 sec - in org.apache.hadoop.hbase.regionserver.wal.TestLogRollAbort
Running org.apache.hadoop.hbase.regionserver.wal.TestLogRolling
Tests run: 9, Failures: 0, Errors: 0, Skipped: 0, Time elapsed: 39.53 sec - in org.apache.hadoop.hbase.regionserver.wal.TestWALReplayCompressed
Running org.apache.hadoop.hbase.regionserver.wal.TestProtobufLog
Tests run: 1, Failures: 0, Errors: 0, Skipped: 0, Time elapsed: 1.991 sec - in org.apache.hadoop.hbase.regionserver.wal.TestProtobufLog
Running org.apache.hadoop.hbase.regionserver.wal.TestDurability
Tests run: 9, Failures: 0, Errors: 0, Skipped: 0, Time elapsed: 44.108 sec - in org.apache.hadoop.hbase.regionserver.wal.TestSecureWALReplay
Tests run: 2, Failures: 0, Errors: 0, Skipped: 0, Time elapsed: 2.522 sec - in org.apache.hadoop.hbase.regionserver.wal.TestDurability
Tests run: 9, Failures: 0, Errors: 0, Skipped: 0, Time elapsed: 42.168 sec - in org.apache.hadoop.hbase.regionserver.wal.TestWALReplay
Running org.apache.hadoop.hbase.regionserver.wal.TestLogRollPeriod
Running org.apache.hadoop.hbase.regionserver.TestScannerWithBulkload
Running org.apache.hadoop.hbase.regionserver.TestEncryptionRandomKeying
Tests run: 1, Failures: 0, Errors: 0, Skipped: 0, Time elapsed: 1.21 sec - in org.apache.hadoop.hbase.regionserver.TestEncryptionRandomKeying
Tests run: 3, Failures: 0, Errors: 0, Skipped: 0, Time elapsed: 6.596 sec - in org.apache.hadoop.hbase.regionserver.TestScannerWithBulkload
Running org.apache.hadoop.hbase.regionserver.TestDefaultMemStore
Running org.apache.hadoop.hbase.regionserver.handler.TestOpenRegionHandler
Tests run: 6, Failures: 0, Errors: 0, Skipped: 0, Time elapsed: 2.084 sec - in org.apache.hadoop.hbase.regionserver.handler.TestOpenRegionHandler
Running org.apache.hadoop.hbase.regionserver.handler.TestCloseRegionHandler
Tests run: 3, Failures: 0, Errors: 0, Skipped: 0, Time elapsed: 2.516 sec - in org.apache.hadoop.hbase.regionserver.handler.TestCloseRegionHandler
Running org.apache.hadoop.hbase.regionserver.TestMasterAddressTracker
Tests run: 5, Failures: 0, Errors: 0, Skipped: 0, Time elapsed: 1.518 sec - in org.apache.hadoop.hbase.regionserver.TestMasterAddressTracker
Running org.apache.hadoop.hbase.regionserver.TestSplitTransactionOnCluster
Tests run: 2, Failures: 0, Errors: 0, Skipped: 0, Time elapsed: 52.115 sec - in org.apache.hadoop.hbase.regionserver.wal.TestLogRollPeriod
Running org.apache.hadoop.hbase.regionserver.TestParallelPut
Tests run: 23, Failures: 0, Errors: 0, Skipped: 0, Time elapsed: 46.481 sec - in org.apache.hadoop.hbase.regionserver.TestDefaultMemStore
Running org.apache.hadoop.hbase.regionserver.TestRegionServerOnlineConfigChange
Tests run: 2, Failures: 0, Errors: 0, Skipped: 0, Time elapsed: 1.156 sec - in org.apache.hadoop.hbase.regionserver.TestRegionServerOnlineConfigChange
Running org.apache.hadoop.hbase.regionserver.TestCompaction
Tests run: 16, Failures: 0, Errors: 0, Skipped: 0, Time elapsed: 47.814 sec - in org.apache.hadoop.hbase.regionserver.TestSplitTransactionOnCluster
Running org.apache.hadoop.hbase.regionserver.TestRegionMergeTransactionOnCluster
Tests run: 7, Failures: 0, Errors: 0, Skipped: 0, Time elapsed: 173.416 sec - in org.apache.hadoop.hbase.regionserver.TestRegionReplicas
Running org.apache.hadoop.hbase.regionserver.TestRecoveredEdits
Tests run: 3, Failures: 0, Errors: 0, Skipped: 0, Time elapsed: 13.733 sec - in org.apache.hadoop.hbase.regionserver.TestRegionMergeTransactionOnCluster
Tests run: 5, Failures: 0, Errors: 0, Skipped: 0, Time elapsed: 29.862 sec - in org.apache.hadoop.hbase.regionserver.TestCompaction
Running org.apache.hadoop.hbase.regionserver.TestCompoundBloomFilter
Running org.apache.hadoop.hbase.regionserver.TestGetClosestAtOrBefore
Tests run: 3, Failures: 0, Errors: 0, Skipped: 0, Time elapsed: 2.506 sec - in org.apache.hadoop.hbase.regionserver.TestGetClosestAtOrBefore
Tests run: 1, Failures: 0, Errors: 0, Skipped: 0, Time elapsed: 14.867 sec - in org.apache.hadoop.hbase.regionserver.TestRecoveredEdits
Running org.apache.hadoop.hbase.regionserver.TestRegionServerReportForDuty
Tests run: 2, Failures: 0, Errors: 0, Skipped: 0, Time elapsed: 59.822 sec - in org.apache.hadoop.hbase.regionserver.TestParallelPut
Running org.apache.hadoop.hbase.regionserver.TestHRegion
Running org.apache.hadoop.hbase.regionserver.TestAtomicOperation
Tests run: 1, Failures: 0, Errors: 0, Skipped: 0, Time elapsed: 17.339 sec - in org.apache.hadoop.hbase.regionserver.TestRegionServerReportForDuty
Running org.apache.hadoop.hbase.regionserver.TestFSErrorsExposed
Tests run: 3, Failures: 0, Errors: 0, Skipped: 0, Time elapsed: 35.475 sec - in org.apache.hadoop.hbase.regionserver.TestCompoundBloomFilter
Running org.apache.hadoop.hbase.regionserver.TestRSKilledWhenInitializing
Tests run: 1, Failures: 0, Errors: 0, Skipped: 0, Time elapsed: 23.139 sec - in org.apache.hadoop.hbase.regionserver.TestRSKilledWhenInitializing
Running org.apache.hadoop.hbase.regionserver.TestMultiColumnScanner
Tests run: 3, Failures: 0, Errors: 0, Skipped: 0, Time elapsed: 38.011 sec - in org.apache.hadoop.hbase.regionserver.TestFSErrorsExposed
Running org.apache.hadoop.hbase.regionserver.TestFlushRegionEntry
Tests run: 1, Failures: 0, Errors: 0, Skipped: 0, Time elapsed: 1.192 sec - in org.apache.hadoop.hbase.regionserver.TestFlushRegionEntry
Running org.apache.hadoop.hbase.regionserver.TestStore
Tests run: 18, Failures: 0, Errors: 0, Skipped: 0, Time elapsed: 16.987 sec - in org.apache.hadoop.hbase.regionserver.TestStore
Tests run: 6, Failures: 0, Errors: 0, Skipped: 0, Time elapsed: 75.107 sec - in org.apache.hadoop.hbase.regionserver.TestAtomicOperation
Running org.apache.hadoop.hbase.TestMetaTableLocator
Tests run: 7, Failures: 0, Errors: 0, Skipped: 0, Time elapsed: 4.018 sec - in org.apache.hadoop.hbase.TestMetaTableLocator
Tests run: 5, Failures: 0, Errors: 0, Skipped: 0, Time elapsed: 259.528 sec - in org.apache.hadoop.hbase.regionserver.wal.TestLogRolling
Tests run: 12, Failures: 0, Errors: 0, Skipped: 0, Time elapsed: 68.354 sec - in org.apache.hadoop.hbase.regionserver.TestMultiColumnScanner
Tests run: 96, Failures: 0, Errors: 0, Skipped: 0, Time elapsed: 148.778 sec - in org.apache.hadoop.hbase.regionserver.TestHRegion

Results :


Tests in error: 
  TestAssignmentManager.testBalanceOnMasterFailoverScenarioWithOpenedNode:269 » TestTimedOut


Tests run: 2240, Failures: 0, Errors: 1, Skipped: 18

[INFO] ------------------------------------------------------------------------
[INFO] Reactor Summary:
[INFO] 
[INFO] Apache HBase ...................................... SUCCESS [4.038s]
[INFO] Apache HBase - Checkstyle ......................... SUCCESS [0.867s]
[INFO] Apache HBase - Resource Bundle .................... SUCCESS [0.241s]
[INFO] Apache HBase - Annotations ........................ SUCCESS [1.913s]
[INFO] Apache HBase - Common ............................. SUCCESS [1:03.946s]
[INFO] Apache HBase - Protocol ........................... SUCCESS [9.930s]
[INFO] Apache HBase - Client ............................. SUCCESS [1:23.281s]
[INFO] Apache HBase - Hadoop Compatibility ............... SUCCESS [7.492s]
[INFO] Apache HBase - Hadoop Two Compatibility ........... SUCCESS [7.282s]
[INFO] Apache HBase - Prefix Tree ........................ SUCCESS [9.274s]
[INFO] Apache HBase - Server ............................. FAILURE [1:08:47.788s]
[INFO] Apache HBase - Testing Util ....................... SKIPPED
[INFO] Apache HBase - Thrift ............................. SKIPPED
[INFO] Apache HBase - Rest ............................... SKIPPED
[INFO] Apache HBase - Shell .............................. SKIPPED
[INFO] Apache HBase - Integration Tests .................. SKIPPED
[INFO] Apache HBase - Examples ........................... SKIPPED
[INFO] Apache HBase - Assembly ........................... SKIPPED
[INFO] ------------------------------------------------------------------------
[INFO] BUILD FAILURE
[INFO] ------------------------------------------------------------------------
[INFO] Total time: 1:11:57.765s
[INFO] Finished at: Wed Oct 07 07:56:39 UTC 2015
[INFO] Final Memory: 46M/580M
[INFO] ------------------------------------------------------------------------
[ERROR] Failed to execute goal org.apache.maven.plugins:maven-surefire-plugin:2.18:test (secondPartTestsExecution) on project hbase-server: There are test failures.
[ERROR] 
[ERROR] Please refer to <https://builds.apache.org/job/HBase-1.0/ws/hbase-server/target/surefire-reports> for the individual test results.
[ERROR] -> [Help 1]
[ERROR] 
[ERROR] To see the full stack trace of the errors, re-run Maven with the -e switch.
[ERROR] Re-run Maven using the -X switch to enable full debug logging.
[ERROR] 
[ERROR] For more information about the errors and possible solutions, please read the following articles:
[ERROR] [Help 1] http://cwiki.apache.org/confluence/display/MAVEN/MojoFailureException
[ERROR] 
[ERROR] After correcting the problems, you can resume the build with the command
[ERROR]   mvn <goals> -rf :hbase-server
Build step 'Invoke top-level Maven targets' marked build as failure
Performing Post build task...
Match found for :.* : True
Logical operation result is TRUE
Running script  :   ZOMBIE_TESTS_COUNT=`jps | grep surefirebooter | wc -l`
  if [[ $ZOMBIE_TESTS_COUNT != 0 ]] ; then
    #It seems sometimes the tests are not dying immediately. Let's give them 10s
    echo "Suspicious java process found - waiting 10s to see if there are just slow to stop"
    sleep 10   
    ZOMBIE_TESTS_COUNT=`jps | grep surefirebooter | wc -l`
    if [[ $ZOMBIE_TESTS_COUNT != 0 ]] ; then
      echo "There are $ZOMBIE_TESTS_COUNT zombie tests, they should have been killed by surefire but survived"
      echo "************ BEGIN zombies jstack extract"
      ZB_STACK=`jps | grep surefirebooter | cut -d ' ' -f 1 | xargs -n 1 jstack | grep ".test" | grep "\.java"`
      jps | grep surefirebooter | cut -d ' ' -f 1 | xargs -n 1 jstack
      echo "************ END  zombies jstack extract"
      JIRA_COMMENT="$JIRA_COMMENT

     {color:red}-1 core zombie tests{color}.  There are ${ZOMBIE_TESTS_COUNT} zombie test(s): ${ZB_STACK}"
      BAD=1
      jps | grep surefirebooter | cut -d ' ' -f 1 | xargs kill -9
    else
      echo "We're ok: there is no zombie test, but some tests took some time to stop"
    fi
  else
    echo "We're ok: there is no zombie test"
  fi
[HBase-1.0] $ /bin/bash -xe /tmp/hudson9108133505846799665.sh
++ jps
++ grep surefirebooter
++ wc -l
+ ZOMBIE_TESTS_COUNT=0
+ [[ 0 != 0 ]]
+ echo 'We'\''re ok: there is no zombie test'
We're ok: there is no zombie test
POST BUILD TASK : SUCCESS
END OF POST BUILD TASK : 0
Archiving artifacts
Recording test results
Updating HBASE-14571

Build failed in Jenkins: HBase-1.0 #1073

Posted by Apache Jenkins Server <je...@builds.apache.org>.
See <https://builds.apache.org/job/HBase-1.0/1073/changes>

Changes:

[stack] HBASE-14436 HTableDescriptor#addCoprocessor will always make

------------------------------------------
[...truncated 15501 lines...]
"org.apache.hadoop.hdfs.server.blockmanagement.HeartbeatManager$Monitor@4a072e5e" daemon prio=10 tid=0x00007f80c125d000 nid=0x52f4 waiting on condition [0x00007f8095e30000]
   java.lang.Thread.State: TIMED_WAITING (sleeping)
	at java.lang.Thread.sleep(Native Method)
	at org.apache.hadoop.hdfs.server.blockmanagement.HeartbeatManager$Monitor.run(HeartbeatManager.java:373)
	at java.lang.Thread.run(Thread.java:744)

"DecommissionMonitor-0" daemon prio=10 tid=0x00007f80c125a000 nid=0x52f3 waiting on condition [0x00007f8095f31000]
   java.lang.Thread.State: TIMED_WAITING (parking)
	at sun.misc.Unsafe.park(Native Method)
	- parking to wait for  <0x00000007578ddf58> (a java.util.concurrent.locks.AbstractQueuedSynchronizer$ConditionObject)
	at java.util.concurrent.locks.LockSupport.parkNanos(LockSupport.java:226)
	at java.util.concurrent.locks.AbstractQueuedSynchronizer$ConditionObject.awaitNanos(AbstractQueuedSynchronizer.java:2082)
	at java.util.concurrent.ScheduledThreadPoolExecutor$DelayedWorkQueue.take(ScheduledThreadPoolExecutor.java:1090)
	at java.util.concurrent.ScheduledThreadPoolExecutor$DelayedWorkQueue.take(ScheduledThreadPoolExecutor.java:807)
	at java.util.concurrent.ThreadPoolExecutor.getTask(ThreadPoolExecutor.java:1068)
	at java.util.concurrent.ThreadPoolExecutor.runWorker(ThreadPoolExecutor.java:1130)
	at java.util.concurrent.ThreadPoolExecutor$Worker.run(ThreadPoolExecutor.java:615)
	at java.lang.Thread.run(Thread.java:744)

"org.apache.hadoop.hdfs.server.blockmanagement.PendingReplicationBlocks$PendingReplicationMonitor@12adaf4b" daemon prio=10 tid=0x00007f80c1257000 nid=0x52f2 waiting on condition [0x00007f8096032000]
   java.lang.Thread.State: TIMED_WAITING (sleeping)
	at java.lang.Thread.sleep(Native Method)
	at org.apache.hadoop.hdfs.server.blockmanagement.PendingReplicationBlocks$PendingReplicationMonitor.run(PendingReplicationBlocks.java:221)
	at java.lang.Thread.run(Thread.java:744)

"org.apache.hadoop.util.JvmPauseMonitor$Monitor@12bfb51f" daemon prio=10 tid=0x00007f80c124e800 nid=0x52ec sleeping[0x00007f8096234000]
   java.lang.Thread.State: TIMED_WAITING (sleeping)
	at java.lang.Thread.sleep(Native Method)
	at org.apache.hadoop.util.JvmPauseMonitor$Monitor.run(JvmPauseMonitor.java:180)
	at java.lang.Thread.run(Thread.java:744)

"IPC Server idle connection scanner for port 53427" daemon prio=10 tid=0x00007f80c122d800 nid=0x52e9 in Object.wait() [0x00007f8096335000]
   java.lang.Thread.State: TIMED_WAITING (on object monitor)
	at java.lang.Object.wait(Native Method)
	- waiting on <0x00000007d992a5a8> (a java.util.TaskQueue)
	at java.util.TimerThread.mainLoop(Timer.java:552)
	- locked <0x00000007d992a5a8> (a java.util.TaskQueue)
	at java.util.TimerThread.run(Timer.java:505)

"Socket Reader #1 for port 53427" prio=10 tid=0x00007f80c122c000 nid=0x52e7 runnable [0x00007f8096436000]
   java.lang.Thread.State: RUNNABLE
	at sun.nio.ch.EPollArrayWrapper.epollWait(Native Method)
	at sun.nio.ch.EPollArrayWrapper.poll(EPollArrayWrapper.java:269)
	at sun.nio.ch.EPollSelectorImpl.doSelect(EPollSelectorImpl.java:79)
	at sun.nio.ch.SelectorImpl.lockAndDoSelect(SelectorImpl.java:87)
	- locked <0x00000007d99293f8> (a sun.nio.ch.Util$2)
	- locked <0x00000007d99293e8> (a java.util.Collections$UnmodifiableSet)
	- locked <0x00000007d9928a30> (a sun.nio.ch.EPollSelectorImpl)
	at sun.nio.ch.SelectorImpl.select(SelectorImpl.java:98)
	at sun.nio.ch.SelectorImpl.select(SelectorImpl.java:102)
	at org.apache.hadoop.ipc.Server$Listener$Reader.doRunLoop(Server.java:629)
	- locked <0x00000007d992b3c0> (a org.apache.hadoop.ipc.Server$Listener$Reader)
	at org.apache.hadoop.ipc.Server$Listener$Reader.run(Server.java:608)

"Timer-0" daemon prio=10 tid=0x00007f80c1106000 nid=0x528a in Object.wait() [0x00007f8096537000]
   java.lang.Thread.State: TIMED_WAITING (on object monitor)
	at java.lang.Object.wait(Native Method)
	- waiting on <0x00000007578de340> (a java.util.TaskQueue)
	at java.util.TimerThread.mainLoop(Timer.java:552)
	- locked <0x00000007578de340> (a java.util.TaskQueue)
	at java.util.TimerThread.run(Timer.java:505)

"981417241@qtp-897444430-1 - Acceptor0 HttpServer2$SelectChannelConnectorWithSafeStartup@localhost:55424" daemon prio=10 tid=0x00007f80c10f0800 nid=0x527e runnable [0x00007f8096638000]
   java.lang.Thread.State: RUNNABLE
	at sun.nio.ch.EPollArrayWrapper.epollWait(Native Method)
	at sun.nio.ch.EPollArrayWrapper.poll(EPollArrayWrapper.java:269)
	at sun.nio.ch.EPollSelectorImpl.doSelect(EPollSelectorImpl.java:79)
	at sun.nio.ch.SelectorImpl.lockAndDoSelect(SelectorImpl.java:87)
	- locked <0x0000000757d167c8> (a sun.nio.ch.Util$2)
	- locked <0x0000000757d167b8> (a java.util.Collections$UnmodifiableSet)
	- locked <0x0000000757d163e8> (a sun.nio.ch.EPollSelectorImpl)
	at sun.nio.ch.SelectorImpl.select(SelectorImpl.java:98)
	at org.mortbay.io.nio.SelectorManager$SelectSet.doSelect(SelectorManager.java:498)
	at org.mortbay.io.nio.SelectorManager.doSelect(SelectorManager.java:192)
	at org.mortbay.jetty.nio.SelectChannelConnector.accept(SelectChannelConnector.java:124)
	at org.mortbay.jetty.AbstractConnector$Acceptor.run(AbstractConnector.java:708)
	at org.mortbay.thread.QueuedThreadPool$PoolThread.run(QueuedThreadPool.java:582)

"634521453@qtp-897444430-0" daemon prio=10 tid=0x00007f80c10f7000 nid=0x527d in Object.wait() [0x00007f8096739000]
   java.lang.Thread.State: TIMED_WAITING (on object monitor)
	at java.lang.Object.wait(Native Method)
	- waiting on <0x0000000757d16a98> (a org.mortbay.thread.QueuedThreadPool$PoolThread)
	at org.mortbay.thread.QueuedThreadPool$PoolThread.run(QueuedThreadPool.java:626)
	- locked <0x0000000757d16a98> (a org.mortbay.thread.QueuedThreadPool$PoolThread)

"pool-2-thread-1" prio=10 tid=0x00007f80c10a3800 nid=0x527c waiting on condition [0x00007f80971b8000]
   java.lang.Thread.State: TIMED_WAITING (parking)
	at sun.misc.Unsafe.park(Native Method)
	- parking to wait for  <0x0000000757d0d298> (a java.util.concurrent.locks.AbstractQueuedSynchronizer$ConditionObject)
	at java.util.concurrent.locks.LockSupport.parkNanos(LockSupport.java:226)
	at java.util.concurrent.locks.AbstractQueuedSynchronizer$ConditionObject.awaitNanos(AbstractQueuedSynchronizer.java:2082)
	at java.util.concurrent.ScheduledThreadPoolExecutor$DelayedWorkQueue.take(ScheduledThreadPoolExecutor.java:1090)
	at java.util.concurrent.ScheduledThreadPoolExecutor$DelayedWorkQueue.take(ScheduledThreadPoolExecutor.java:807)
	at java.util.concurrent.ThreadPoolExecutor.getTask(ThreadPoolExecutor.java:1068)
	at java.util.concurrent.ThreadPoolExecutor.runWorker(ThreadPoolExecutor.java:1130)
	at java.util.concurrent.ThreadPoolExecutor$Worker.run(ThreadPoolExecutor.java:615)
	at java.lang.Thread.run(Thread.java:744)

"Timer for 'NameNode' metrics system" daemon prio=10 tid=0x00007f80c1061000 nid=0x5254 in Object.wait() [0x00007f809683a000]
   java.lang.Thread.State: TIMED_WAITING (on object monitor)
	at java.lang.Object.wait(Native Method)
	- waiting on <0x0000000757cf8ea8> (a java.util.TaskQueue)
	at java.util.TimerThread.mainLoop(Timer.java:552)
	- locked <0x0000000757cf8ea8> (a java.util.TaskQueue)
	at java.util.TimerThread.run(Timer.java:505)

"process reaper" daemon prio=10 tid=0x00007f80c0c53000 nid=0x51ce waiting on condition [0x00007f80971f1000]
   java.lang.Thread.State: TIMED_WAITING (parking)
	at sun.misc.Unsafe.park(Native Method)
	- parking to wait for  <0x000000075742f9c8> (a java.util.concurrent.SynchronousQueue$TransferStack)
	at java.util.concurrent.locks.LockSupport.parkNanos(LockSupport.java:226)
	at java.util.concurrent.SynchronousQueue$TransferStack.awaitFulfill(SynchronousQueue.java:460)
	at java.util.concurrent.SynchronousQueue$TransferStack.transfer(SynchronousQueue.java:359)
	at java.util.concurrent.SynchronousQueue.poll(SynchronousQueue.java:942)
	at java.util.concurrent.ThreadPoolExecutor.getTask(ThreadPoolExecutor.java:1068)
	at java.util.concurrent.ThreadPoolExecutor.runWorker(ThreadPoolExecutor.java:1130)
	at java.util.concurrent.ThreadPoolExecutor$Worker.run(ThreadPoolExecutor.java:615)
	at java.lang.Thread.run(Thread.java:744)

"Service Thread" daemon prio=10 tid=0x00007f80c0a19000 nid=0x514f runnable [0x0000000000000000]
   java.lang.Thread.State: RUNNABLE

"C2 CompilerThread1" daemon prio=10 tid=0x00007f80c0a15000 nid=0x514e waiting on condition [0x0000000000000000]
   java.lang.Thread.State: RUNNABLE

"C2 CompilerThread0" daemon prio=10 tid=0x00007f80c0927800 nid=0x514d waiting on condition [0x0000000000000000]
   java.lang.Thread.State: RUNNABLE

"Signal Dispatcher" daemon prio=10 tid=0x00007f80c032c800 nid=0x5120 runnable [0x0000000000000000]
   java.lang.Thread.State: RUNNABLE

"Finalizer" daemon prio=10 tid=0x00007f80c0317000 nid=0x511e in Object.wait() [0x00007f80a43bc000]
   java.lang.Thread.State: WAITING (on object monitor)
	at java.lang.Object.wait(Native Method)
	- waiting on <0x0000000757519400> (a java.lang.ref.ReferenceQueue$Lock)
	at java.lang.ref.ReferenceQueue.remove(ReferenceQueue.java:135)
	- locked <0x0000000757519400> (a java.lang.ref.ReferenceQueue$Lock)
	at java.lang.ref.ReferenceQueue.remove(ReferenceQueue.java:151)
	at java.lang.ref.Finalizer$FinalizerThread.run(Finalizer.java:189)

"Reference Handler" daemon prio=10 tid=0x00007f80c0313000 nid=0x511d in Object.wait() [0x00007f805e07e000]
   java.lang.Thread.State: WAITING (on object monitor)
	at java.lang.Object.wait(Native Method)
	- waiting on <0x0000000757518e40> (a java.lang.ref.Reference$Lock)
	at java.lang.Object.wait(Object.java:503)
	at java.lang.ref.Reference$ReferenceHandler.run(Reference.java:133)
	- locked <0x0000000757518e40> (a java.lang.ref.Reference$Lock)

"main" prio=10 tid=0x00007f80c000b800 nid=0x5109 waiting on condition [0x00007f80c8377000]
   java.lang.Thread.State: TIMED_WAITING (sleeping)
	at java.lang.Thread.sleep(Native Method)
	at org.apache.hadoop.hbase.util.JVMClusterUtil.startup(JVMClusterUtil.java:228)
	at org.apache.hadoop.hbase.LocalHBaseCluster.startup(LocalHBaseCluster.java:448)
	at org.apache.hadoop.hbase.MiniHBaseCluster.init(MiniHBaseCluster.java:225)
	at org.apache.hadoop.hbase.MiniHBaseCluster.<init>(MiniHBaseCluster.java:94)
	at org.apache.hadoop.hbase.HBaseTestingUtility.startMiniHBaseCluster(HBaseTestingUtility.java:1075)
	at org.apache.hadoop.hbase.HBaseTestingUtility.startMiniCluster(HBaseTestingUtility.java:1035)
	at org.apache.hadoop.hbase.HBaseTestingUtility.startMiniCluster(HBaseTestingUtility.java:907)
	at org.apache.hadoop.hbase.HBaseTestingUtility.startMiniCluster(HBaseTestingUtility.java:901)
	at org.apache.hadoop.hbase.HBaseTestingUtility.startMiniCluster(HBaseTestingUtility.java:845)
	at org.apache.hadoop.hbase.coprocessor.TestRegionObserverInterface.setupBeforeClass(TestRegionObserverInterface.java:111)
	at sun.reflect.NativeMethodAccessorImpl.invoke0(Native Method)
	at sun.reflect.NativeMethodAccessorImpl.invoke(NativeMethodAccessorImpl.java:57)
	at sun.reflect.DelegatingMethodAccessorImpl.invoke(DelegatingMethodAccessorImpl.java:43)
	at java.lang.reflect.Method.invoke(Method.java:606)
	at org.junit.runners.model.FrameworkMethod$1.runReflectiveCall(FrameworkMethod.java:50)
	at org.junit.internal.runners.model.ReflectiveCallable.run(ReflectiveCallable.java:12)
	at org.junit.runners.model.FrameworkMethod.invokeExplosively(FrameworkMethod.java:47)
	at org.junit.internal.runners.statements.RunBefores.evaluate(RunBefores.java:24)
	at org.junit.internal.runners.statements.RunAfters.evaluate(RunAfters.java:27)
	at org.junit.runners.ParentRunner.run(ParentRunner.java:363)
	at org.junit.runners.Suite.runChild(Suite.java:128)
	at org.junit.runners.Suite.runChild(Suite.java:27)
	at org.junit.runners.ParentRunner$3.run(ParentRunner.java:290)
	at org.junit.runners.ParentRunner$1.schedule(ParentRunner.java:71)
	at org.junit.runners.ParentRunner.runChildren(ParentRunner.java:288)
	at org.junit.runners.ParentRunner.access$000(ParentRunner.java:58)
	at org.junit.runners.ParentRunner$2.evaluate(ParentRunner.java:268)
	at org.junit.runners.ParentRunner.run(ParentRunner.java:363)
	at org.junit.runner.JUnitCore.run(JUnitCore.java:137)
	at org.junit.runner.JUnitCore.run(JUnitCore.java:115)
	at org.apache.maven.surefire.junitcore.JUnitCoreWrapper.createRequestAndRun(JUnitCoreWrapper.java:108)
	at org.apache.maven.surefire.junitcore.JUnitCoreWrapper.executeEager(JUnitCoreWrapper.java:78)
	at org.apache.maven.surefire.junitcore.JUnitCoreWrapper.execute(JUnitCoreWrapper.java:54)
	at org.apache.maven.surefire.junitcore.JUnitCoreProvider.invoke(JUnitCoreProvider.java:144)
	at org.apache.maven.surefire.booter.ForkedBooter.invokeProviderInSameClassLoader(ForkedBooter.java:203)
	at org.apache.maven.surefire.booter.ForkedBooter.runSuitesInProcess(ForkedBooter.java:155)
	at org.apache.maven.surefire.booter.ForkedBooter.main(ForkedBooter.java:103)

"VM Thread" prio=10 tid=0x00007f80c0310800 nid=0x511c runnable 

"GC task thread#0 (ParallelGC)" prio=10 tid=0x00007f80c0021800 nid=0x510a runnable 

"GC task thread#1 (ParallelGC)" prio=10 tid=0x00007f80c0023800 nid=0x510b runnable 

"GC task thread#2 (ParallelGC)" prio=10 tid=0x00007f80c0025000 nid=0x510c runnable 

"GC task thread#3 (ParallelGC)" prio=10 tid=0x00007f80c0027000 nid=0x510d runnable 

"GC task thread#4 (ParallelGC)" prio=10 tid=0x00007f80c0029000 nid=0x510e runnable 

"GC task thread#5 (ParallelGC)" prio=10 tid=0x00007f80c002a800 nid=0x510f runnable 

"GC task thread#6 (ParallelGC)" prio=10 tid=0x00007f80c002c800 nid=0x5110 runnable 

"GC task thread#7 (ParallelGC)" prio=10 tid=0x00007f80c002e800 nid=0x5111 runnable 

"GC task thread#8 (ParallelGC)" prio=10 tid=0x00007f80c0030800 nid=0x5112 runnable 

"GC task thread#9 (ParallelGC)" prio=10 tid=0x00007f80c0032000 nid=0x5113 runnable 

"GC task thread#10 (ParallelGC)" prio=10 tid=0x00007f80c0034000 nid=0x5114 runnable 

"GC task thread#11 (ParallelGC)" prio=10 tid=0x00007f80c0036000 nid=0x5115 runnable 

"GC task thread#12 (ParallelGC)" prio=10 tid=0x00007f80c0037800 nid=0x5116 runnable 

"GC task thread#13 (ParallelGC)" prio=10 tid=0x00007f80c0039800 nid=0x5117 runnable 

"GC task thread#14 (ParallelGC)" prio=10 tid=0x00007f80c003b800 nid=0x5118 runnable 

"GC task thread#15 (ParallelGC)" prio=10 tid=0x00007f80c003d800 nid=0x5119 runnable 

"GC task thread#16 (ParallelGC)" prio=10 tid=0x00007f80c003f000 nid=0x511a runnable 

"GC task thread#17 (ParallelGC)" prio=10 tid=0x00007f80c0041000 nid=0x511b runnable 

"VM Periodic Task Thread" prio=10 tid=0x00007f80c0a1b800 nid=0x5150 waiting on condition 

JNI global references: 233

+ echo '************ END  zombies jstack extract'
************ END  zombies jstack extract
+ JIRA_COMMENT='

     {color:red}-1 core zombie tests{color}.  There are 7 zombie test(s): 	at org.apache.camel.itest.async.HttpJmsAsyncTimeoutTest.testHttpJmsAsync(HttpJmsAsyncTimeoutTest.java:40)
	at org.apache.hadoop.hbase.filter.TestFuzzyRowFilterEndToEnd.testEndToEnd(TestFuzzyRowFilterEndToEnd.java:143)
	at org.apache.hadoop.hbase.coprocessor.TestMasterCoprocessorExceptionWithRemove.testExceptionFromCoprocessorWhenCreatingTable(TestMasterCoprocessorExceptionWithRemove.java:224)
	at org.apache.camel.component.jetty.jettyproducer.HttpJettyProducerRecipientListCustomThreadPoolTest.testRecipientList(HttpJettyProducerRecipientListCustomThreadPoolTest.java:40)'
+ BAD=1
+ jps
+ grep surefirebooter
+ cut -d ' ' -f 1
+ xargs kill -9
POST BUILD TASK : SUCCESS
END OF POST BUILD TASK : 0
Archiving artifacts
Recording test results
Updating HBASE-14436

Build failed in Jenkins: HBase-1.0 #1072

Posted by Apache Jenkins Server <je...@builds.apache.org>.
See <https://builds.apache.org/job/HBase-1.0/1072/changes>

Changes:

[matteo.bertozzi] HBASE-14347 Add a switch to DynamicClassLoader to disable it (huaxiang

------------------------------------------
[...truncated 2573 lines...]
Running org.apache.hadoop.hbase.regionserver.wal.TestFSHLog
Running org.apache.hadoop.hbase.regionserver.wal.TestLogRollPeriod
Running org.apache.hadoop.hbase.regionserver.wal.TestSecureWALReplay
Tests run: 6, Failures: 0, Errors: 0, Skipped: 0, Time elapsed: 4.722 sec - in org.apache.hadoop.hbase.regionserver.wal.TestFSHLog
Running org.apache.hadoop.hbase.regionserver.wal.TestWALReplayCompressed
Tests run: 2, Failures: 0, Errors: 0, Skipped: 0, Time elapsed: 21.402 sec - in org.apache.hadoop.hbase.regionserver.wal.TestLogRollAbort
Running org.apache.hadoop.hbase.regionserver.wal.TestWALReplay
Tests run: 9, Failures: 0, Errors: 0, Skipped: 0, Time elapsed: 38.702 sec - in org.apache.hadoop.hbase.regionserver.wal.TestSecureWALReplay
Running org.apache.hadoop.hbase.regionserver.wal.TestDurability
Tests run: 9, Failures: 0, Errors: 0, Skipped: 0, Time elapsed: 36.807 sec - in org.apache.hadoop.hbase.regionserver.wal.TestWALReplayCompressed
Tests run: 2, Failures: 0, Errors: 0, Skipped: 0, Time elapsed: 2.404 sec - in org.apache.hadoop.hbase.regionserver.wal.TestDurability
Tests run: 2, Failures: 0, Errors: 0, Skipped: 0, Time elapsed: 51.022 sec - in org.apache.hadoop.hbase.regionserver.wal.TestLogRollPeriod
Running org.apache.hadoop.hbase.regionserver.TestParallelPut
Running org.apache.hadoop.hbase.regionserver.TestMajorCompaction
Running org.apache.hadoop.hbase.regionserver.wal.TestProtobufLog
Tests run: 1, Failures: 0, Errors: 0, Skipped: 0, Time elapsed: 1.509 sec - in org.apache.hadoop.hbase.regionserver.wal.TestProtobufLog
Running org.apache.hadoop.hbase.regionserver.TestRegionReplicas
Tests run: 9, Failures: 0, Errors: 0, Skipped: 0, Time elapsed: 36.954 sec - in org.apache.hadoop.hbase.regionserver.wal.TestWALReplay
Running org.apache.hadoop.hbase.regionserver.TestEncryptionKeyRotation
Tests run: 2, Failures: 0, Errors: 0, Skipped: 0, Time elapsed: 12.792 sec - in org.apache.hadoop.hbase.regionserver.TestEncryptionKeyRotation
Running org.apache.hadoop.hbase.regionserver.TestFlushRegionEntry
Tests run: 1, Failures: 0, Errors: 0, Skipped: 0, Time elapsed: 0.869 sec - in org.apache.hadoop.hbase.regionserver.TestFlushRegionEntry
Running org.apache.hadoop.hbase.regionserver.TestZKLessSplitOnCluster
Tests run: 7, Failures: 0, Errors: 0, Skipped: 0, Time elapsed: 48.174 sec - in org.apache.hadoop.hbase.regionserver.TestMajorCompaction
Running org.apache.hadoop.hbase.regionserver.TestCompactionState
Tests run: 2, Failures: 0, Errors: 0, Skipped: 0, Time elapsed: 73.253 sec - in org.apache.hadoop.hbase.regionserver.TestParallelPut
Running org.apache.hadoop.hbase.regionserver.TestFSErrorsExposed
Tests run: 16, Failures: 0, Errors: 0, Skipped: 0, Time elapsed: 34.025 sec - in org.apache.hadoop.hbase.regionserver.TestZKLessSplitOnCluster
Running org.apache.hadoop.hbase.regionserver.TestDefaultMemStore
Tests run: 5, Failures: 0, Errors: 0, Skipped: 0, Time elapsed: 26.811 sec - in org.apache.hadoop.hbase.regionserver.TestCompactionState
Running org.apache.hadoop.hbase.regionserver.TestRegionServerMetrics
Tests run: 9, Failures: 0, Errors: 0, Skipped: 0, Time elapsed: 4.786 sec - in org.apache.hadoop.hbase.regionserver.TestRegionServerMetrics
Running org.apache.hadoop.hbase.regionserver.TestGetClosestAtOrBefore
Tests run: 3, Failures: 0, Errors: 0, Skipped: 0, Time elapsed: 1.713 sec - in org.apache.hadoop.hbase.regionserver.TestGetClosestAtOrBefore
Running org.apache.hadoop.hbase.regionserver.TestRSKilledWhenInitializing
Tests run: 3, Failures: 0, Errors: 0, Skipped: 0, Time elapsed: 30.765 sec - in org.apache.hadoop.hbase.regionserver.TestFSErrorsExposed
Running org.apache.hadoop.hbase.regionserver.TestReversibleScanners
Tests run: 5, Failures: 0, Errors: 0, Skipped: 0, Time elapsed: 3.657 sec - in org.apache.hadoop.hbase.regionserver.TestReversibleScanners
Running org.apache.hadoop.hbase.regionserver.TestRecoveredEdits
Tests run: 23, Failures: 0, Errors: 0, Skipped: 0, Time elapsed: 39.485 sec - in org.apache.hadoop.hbase.regionserver.TestDefaultMemStore
Tests run: 1, Failures: 0, Errors: 0, Skipped: 0, Time elapsed: 17.059 sec - in org.apache.hadoop.hbase.regionserver.TestRSKilledWhenInitializing
Tests run: 1, Failures: 0, Errors: 0, Skipped: 0, Time elapsed: 10.556 sec - in org.apache.hadoop.hbase.regionserver.TestRecoveredEdits
Running org.apache.hadoop.hbase.regionserver.TestRegionServerNoMaster
Running org.apache.hadoop.hbase.regionserver.TestScannerRetriableFailure
Running org.apache.hadoop.hbase.regionserver.TestScannerWithBulkload
Tests run: 3, Failures: 0, Errors: 0, Skipped: 0, Time elapsed: 6.639 sec - in org.apache.hadoop.hbase.regionserver.TestScannerWithBulkload
Running org.apache.hadoop.hbase.regionserver.TestClusterId
Tests run: 9, Failures: 0, Errors: 0, Skipped: 0, Time elapsed: 17.046 sec - in org.apache.hadoop.hbase.regionserver.TestRegionServerNoMaster
Running org.apache.hadoop.hbase.regionserver.TestCompaction
Tests run: 1, Failures: 0, Errors: 0, Skipped: 0, Time elapsed: 33.284 sec - in org.apache.hadoop.hbase.regionserver.TestScannerRetriableFailure
Tests run: 2, Failures: 0, Errors: 0, Skipped: 0, Time elapsed: 25.884 sec - in org.apache.hadoop.hbase.regionserver.TestClusterId
Tests run: 7, Failures: 0, Errors: 0, Skipped: 0, Time elapsed: 156.147 sec - in org.apache.hadoop.hbase.regionserver.TestRegionReplicas
Tests run: 5, Failures: 0, Errors: 0, Skipped: 0, Time elapsed: 21.675 sec - in org.apache.hadoop.hbase.regionserver.TestCompaction
Running org.apache.hadoop.hbase.regionserver.TestHRegion
Running org.apache.hadoop.hbase.regionserver.TestSeekOptimizations
Running org.apache.hadoop.hbase.regionserver.TestServerCustomProtocol
Tests run: 6, Failures: 0, Errors: 0, Skipped: 0, Time elapsed: 5.096 sec - in org.apache.hadoop.hbase.regionserver.TestSeekOptimizations
Running org.apache.hadoop.hbase.regionserver.TestAtomicOperation
Running org.apache.hadoop.hbase.regionserver.TestRegionFavoredNodes
Tests run: 1, Failures: 0, Errors: 0, Skipped: 0, Time elapsed: 8.763 sec - in org.apache.hadoop.hbase.regionserver.TestRegionFavoredNodes
Tests run: 7, Failures: 0, Errors: 0, Skipped: 0, Time elapsed: 13.768 sec - in org.apache.hadoop.hbase.regionserver.TestServerCustomProtocol
Running org.apache.hadoop.hbase.regionserver.TestCompactionWithCoprocessor
Running org.apache.hadoop.hbase.regionserver.TestSplitTransactionOnCluster
Tests run: 5, Failures: 0, Errors: 0, Skipped: 0, Time elapsed: 261.733 sec - in org.apache.hadoop.hbase.regionserver.wal.TestLogRolling
Running org.apache.hadoop.hbase.regionserver.TestHRegionServerBulkLoad
Tests run: 5, Failures: 0, Errors: 0, Skipped: 0, Time elapsed: 27.149 sec - in org.apache.hadoop.hbase.regionserver.TestCompactionWithCoprocessor
Tests run: 6, Failures: 0, Errors: 0, Skipped: 0, Time elapsed: 48.805 sec - in org.apache.hadoop.hbase.regionserver.TestAtomicOperation
Running org.apache.hadoop.hbase.regionserver.TestZKLessMergeOnCluster
Tests run: 16, Failures: 0, Errors: 0, Skipped: 0, Time elapsed: 46.287 sec - in org.apache.hadoop.hbase.regionserver.TestSplitTransactionOnCluster
Tests run: 3, Failures: 0, Errors: 0, Skipped: 0, Time elapsed: 11.68 sec - in org.apache.hadoop.hbase.regionserver.TestZKLessMergeOnCluster
Tests run: 1, Failures: 0, Errors: 0, Skipped: 0, Time elapsed: 41.709 sec - in org.apache.hadoop.hbase.regionserver.TestHRegionServerBulkLoad
Running org.apache.hadoop.hbase.regionserver.TestRegionServerOnlineConfigChange
Running org.apache.hadoop.hbase.TestRegionRebalancing
Tests run: 2, Failures: 0, Errors: 0, Skipped: 0, Time elapsed: 1.228 sec - in org.apache.hadoop.hbase.regionserver.TestRegionServerOnlineConfigChange
Running org.apache.hadoop.hbase.io.encoding.TestEncodedSeekers
Running org.apache.hadoop.hbase.regionserver.TestEndToEndSplitTransaction
Running org.apache.hadoop.hbase.regionserver.TestEncryptionRandomKeying
Tests run: 1, Failures: 0, Errors: 0, Skipped: 0, Time elapsed: 1.41 sec - in org.apache.hadoop.hbase.regionserver.TestEncryptionRandomKeying
Running org.apache.hadoop.hbase.io.encoding.TestDataBlockEncoders
Tests run: 2, Failures: 0, Errors: 0, Skipped: 0, Time elapsed: 13.564 sec - in org.apache.hadoop.hbase.regionserver.TestEndToEndSplitTransaction
Running org.apache.hadoop.hbase.io.encoding.TestChangingEncoding
Tests run: 2, Failures: 0, Errors: 0, Skipped: 0, Time elapsed: 28.749 sec - in org.apache.hadoop.hbase.TestRegionRebalancing
Running org.apache.hadoop.hbase.io.encoding.TestLoadAndSwitchEncodeOnDisk
Tests run: 1, Failures: 0, Errors: 0, Skipped: 0, Time elapsed: 21.764 sec - in org.apache.hadoop.hbase.io.encoding.TestLoadAndSwitchEncodeOnDisk
Running org.apache.hadoop.hbase.io.encoding.TestBufferedDataBlockEncoder
Tests run: 96, Failures: 0, Errors: 0, Skipped: 0, Time elapsed: 145.385 sec - in org.apache.hadoop.hbase.regionserver.TestHRegion
Running org.apache.hadoop.hbase.io.hfile.TestCacheOnWrite
Tests run: 1, Failures: 0, Errors: 0, Skipped: 0, Time elapsed: 20.441 sec - in org.apache.hadoop.hbase.io.encoding.TestBufferedDataBlockEncoder
Running org.apache.hadoop.hbase.io.hfile.TestCacheConfig
Tests run: 6, Failures: 0, Errors: 0, Skipped: 0, Time elapsed: 2.268 sec - in org.apache.hadoop.hbase.io.hfile.TestCacheConfig
Running org.apache.hadoop.hbase.io.hfile.TestHFileSeek
Tests run: 1, Failures: 0, Errors: 0, Skipped: 0, Time elapsed: 2.241 sec - in org.apache.hadoop.hbase.io.hfile.TestHFileSeek
Tests run: 3, Failures: 0, Errors: 0, Skipped: 0, Time elapsed: 57.935 sec - in org.apache.hadoop.hbase.io.encoding.TestChangingEncoding
Running org.apache.hadoop.hbase.io.hfile.TestHFileBlock
Running org.apache.hadoop.hbase.io.hfile.TestForceCacheImportantBlocks
Tests run: 4, Failures: 0, Errors: 0, Skipped: 0, Time elapsed: 48.057 sec - in org.apache.hadoop.hbase.io.hfile.TestForceCacheImportantBlocks
Running org.apache.hadoop.hbase.io.hfile.TestScannerSelectionUsingTTL
Tests run: 20, Failures: 0, Errors: 0, Skipped: 0, Time elapsed: 160.143 sec - in org.apache.hadoop.hbase.io.encoding.TestEncodedSeekers
Running org.apache.hadoop.hbase.io.hfile.TestHFileBlockIndex
Tests run: 10, Failures: 0, Errors: 0, Skipped: 0, Time elapsed: 11.219 sec - in org.apache.hadoop.hbase.io.hfile.TestHFileBlockIndex
Running org.apache.hadoop.hbase.io.TestFileLink
Tests run: 28, Failures: 0, Errors: 0, Skipped: 0, Time elapsed: 95.229 sec - in org.apache.hadoop.hbase.io.hfile.TestHFileBlock
Tests run: 3, Failures: 0, Errors: 0, Skipped: 0, Time elapsed: 12.67 sec - in org.apache.hadoop.hbase.io.TestFileLink
Running org.apache.hadoop.hbase.security.access.TestAccessController
Running org.apache.hadoop.hbase.security.access.TestTablePermissions
Tests run: 6, Failures: 0, Errors: 0, Skipped: 0, Time elapsed: 62.91 sec - in org.apache.hadoop.hbase.io.hfile.TestScannerSelectionUsingTTL
Tests run: 7, Failures: 0, Errors: 0, Skipped: 0, Time elapsed: 16.821 sec - in org.apache.hadoop.hbase.security.access.TestTablePermissions
Running org.apache.hadoop.hbase.security.access.TestCellACLs
Running org.apache.hadoop.hbase.security.access.TestAccessControlFilter
Tests run: 2, Failures: 0, Errors: 0, Skipped: 0, Time elapsed: 6.954 sec - in org.apache.hadoop.hbase.security.access.TestCellACLs
Tests run: 54, Failures: 0, Errors: 0, Skipped: 0, Time elapsed: 27.544 sec - in org.apache.hadoop.hbase.security.access.TestAccessController
Tests run: 1, Failures: 0, Errors: 0, Skipped: 0, Time elapsed: 2.015 sec - in org.apache.hadoop.hbase.security.access.TestAccessControlFilter
Tests run: 72, Failures: 0, Errors: 0, Skipped: 0, Time elapsed: 157.337 sec - in org.apache.hadoop.hbase.io.hfile.TestCacheOnWrite
Running org.apache.hadoop.hbase.security.access.TestCellACLWithMultipleVersions
Running org.apache.hadoop.hbase.security.access.TestNamespaceCommands
Running org.apache.hadoop.hbase.security.access.TestAccessController2
Running org.apache.hadoop.hbase.security.access.TestZKPermissionsWatcher
Tests run: 7, Failures: 0, Errors: 0, Skipped: 0, Time elapsed: 4.938 sec - in org.apache.hadoop.hbase.security.access.TestNamespaceCommands
Tests run: 1, Failures: 0, Errors: 0, Skipped: 0, Time elapsed: 3.466 sec - in org.apache.hadoop.hbase.security.access.TestZKPermissionsWatcher
Tests run: 5, Failures: 0, Errors: 0, Skipped: 0, Time elapsed: 11.291 sec - in org.apache.hadoop.hbase.security.access.TestAccessController2
Running org.apache.hadoop.hbase.security.access.TestWithDisabledAuthorization
Running org.apache.hadoop.hbase.security.access.TestScanEarlyTermination
Tests run: 8, Failures: 0, Errors: 0, Skipped: 0, Time elapsed: 18.656 sec - in org.apache.hadoop.hbase.security.access.TestCellACLWithMultipleVersions
Tests run: 1, Failures: 0, Errors: 0, Skipped: 0, Time elapsed: 2.743 sec - in org.apache.hadoop.hbase.security.access.TestScanEarlyTermination
Running org.apache.hadoop.hbase.security.visibility.TestVisibilityLablesWithGroups
Tests run: 1, Failures: 0, Errors: 0, Skipped: 0, Time elapsed: 1.389 sec - in org.apache.hadoop.hbase.security.visibility.TestVisibilityLablesWithGroups
Running org.apache.hadoop.hbase.security.visibility.TestVisibilityLabelsWithDeletes
Tests run: 6, Failures: 0, Errors: 0, Skipped: 0, Time elapsed: 13.1 sec - in org.apache.hadoop.hbase.security.access.TestWithDisabledAuthorization
Running org.apache.hadoop.hbase.security.visibility.TestVisibilityLabelsWithDefaultVisLabelService
Running org.apache.hadoop.hbase.security.visibility.TestVisibilityLabelsWithCustomVisLabService
Running org.apache.hadoop.hbase.security.visibility.TestDefaultScanLabelGeneratorStack
Tests run: 1, Failures: 0, Errors: 0, Skipped: 0, Time elapsed: 1.61 sec - in org.apache.hadoop.hbase.security.visibility.TestDefaultScanLabelGeneratorStack
Tests run: 19, Failures: 0, Errors: 0, Skipped: 0, Time elapsed: 12.912 sec - in org.apache.hadoop.hbase.security.visibility.TestVisibilityLabelsWithCustomVisLabService
Tests run: 23, Failures: 0, Errors: 0, Skipped: 0, Time elapsed: 16.364 sec - in org.apache.hadoop.hbase.security.visibility.TestVisibilityLabelsWithDefaultVisLabelService
Running org.apache.hadoop.hbase.security.visibility.TestVisibilityWithCheckAuths
Tests run: 2, Failures: 0, Errors: 0, Skipped: 0, Time elapsed: 2.551 sec - in org.apache.hadoop.hbase.security.visibility.TestVisibilityWithCheckAuths
Running org.apache.hadoop.hbase.security.visibility.TestVisibilityLabelsOpWithDifferentUsersNoACL
Tests run: 1, Failures: 0, Errors: 0, Skipped: 0, Time elapsed: 1.451 sec - in org.apache.hadoop.hbase.security.visibility.TestVisibilityLabelsOpWithDifferentUsersNoACL
Running org.apache.hadoop.hbase.security.visibility.TestVisibilityLabelsWithSLGStack
Running org.apache.hadoop.hbase.security.visibility.TestVisibilityLabelsReplication
Tests run: 28, Failures: 0, Errors: 0, Skipped: 0, Time elapsed: 282.192 sec - in org.apache.hadoop.hbase.io.encoding.TestDataBlockEncoders
Tests run: 1, Failures: 0, Errors: 0, Skipped: 0, Time elapsed: 1.722 sec - in org.apache.hadoop.hbase.security.visibility.TestVisibilityLabelsWithSLGStack
Running org.apache.hadoop.hbase.security.visibility.TestVisibilityLabelReplicationWithExpAsString
Running org.apache.hadoop.hbase.security.visibility.TestEnforcingScanLabelGenerator
Tests run: 1, Failures: 0, Errors: 0, Skipped: 0, Time elapsed: 1.411 sec - in org.apache.hadoop.hbase.security.visibility.TestEnforcingScanLabelGenerator
Running org.apache.hadoop.hbase.security.visibility.TestVisibilityLabelsWithACL
Tests run: 39, Failures: 0, Errors: 0, Skipped: 0, Time elapsed: 42.202 sec - in org.apache.hadoop.hbase.security.visibility.TestVisibilityLabelsWithDeletes
Running org.apache.hadoop.hbase.security.token.TestZKSecretWatcher
Running org.apache.hadoop.hbase.security.visibility.TestWithDisabledAuthorization
Tests run: 5, Failures: 0, Errors: 0, Skipped: 0, Time elapsed: 3.995 sec - in org.apache.hadoop.hbase.security.visibility.TestVisibilityLabelsWithACL
Tests run: 2, Failures: 0, Errors: 0, Skipped: 0, Time elapsed: 1.602 sec - in org.apache.hadoop.hbase.security.visibility.TestWithDisabledAuthorization
Tests run: 1, Failures: 0, Errors: 0, Skipped: 0, Time elapsed: 18.947 sec - in org.apache.hadoop.hbase.security.visibility.TestVisibilityLabelsReplication
Tests run: 1, Failures: 0, Errors: 0, Skipped: 0, Time elapsed: 17.788 sec - in org.apache.hadoop.hbase.security.visibility.TestVisibilityLabelReplicationWithExpAsString
Running org.apache.hadoop.hbase.security.token.TestTokenAuthentication
Tests run: 3, Failures: 0, Errors: 0, Skipped: 0, Time elapsed: 0.454 sec - in org.apache.hadoop.hbase.security.token.TestTokenAuthentication
Running org.apache.hadoop.hbase.TestHBaseOnOtherDfsCluster
Tests run: 1, Failures: 0, Errors: 0, Skipped: 0, Time elapsed: 13.26 sec - in org.apache.hadoop.hbase.security.token.TestZKSecretWatcher
Tests run: 1, Failures: 0, Errors: 0, Skipped: 0, Time elapsed: 9.37 sec - in org.apache.hadoop.hbase.TestHBaseOnOtherDfsCluster

Results :


Tests in error: 
  TestSnapshotCloneIndependence.testOfflineSnapshotDeleteIndependent:177->runTestSnapshotDeleteIndependent:424 » RetriesExhausted


Tests run: 2241, Failures: 0, Errors: 1, Skipped: 18

[INFO] ------------------------------------------------------------------------
[INFO] Reactor Summary:
[INFO] 
[INFO] Apache HBase ...................................... SUCCESS [5.387s]
[INFO] Apache HBase - Checkstyle ......................... SUCCESS [0.960s]
[INFO] Apache HBase - Resource Bundle .................... SUCCESS [0.226s]
[INFO] Apache HBase - Annotations ........................ SUCCESS [0.943s]
[INFO] Apache HBase - Common ............................. SUCCESS [1:00.034s]
[INFO] Apache HBase - Protocol ........................... SUCCESS [8.997s]
[INFO] Apache HBase - Client ............................. SUCCESS [1:20.059s]
[INFO] Apache HBase - Hadoop Compatibility ............... SUCCESS [7.314s]
[INFO] Apache HBase - Hadoop Two Compatibility ........... SUCCESS [7.043s]
[INFO] Apache HBase - Prefix Tree ........................ SUCCESS [8.723s]
[INFO] Apache HBase - Server ............................. FAILURE [1:09:01.724s]
[INFO] Apache HBase - Testing Util ....................... SKIPPED
[INFO] Apache HBase - Thrift ............................. SKIPPED
[INFO] Apache HBase - Rest ............................... SKIPPED
[INFO] Apache HBase - Shell .............................. SKIPPED
[INFO] Apache HBase - Integration Tests .................. SKIPPED
[INFO] Apache HBase - Examples ........................... SKIPPED
[INFO] Apache HBase - Assembly ........................... SKIPPED
[INFO] ------------------------------------------------------------------------
[INFO] BUILD FAILURE
[INFO] ------------------------------------------------------------------------
[INFO] Total time: 1:12:03.531s
[INFO] Finished at: Tue Oct 06 00:48:19 UTC 2015
[INFO] Final Memory: 48M/558M
[INFO] ------------------------------------------------------------------------
[ERROR] Failed to execute goal org.apache.maven.plugins:maven-surefire-plugin:2.18:test (secondPartTestsExecution) on project hbase-server: There are test failures.
[ERROR] 
[ERROR] Please refer to <https://builds.apache.org/job/HBase-1.0/ws/hbase-server/target/surefire-reports> for the individual test results.
[ERROR] -> [Help 1]
[ERROR] 
[ERROR] To see the full stack trace of the errors, re-run Maven with the -e switch.
[ERROR] Re-run Maven using the -X switch to enable full debug logging.
[ERROR] 
[ERROR] For more information about the errors and possible solutions, please read the following articles:
[ERROR] [Help 1] http://cwiki.apache.org/confluence/display/MAVEN/MojoFailureException
[ERROR] 
[ERROR] After correcting the problems, you can resume the build with the command
[ERROR]   mvn <goals> -rf :hbase-server
Build step 'Invoke top-level Maven targets' marked build as failure
Performing Post build task...
Match found for :.* : True
Logical operation result is TRUE
Running script  :   ZOMBIE_TESTS_COUNT=`jps | grep surefirebooter | wc -l`
  if [[ $ZOMBIE_TESTS_COUNT != 0 ]] ; then
    #It seems sometimes the tests are not dying immediately. Let's give them 10s
    echo "Suspicious java process found - waiting 10s to see if there are just slow to stop"
    sleep 10   
    ZOMBIE_TESTS_COUNT=`jps | grep surefirebooter | wc -l`
    if [[ $ZOMBIE_TESTS_COUNT != 0 ]] ; then
      echo "There are $ZOMBIE_TESTS_COUNT zombie tests, they should have been killed by surefire but survived"
      echo "************ BEGIN zombies jstack extract"
      ZB_STACK=`jps | grep surefirebooter | cut -d ' ' -f 1 | xargs -n 1 jstack | grep ".test" | grep "\.java"`
      jps | grep surefirebooter | cut -d ' ' -f 1 | xargs -n 1 jstack
      echo "************ END  zombies jstack extract"
      JIRA_COMMENT="$JIRA_COMMENT

     {color:red}-1 core zombie tests{color}.  There are ${ZOMBIE_TESTS_COUNT} zombie test(s): ${ZB_STACK}"
      BAD=1
      jps | grep surefirebooter | cut -d ' ' -f 1 | xargs kill -9
    else
      echo "We're ok: there is no zombie test, but some tests took some time to stop"
    fi
  else
    echo "We're ok: there is no zombie test"
  fi
[HBase-1.0] $ /bin/bash -xe /tmp/hudson255290485385969096.sh
++ jps
++ grep surefirebooter
++ wc -l
+ ZOMBIE_TESTS_COUNT=0
+ [[ 0 != 0 ]]
+ echo 'We'\''re ok: there is no zombie test'
We're ok: there is no zombie test
POST BUILD TASK : SUCCESS
END OF POST BUILD TASK : 0
Archiving artifacts
Recording test results
Updating HBASE-14347

Build failed in Jenkins: HBase-1.0 #1071

Posted by Apache Jenkins Server <je...@builds.apache.org>.
See <https://builds.apache.org/job/HBase-1.0/1071/changes>

Changes:

[stack] HBASE-14545 TestMasterFailover often times out

------------------------------------------
[...truncated 2543 lines...]
[INFO] Skipping JaCoCo execution
[INFO] 
[INFO] --- maven-jar-plugin:2.4:test-jar (default) @ hbase-it ---
[INFO] Building jar: <https://builds.apache.org/job/HBase-1.0/ws/hbase-it/target/hbase-it-1.0.3-SNAPSHOT-tests.jar>
[INFO] 
[INFO] --- maven-jar-plugin:2.4:jar (default-jar) @ hbase-it ---
[INFO] Building jar: <https://builds.apache.org/job/HBase-1.0/ws/hbase-it/target/hbase-it-1.0.3-SNAPSHOT.jar>
[INFO] 
[INFO] --- maven-failsafe-plugin:2.18:integration-test (integration-test) @ hbase-it ---
[WARNING] The parameter forkMode is deprecated since version 2.14. Use forkCount and reuseForks instead.
[WARNING] File encoding has not been set, using platform encoding ISO-8859-1, i.e. build is platform dependent!
[INFO] 
[INFO] --- maven-failsafe-plugin:2.18:verify (verify) @ hbase-it ---
[INFO] Failsafe report directory: <https://builds.apache.org/job/HBase-1.0/ws/hbase-it/target/failsafe-reports>
[WARNING] File encoding has not been set, using platform encoding ISO-8859-1, i.e. build is platform dependent!
[INFO] 
[INFO] --- maven-install-plugin:2.3.1:install (default-install) @ hbase-it ---
[INFO] Installing <https://builds.apache.org/job/HBase-1.0/ws/hbase-it/target/hbase-it-1.0.3-SNAPSHOT.jar> to /home/jenkins/.m2/repository/org/apache/hbase/hbase-it/1.0.3-SNAPSHOT/hbase-it-1.0.3-SNAPSHOT.jar
[INFO] Installing <https://builds.apache.org/job/HBase-1.0/ws/hbase-it/pom.xml> to /home/jenkins/.m2/repository/org/apache/hbase/hbase-it/1.0.3-SNAPSHOT/hbase-it-1.0.3-SNAPSHOT.pom
[INFO] Installing <https://builds.apache.org/job/HBase-1.0/ws/hbase-it/target/hbase-it-1.0.3-SNAPSHOT-tests.jar> to /home/jenkins/.m2/repository/org/apache/hbase/hbase-it/1.0.3-SNAPSHOT/hbase-it-1.0.3-SNAPSHOT-tests.jar
[INFO]                                                                         
[INFO] ------------------------------------------------------------------------
[INFO] Building Apache HBase - Examples 1.0.3-SNAPSHOT
[INFO] ------------------------------------------------------------------------
[INFO] 
[INFO] --- maven-enforcer-plugin:1.0.1:enforce (enforce) @ hbase-examples ---
[INFO] 
[INFO] --- buildnumber-maven-plugin:1.3:create-timestamp (default) @ hbase-examples ---
[INFO] 
[INFO] --- jacoco-maven-plugin:0.6.2.201302030002:prepare-agent (prepare-agent) @ hbase-examples ---
[INFO] Skipping JaCoCo execution
[INFO] argLine set to 
[INFO] 
[INFO] --- maven-remote-resources-plugin:1.5:process (default) @ hbase-examples ---
[INFO] 
[INFO] --- maven-resources-plugin:2.6:resources (default-resources) @ hbase-examples ---
[INFO] Using 'UTF-8' encoding to copy filtered resources.
[INFO] skip non existing resourceDirectory <https://builds.apache.org/job/HBase-1.0/ws/hbase-examples/src/main/resources>
[INFO] Copying 3 resources
[INFO] 
[INFO] --- maven-compiler-plugin:2.5.1:compile (default-compile) @ hbase-examples ---
[INFO] Compiling 12 source files to <https://builds.apache.org/job/HBase-1.0/ws/hbase-examples/target/classes>
[INFO] 
[INFO] --- maven-dependency-plugin:2.1:build-classpath (create-mrapp-generated-classpath) @ hbase-examples ---
[INFO] Wrote classpath file '<https://builds.apache.org/job/HBase-1.0/ws/hbase-examples/target/test-classes/mrapp-generated-classpath'.>
[INFO] 
[INFO] --- maven-resources-plugin:2.6:testResources (default-testResources) @ hbase-examples ---
[INFO] Using 'UTF-8' encoding to copy filtered resources.
[INFO] skip non existing resourceDirectory <https://builds.apache.org/job/HBase-1.0/ws/hbase-examples/src/test/resources>
[INFO] Copying 3 resources
[INFO] 
[INFO] --- maven-compiler-plugin:2.5.1:testCompile (default-testCompile) @ hbase-examples ---
[INFO] Compiling 5 source files to <https://builds.apache.org/job/HBase-1.0/ws/hbase-examples/target/test-classes>
[INFO] 
[INFO] --- maven-surefire-plugin:2.18:test (default-test) @ hbase-examples ---
[INFO] Surefire report directory: <https://builds.apache.org/job/HBase-1.0/ws/hbase-examples/target/surefire-reports>
[INFO] Using configured provider org.apache.maven.surefire.junitcore.JUnitCoreProvider
[INFO] parallel='none', perCoreThreadCount=true, threadCount=0, useUnlimitedThreads=false, threadCountSuites=0, threadCountClasses=0, threadCountMethods=0, parallelOptimized=true

-------------------------------------------------------
 T E S T S
-------------------------------------------------------

Results :




Tests run: 0, Failures: 0, Errors: 0, Skipped: 0

[INFO] 
[INFO] --- maven-surefire-plugin:2.18:test (secondPartTestsExecution) @ hbase-examples ---
[INFO] Surefire report directory: <https://builds.apache.org/job/HBase-1.0/ws/hbase-examples/target/surefire-reports>
[INFO] Using configured provider org.apache.maven.surefire.junitcore.JUnitCoreProvider
[INFO] parallel='none', perCoreThreadCount=true, threadCount=0, useUnlimitedThreads=false, threadCountSuites=0, threadCountClasses=0, threadCountMethods=0, parallelOptimized=true

-------------------------------------------------------
 T E S T S
-------------------------------------------------------
Running org.apache.hadoop.hbase.mapreduce.TestMapReduceExamples
Tests run: 4, Failures: 0, Errors: 0, Skipped: 0, Time elapsed: 1.165 sec - in org.apache.hadoop.hbase.mapreduce.TestMapReduceExamples

Results :




Tests run: 4, Failures: 0, Errors: 0, Skipped: 0

[INFO] 
[INFO] --- jacoco-maven-plugin:0.6.2.201302030002:report (report) @ hbase-examples ---
[INFO] Skipping JaCoCo execution
[INFO] 
[INFO] --- maven-source-plugin:2.2.1:jar-no-fork (attach-sources) @ hbase-examples ---
[INFO] Building jar: <https://builds.apache.org/job/HBase-1.0/ws/hbase-examples/target/hbase-examples-1.0.3-SNAPSHOT-sources.jar>
[INFO] 
[INFO] --- maven-jar-plugin:2.4:test-jar (default) @ hbase-examples ---
[INFO] Building jar: <https://builds.apache.org/job/HBase-1.0/ws/hbase-examples/target/hbase-examples-1.0.3-SNAPSHOT-tests.jar>
[INFO] 
[INFO] --- maven-jar-plugin:2.4:jar (default-jar) @ hbase-examples ---
[INFO] Building jar: <https://builds.apache.org/job/HBase-1.0/ws/hbase-examples/target/hbase-examples-1.0.3-SNAPSHOT.jar>
[INFO] 
[INFO] --- maven-install-plugin:2.3.1:install (default-install) @ hbase-examples ---
[INFO] Installing <https://builds.apache.org/job/HBase-1.0/ws/hbase-examples/target/hbase-examples-1.0.3-SNAPSHOT.jar> to /home/jenkins/.m2/repository/org/apache/hbase/hbase-examples/1.0.3-SNAPSHOT/hbase-examples-1.0.3-SNAPSHOT.jar
[INFO] Installing <https://builds.apache.org/job/HBase-1.0/ws/hbase-examples/pom.xml> to /home/jenkins/.m2/repository/org/apache/hbase/hbase-examples/1.0.3-SNAPSHOT/hbase-examples-1.0.3-SNAPSHOT.pom
[INFO] Installing <https://builds.apache.org/job/HBase-1.0/ws/hbase-examples/target/hbase-examples-1.0.3-SNAPSHOT-sources.jar> to /home/jenkins/.m2/repository/org/apache/hbase/hbase-examples/1.0.3-SNAPSHOT/hbase-examples-1.0.3-SNAPSHOT-sources.jar
[INFO] Installing <https://builds.apache.org/job/HBase-1.0/ws/hbase-examples/target/hbase-examples-1.0.3-SNAPSHOT-tests.jar> to /home/jenkins/.m2/repository/org/apache/hbase/hbase-examples/1.0.3-SNAPSHOT/hbase-examples-1.0.3-SNAPSHOT-tests.jar
[INFO]                                                                         
[INFO] ------------------------------------------------------------------------
[INFO] Building Apache HBase - Assembly 1.0.3-SNAPSHOT
[INFO] ------------------------------------------------------------------------
[INFO] 
[INFO] --- maven-enforcer-plugin:1.0.1:enforce (enforce) @ hbase-assembly ---
[INFO] 
[INFO] --- buildnumber-maven-plugin:1.3:create-timestamp (default) @ hbase-assembly ---
[INFO] 
[INFO] --- jacoco-maven-plugin:0.6.2.201302030002:prepare-agent (prepare-agent) @ hbase-assembly ---
[INFO] Skipping JaCoCo for project with packaging type 'pom'
[INFO] argLine set to 
[INFO] 
[INFO] --- maven-remote-resources-plugin:1.5:process (default) @ hbase-assembly ---
[ERROR] Error invoking method 'get(java.lang.Integer)' in java.util.ArrayList at META-INF/LICENSE.vm[line 1619, column 22]
java.lang.reflect.InvocationTargetException
	at sun.reflect.GeneratedMethodAccessor132.invoke(Unknown Source)
	at sun.reflect.DelegatingMethodAccessorImpl.invoke(DelegatingMethodAccessorImpl.java:43)
	at java.lang.reflect.Method.invoke(Method.java:606)
	at org.apache.velocity.util.introspection.UberspectImpl$VelMethodImpl.doInvoke(UberspectImpl.java:395)
	at org.apache.velocity.util.introspection.UberspectImpl$VelMethodImpl.invoke(UberspectImpl.java:384)
	at org.apache.velocity.runtime.parser.node.ASTIndex.execute(ASTIndex.java:149)
	at org.apache.velocity.runtime.parser.node.ASTReference.execute(ASTReference.java:280)
	at org.apache.velocity.runtime.parser.node.ASTReference.evaluate(ASTReference.java:530)
	at org.apache.velocity.runtime.parser.node.ASTExpression.evaluate(ASTExpression.java:62)
	at org.apache.velocity.runtime.parser.node.ASTNotNode.evaluate(ASTNotNode.java:63)
	at org.apache.velocity.runtime.parser.node.ASTExpression.evaluate(ASTExpression.java:62)
	at org.apache.velocity.runtime.parser.node.ASTIfStatement.render(ASTIfStatement.java:85)
	at org.apache.velocity.runtime.parser.node.ASTBlock.render(ASTBlock.java:72)
	at org.apache.velocity.runtime.directive.Foreach.render(Foreach.java:420)
	at org.apache.velocity.runtime.parser.node.ASTDirective.render(ASTDirective.java:207)
	at org.apache.velocity.runtime.parser.node.ASTBlock.render(ASTBlock.java:72)
	at org.apache.velocity.runtime.parser.node.ASTIfStatement.render(ASTIfStatement.java:87)
	at org.apache.velocity.runtime.parser.node.SimpleNode.render(SimpleNode.java:342)
	at org.apache.velocity.Template.merge(Template.java:356)
	at org.apache.velocity.Template.merge(Template.java:260)
	at org.apache.velocity.app.VelocityEngine.mergeTemplate(VelocityEngine.java:354)
	at org.apache.maven.plugin.resources.remote.ProcessRemoteResourcesMojo.processResourceBundles(ProcessRemoteResourcesMojo.java:1164)
	at org.apache.maven.plugin.resources.remote.ProcessRemoteResourcesMojo.execute(ProcessRemoteResourcesMojo.java:520)
	at org.apache.maven.plugin.DefaultBuildPluginManager.executeMojo(DefaultBuildPluginManager.java:101)
	at org.apache.maven.lifecycle.internal.MojoExecutor.execute(MojoExecutor.java:209)
	at org.apache.maven.lifecycle.internal.MojoExecutor.execute(MojoExecutor.java:153)
	at org.apache.maven.lifecycle.internal.MojoExecutor.execute(MojoExecutor.java:145)
	at org.apache.maven.lifecycle.internal.LifecycleModuleBuilder.buildProject(LifecycleModuleBuilder.java:84)
	at org.apache.maven.lifecycle.internal.LifecycleModuleBuilder.buildProject(LifecycleModuleBuilder.java:59)
	at org.apache.maven.lifecycle.internal.LifecycleStarter.singleThreadedBuild(LifecycleStarter.java:183)
	at org.apache.maven.lifecycle.internal.LifecycleStarter.execute(LifecycleStarter.java:161)
	at org.apache.maven.DefaultMaven.doExecute(DefaultMaven.java:319)
	at org.apache.maven.DefaultMaven.execute(DefaultMaven.java:156)
	at org.apache.maven.cli.MavenCli.execute(MavenCli.java:537)
	at org.apache.maven.cli.MavenCli.doMain(MavenCli.java:196)
	at org.apache.maven.cli.MavenCli.main(MavenCli.java:141)
	at sun.reflect.NativeMethodAccessorImpl.invoke0(Native Method)
	at sun.reflect.NativeMethodAccessorImpl.invoke(NativeMethodAccessorImpl.java:57)
	at sun.reflect.DelegatingMethodAccessorImpl.invoke(DelegatingMethodAccessorImpl.java:43)
	at java.lang.reflect.Method.invoke(Method.java:606)
	at org.codehaus.plexus.classworlds.launcher.Launcher.launchEnhanced(Launcher.java:290)
	at org.codehaus.plexus.classworlds.launcher.Launcher.launch(Launcher.java:230)
	at org.codehaus.plexus.classworlds.launcher.Launcher.mainWithExitCode(Launcher.java:409)
	at org.codehaus.plexus.classworlds.launcher.Launcher.main(Launcher.java:352)
Caused by: java.lang.IndexOutOfBoundsException: Index: 0, Size: 0
	at java.util.ArrayList.rangeCheck(ArrayList.java:604)
	at java.util.ArrayList.get(ArrayList.java:382)
	... 44 more
[INFO] ------------------------------------------------------------------------
[INFO] Reactor Summary:
[INFO] 
[INFO] Apache HBase ...................................... SUCCESS [3.523s]
[INFO] Apache HBase - Checkstyle ......................... SUCCESS [0.622s]
[INFO] Apache HBase - Resource Bundle .................... SUCCESS [0.221s]
[INFO] Apache HBase - Annotations ........................ SUCCESS [0.950s]
[INFO] Apache HBase - Common ............................. SUCCESS [1:00.113s]
[INFO] Apache HBase - Protocol ........................... SUCCESS [9.439s]
[INFO] Apache HBase - Client ............................. SUCCESS [1:20.406s]
[INFO] Apache HBase - Hadoop Compatibility ............... SUCCESS [7.276s]
[INFO] Apache HBase - Hadoop Two Compatibility ........... SUCCESS [6.865s]
[INFO] Apache HBase - Prefix Tree ........................ SUCCESS [8.742s]
[INFO] Apache HBase - Server ............................. SUCCESS [1:08:57.499s]
[INFO] Apache HBase - Testing Util ....................... SUCCESS [1.164s]
[INFO] Apache HBase - Thrift ............................. SUCCESS [3:05.393s]
[INFO] Apache HBase - Rest ............................... SUCCESS [4:57.922s]
[INFO] Apache HBase - Shell .............................. SUCCESS [2:41.006s]
[INFO] Apache HBase - Integration Tests .................. SUCCESS [1.554s]
[INFO] Apache HBase - Examples ........................... SUCCESS [4.141s]
[INFO] Apache HBase - Assembly ........................... FAILURE [1.241s]
[INFO] ------------------------------------------------------------------------
[INFO] BUILD FAILURE
[INFO] ------------------------------------------------------------------------
[INFO] Total time: 1:22:50.049s
[INFO] Finished at: Sat Oct 03 22:02:44 UTC 2015
[INFO] Final Memory: 76M/380M
[INFO] ------------------------------------------------------------------------
[ERROR] Failed to execute goal org.apache.maven.plugins:maven-remote-resources-plugin:1.5:process (default) on project hbase-assembly: Error rendering velocity resource. Error invoking method 'get(java.lang.Integer)' in java.util.ArrayList at META-INF/LICENSE.vm[line 1619, column 22]: InvocationTargetException: Index: 0, Size: 0 -> [Help 1]
[ERROR] 
[ERROR] To see the full stack trace of the errors, re-run Maven with the -e switch.
[ERROR] Re-run Maven using the -X switch to enable full debug logging.
[ERROR] 
[ERROR] For more information about the errors and possible solutions, please read the following articles:
[ERROR] [Help 1] http://cwiki.apache.org/confluence/display/MAVEN/MojoExecutionException
[ERROR] 
[ERROR] After correcting the problems, you can resume the build with the command
[ERROR]   mvn <goals> -rf :hbase-assembly
Build step 'Invoke top-level Maven targets' marked build as failure
Performing Post build task...
Match found for :.* : True
Logical operation result is TRUE
Running script  :   ZOMBIE_TESTS_COUNT=`jps | grep surefirebooter | wc -l`
  if [[ $ZOMBIE_TESTS_COUNT != 0 ]] ; then
    #It seems sometimes the tests are not dying immediately. Let's give them 10s
    echo "Suspicious java process found - waiting 10s to see if there are just slow to stop"
    sleep 10   
    ZOMBIE_TESTS_COUNT=`jps | grep surefirebooter | wc -l`
    if [[ $ZOMBIE_TESTS_COUNT != 0 ]] ; then
      echo "There are $ZOMBIE_TESTS_COUNT zombie tests, they should have been killed by surefire but survived"
      echo "************ BEGIN zombies jstack extract"
      ZB_STACK=`jps | grep surefirebooter | cut -d ' ' -f 1 | xargs -n 1 jstack | grep ".test" | grep "\.java"`
      jps | grep surefirebooter | cut -d ' ' -f 1 | xargs -n 1 jstack
      echo "************ END  zombies jstack extract"
      JIRA_COMMENT="$JIRA_COMMENT

     {color:red}-1 core zombie tests{color}.  There are ${ZOMBIE_TESTS_COUNT} zombie test(s): ${ZB_STACK}"
      BAD=1
      jps | grep surefirebooter | cut -d ' ' -f 1 | xargs kill -9
    else
      echo "We're ok: there is no zombie test, but some tests took some time to stop"
    fi
  else
    echo "We're ok: there is no zombie test"
  fi
[HBase-1.0] $ /bin/bash -xe /tmp/hudson2990003178622655690.sh
++ jps
++ grep surefirebooter
++ wc -l
+ ZOMBIE_TESTS_COUNT=0
+ [[ 0 != 0 ]]
+ echo 'We'\''re ok: there is no zombie test'
We're ok: there is no zombie test
POST BUILD TASK : SUCCESS
END OF POST BUILD TASK : 0
Archiving artifacts
Recording test results
Updating HBASE-14545