You are viewing a plain text version of this content. The canonical link for it is here.
Posted to yarn-dev@hadoop.apache.org by Apache Jenkins Server <je...@builds.apache.org> on 2015/08/01 14:13:07 UTC

Failed: YARN-3814 PreCommit Build #8750

Jira: https://issues.apache.org/jira/browse/YARN-3814
Build: https://builds.apache.org/job/PreCommit-YARN-Build/8750/

###################################################################################
########################## LAST 60 LINES OF THE CONSOLE ###########################
[...truncated 299 lines...]
|  +1  |      release audit  |  0m 23s    | The applied patch does not increase 
|      |                     |            | the total number of release audit
|      |                     |            | warnings.
|  +1  |         checkstyle  |  0m 16s    | There were no new checkstyle 
|      |                     |            | issues.
|  +1  |         whitespace  |  0m 15s    | The patch has no lines that end in 
|      |                     |            | whitespace.
|  +1  |            install  |  1m 26s    | mvn install still works. 
|  +1  |    eclipse:eclipse  |  0m 42s    | The patch built with 
|      |                     |            | eclipse:eclipse.
|  +1  |           findbugs  |  0m 50s    | The patch does not introduce any 
|      |                     |            | new Findbugs (version 3.0.0)
|      |                     |            | warnings.
|  +1  |         yarn tests  |  1m 41s    | Tests passed in 
|      |                     |            | hadoop-yarn-server-timelineservice.
|      |                     |  41m 56s   | 


|| Subsystem || Report/Notes ||
============================================================================
| Patch URL | http://issues.apache.org/jira/secure/attachment/12748305/YARN-3814-YARN-2928.03.patch |
| Optional Tests | javadoc javac unit findbugs checkstyle |
| git revision | YARN-2928 / df0ec47 |
| hadoop-yarn-server-timelineservice test log | /home/jenkins/jenkins-slave/workspace/PreCommit-YARN-Build/patchprocess/testrun_hadoop-yarn-server-timelineservice.txt |
| Test Results | https://builds.apache.org/job/PreCommit-YARN-Build/8750/testReport/ |
| Java | 1.7.0_55 |
| uname | Linux asf903.gq1.ygridcore.net 3.13.0-36-lowlatency #63-Ubuntu SMP PREEMPT Wed Sep 3 21:56:12 UTC 2014 x86_64 x86_64 x86_64 GNU/Linux |


============================================================================
============================================================================
                          Adding comment to JIRA
============================================================================
============================================================================


Comment added.
8297081fa6a33b8de9cf8915d75fed46fe3fb4fa logged out


============================================================================
============================================================================
                              Finished build.
============================================================================
============================================================================


Build step 'Execute shell' marked build as failure
Archiving artifacts
Sending artifact delta relative to PreCommit-YARN-Build #8718
Archived 27 artifacts
Archive block size is 32768
Received 46 blocks and 8309577 bytes
Compression is 15.4%
Took 2.5 sec
[description-setter] Could not determine description.
Recording test results
Email was triggered for: Failure
Sending email for trigger: Failure



###################################################################################
############################## FAILED TESTS (if any) ##############################
All tests passed

Success: YARN-3857 PreCommit Build #8752

Posted by Apache Jenkins Server <je...@builds.apache.org>.
Jira: https://issues.apache.org/jira/browse/YARN-3857
Build: https://builds.apache.org/job/PreCommit-YARN-Build/8752/

###################################################################################
########################## LAST 60 LINES OF THE CONSOLE ###########################
[...truncated 282 lines...]
|      |                     |            | messages.
|  +1  |      release audit  |  0m 22s    | The applied patch does not increase 
|      |                     |            | the total number of release audit
|      |                     |            | warnings.
|  +1  |         checkstyle  |  0m 47s    | There were no new checkstyle 
|      |                     |            | issues.
|  +1  |         whitespace  |  0m 0s     | The patch has no lines that end in 
|      |                     |            | whitespace.
|  +1  |            install  |  1m 23s    | mvn install still works. 
|  +1  |    eclipse:eclipse  |  0m 35s    | The patch built with 
|      |                     |            | eclipse:eclipse.
|  +1  |           findbugs  |  1m 27s    | The patch does not introduce any 
|      |                     |            | new Findbugs (version 3.0.0)
|      |                     |            | warnings.
|  +1  |         yarn tests  |  52m 42s   | Tests passed in 
|      |                     |            | hadoop-yarn-server-resourcemanager.
|      |                     |  90m 47s   | 


|| Subsystem || Report/Notes ||
============================================================================
| Patch URL | http://issues.apache.org/jira/secure/attachment/12748411/YARN-3857-4.patch |
| Optional Tests | javadoc javac unit findbugs checkstyle |
| git revision | trunk / 90b5104 |
| hadoop-yarn-server-resourcemanager test log | /home/jenkins/jenkins-slave/workspace/PreCommit-YARN-Build/patchprocess/testrun_hadoop-yarn-server-resourcemanager.txt |
| Test Results | https://builds.apache.org/job/PreCommit-YARN-Build/8752/testReport/ |
| Java | 1.7.0_55 |
| uname | Linux asf906.gq1.ygridcore.net 3.13.0-36-lowlatency #63-Ubuntu SMP PREEMPT Wed Sep 3 21:56:12 UTC 2014 x86_64 x86_64 x86_64 GNU/Linux |


============================================================================
============================================================================
                          Adding comment to JIRA
============================================================================
============================================================================


Comment added.
a4190aef5129307de9e80776d5147c4ef955d68e logged out


============================================================================
============================================================================
                              Finished build.
============================================================================
============================================================================


Archiving artifacts
Sending artifact delta relative to PreCommit-YARN-Build #8718
Archived 29 artifacts
Archive block size is 32768
Received 79 blocks and 10497340 bytes
Compression is 19.8%
Took 2.4 sec
Description set: YARN-3857
Recording test results
Email was triggered for: Success
Sending email for trigger: Success



###################################################################################
############################## FAILED TESTS (if any) ##############################
All tests passed

Failed: YARN-3857 PreCommit Build #8751

Posted by Apache Jenkins Server <je...@builds.apache.org>.
Jira: https://issues.apache.org/jira/browse/YARN-3857
Build: https://builds.apache.org/job/PreCommit-YARN-Build/8751/

###################################################################################
########################## LAST 60 LINES OF THE CONSOLE ###########################
[...truncated 296 lines...]
|      |                     |            | warnings.
|  +1  |         checkstyle  |  0m 50s    | There were no new checkstyle 
|      |                     |            | issues.
|  -1  |         whitespace  |  0m 0s     | The patch has 5 line(s) that end in 
|      |                     |            | whitespace. Use git apply
|      |                     |            | --whitespace=fix.
|  +1  |            install  |  1m 23s    | mvn install still works. 
|  +1  |    eclipse:eclipse  |  0m 34s    | The patch built with 
|      |                     |            | eclipse:eclipse.
|  +1  |           findbugs  |  1m 28s    | The patch does not introduce any 
|      |                     |            | new Findbugs (version 3.0.0)
|      |                     |            | warnings.
|  +1  |         yarn tests  |  53m 37s   | Tests passed in 
|      |                     |            | hadoop-yarn-server-resourcemanager.
|      |                     |  92m 29s   | 


|| Subsystem || Report/Notes ||
============================================================================
| Patch URL | http://issues.apache.org/jira/secure/attachment/12747980/YARN-3857-3.patch |
| Optional Tests | javadoc javac unit findbugs checkstyle |
| git revision | trunk / 90b5104 |
| whitespace | /home/jenkins/jenkins-slave/workspace/PreCommit-YARN-Build/patchprocess/whitespace.txt |
| hadoop-yarn-server-resourcemanager test log | /home/jenkins/jenkins-slave/workspace/PreCommit-YARN-Build/patchprocess/testrun_hadoop-yarn-server-resourcemanager.txt |
| Test Results | https://builds.apache.org/job/PreCommit-YARN-Build/8751/testReport/ |
| Java | 1.7.0_55 |
| uname | Linux asf905.gq1.ygridcore.net 3.13.0-36-lowlatency #63-Ubuntu SMP PREEMPT Wed Sep 3 21:56:12 UTC 2014 x86_64 x86_64 x86_64 GNU/Linux |


============================================================================
============================================================================
                          Adding comment to JIRA
============================================================================
============================================================================


Comment added.
2ed69fc16e8795e72c3cfc9f03d0bc07a907883c logged out


============================================================================
============================================================================
                              Finished build.
============================================================================
============================================================================


Build step 'Execute shell' marked build as failure
Archiving artifacts
Sending artifact delta relative to PreCommit-YARN-Build #8718
Archived 29 artifacts
Archive block size is 32768
Received 305 blocks and 3075923 bytes
Compression is 76.5%
Took 1.9 sec
[description-setter] Could not determine description.
Recording test results
Email was triggered for: Failure
Sending email for trigger: Failure



###################################################################################
############################## FAILED TESTS (if any) ##############################
All tests passed