You are viewing a plain text version of this content. The canonical link for it is here.
Posted to dev@lucene.apache.org by Apache Jenkins Server <je...@builds.apache.org> on 2017/09/09 01:08:14 UTC
[JENKINS] Lucene-Solr-Tests-7.0 - Build # 129 - Still Unstable
Build: https://builds.apache.org/job/Lucene-Solr-Tests-7.0/129/
1 tests failed.
FAILED: org.apache.solr.handler.dataimport.TestContentStreamDataSource.testCommitWithin
Error Message:
expected:<0> but was:<2>
Stack Trace:
java.lang.AssertionError: expected:<0> but was:<2>
at __randomizedtesting.SeedInfo.seed([DDB9573DBF1FD61A:676B38453C31380F]:0)
at org.junit.Assert.fail(Assert.java:93)
at org.junit.Assert.failNotEquals(Assert.java:647)
at org.junit.Assert.assertEquals(Assert.java:128)
at org.junit.Assert.assertEquals(Assert.java:472)
at org.junit.Assert.assertEquals(Assert.java:456)
at org.apache.solr.handler.dataimport.TestContentStreamDataSource.testCommitWithin(TestContentStreamDataSource.java:98)
at sun.reflect.NativeMethodAccessorImpl.invoke0(Native Method)
at sun.reflect.NativeMethodAccessorImpl.invoke(NativeMethodAccessorImpl.java:62)
at sun.reflect.DelegatingMethodAccessorImpl.invoke(DelegatingMethodAccessorImpl.java:43)
at java.lang.reflect.Method.invoke(Method.java:498)
at com.carrotsearch.randomizedtesting.RandomizedRunner.invoke(RandomizedRunner.java:1713)
at com.carrotsearch.randomizedtesting.RandomizedRunner$8.evaluate(RandomizedRunner.java:907)
at com.carrotsearch.randomizedtesting.RandomizedRunner$9.evaluate(RandomizedRunner.java:943)
at com.carrotsearch.randomizedtesting.RandomizedRunner$10.evaluate(RandomizedRunner.java:957)
at com.carrotsearch.randomizedtesting.rules.SystemPropertiesRestoreRule$1.evaluate(SystemPropertiesRestoreRule.java:57)
at org.apache.lucene.util.TestRuleSetupTeardownChained$1.evaluate(TestRuleSetupTeardownChained.java:49)
at org.apache.lucene.util.AbstractBeforeAfterRule$1.evaluate(AbstractBeforeAfterRule.java:45)
at org.apache.lucene.util.TestRuleThreadAndTestName$1.evaluate(TestRuleThreadAndTestName.java:48)
at org.apache.lucene.util.TestRuleIgnoreAfterMaxFailures$1.evaluate(TestRuleIgnoreAfterMaxFailures.java:64)
at org.apache.lucene.util.TestRuleMarkFailure$1.evaluate(TestRuleMarkFailure.java:47)
at com.carrotsearch.randomizedtesting.rules.StatementAdapter.evaluate(StatementAdapter.java:36)
at com.carrotsearch.randomizedtesting.ThreadLeakControl$StatementRunner.run(ThreadLeakControl.java:368)
at com.carrotsearch.randomizedtesting.ThreadLeakControl.forkTimeoutingTask(ThreadLeakControl.java:817)
at com.carrotsearch.randomizedtesting.ThreadLeakControl$3.evaluate(ThreadLeakControl.java:468)
at com.carrotsearch.randomizedtesting.RandomizedRunner.runSingleTest(RandomizedRunner.java:916)
at com.carrotsearch.randomizedtesting.RandomizedRunner$5.evaluate(RandomizedRunner.java:802)
at com.carrotsearch.randomizedtesting.RandomizedRunner$6.evaluate(RandomizedRunner.java:852)
at com.carrotsearch.randomizedtesting.RandomizedRunner$7.evaluate(RandomizedRunner.java:863)
at com.carrotsearch.randomizedtesting.rules.StatementAdapter.evaluate(StatementAdapter.java:36)
at com.carrotsearch.randomizedtesting.rules.SystemPropertiesRestoreRule$1.evaluate(SystemPropertiesRestoreRule.java:57)
at org.apache.lucene.util.AbstractBeforeAfterRule$1.evaluate(AbstractBeforeAfterRule.java:45)
at com.carrotsearch.randomizedtesting.rules.StatementAdapter.evaluate(StatementAdapter.java:36)
at org.apache.lucene.util.TestRuleStoreClassName$1.evaluate(TestRuleStoreClassName.java:41)
at com.carrotsearch.randomizedtesting.rules.NoShadowingOrOverridesOnMethodsRule$1.evaluate(NoShadowingOrOverridesOnMethodsRule.java:40)
at com.carrotsearch.randomizedtesting.rules.NoShadowingOrOverridesOnMethodsRule$1.evaluate(NoShadowingOrOverridesOnMethodsRule.java:40)
at com.carrotsearch.randomizedtesting.rules.StatementAdapter.evaluate(StatementAdapter.java:36)
at com.carrotsearch.randomizedtesting.rules.StatementAdapter.evaluate(StatementAdapter.java:36)
at com.carrotsearch.randomizedtesting.rules.StatementAdapter.evaluate(StatementAdapter.java:36)
at org.apache.lucene.util.TestRuleAssertionsRequired$1.evaluate(TestRuleAssertionsRequired.java:53)
at org.apache.lucene.util.TestRuleMarkFailure$1.evaluate(TestRuleMarkFailure.java:47)
at org.apache.lucene.util.TestRuleIgnoreAfterMaxFailures$1.evaluate(TestRuleIgnoreAfterMaxFailures.java:64)
at org.apache.lucene.util.TestRuleIgnoreTestSuites$1.evaluate(TestRuleIgnoreTestSuites.java:54)
at com.carrotsearch.randomizedtesting.rules.StatementAdapter.evaluate(StatementAdapter.java:36)
at com.carrotsearch.randomizedtesting.ThreadLeakControl$StatementRunner.run(ThreadLeakControl.java:368)
at java.lang.Thread.run(Thread.java:748)
Build Log:
[...truncated 18068 lines...]
[junit4] Suite: org.apache.solr.handler.dataimport.TestContentStreamDataSource
[junit4] 2> Creating dataDir: /x1/jenkins/jenkins-slave/workspace/Lucene-Solr-Tests-7.0/solr/build/contrib/solr-dataimporthandler/test/J0/temp/solr.handler.dataimport.TestContentStreamDataSource_DDB9573DBF1FD61A-001/init-core-data-001
[junit4] 2> 32867 T67 oas.SolrTestCaseJ4.startTrackingSearchers WARN startTrackingSearchers: numOpens=3 numCloses=3
[junit4] 2> 32872 T67 oas.SolrTestCaseJ4.randomizeNumericTypesProperties Using PointFields (NUMERIC_POINTS_SYSPROP=true) w/NUMERIC_DOCVALUES_SYSPROP=true
[junit4] 2> 32874 T67 oas.SolrTestCaseJ4.buildSSLConfig Randomized ssl (true) and clientAuth (true) via: @org.apache.solr.util.RandomizeSSL(reason=, ssl=NaN, value=NaN, clientAuth=NaN)
[junit4] 2> 32947 T67 oas.SolrTestCaseJ4.setUp ###Starting testCommitWithin
[junit4] 2> 33593 T67 oejs.Server.doStart jetty-9.3.14.v20161028
[junit4] 2> 33728 T67 oejsh.ContextHandler.doStart Started o.e.j.s.ServletContextHandler@596314a0{/solr,null,AVAILABLE}
[junit4] 2> 33827 T67 oejs.AbstractConnector.doStart Started ServerConnector@4215632{SSL,[ssl, http/1.1]}{127.0.0.1:51712}
[junit4] 2> 33828 T67 oejs.Server.doStart Started @38525ms
[junit4] 2> 33828 T67 oascse.JettySolrRunner$1.lifeCycleStarted Jetty properties: {solr.data.dir=/x1/jenkins/jenkins-slave/workspace/Lucene-Solr-Tests-7.0/solr/build/contrib/solr-dataimporthandler/test/J0/temp/solr.handler.dataimport.TestContentStreamDataSource_DDB9573DBF1FD61A-001/inst-001/collection1/data, hostContext=/solr, hostPort=51712}
[junit4] 2> 33872 T67 oass.StartupLoggingUtils.checkLogDir ERROR Missing Java Option solr.log.dir. Logging may be missing or incomplete.
[junit4] 2> 33873 T67 oass.SolrDispatchFilter.logWelcomeBanner ___ _ Welcome to Apache Solr? version 7.0.0
[junit4] 2> 33873 T67 oass.SolrDispatchFilter.logWelcomeBanner / __| ___| |_ _ Starting in standalone mode on port null
[junit4] 2> 33888 T67 oass.SolrDispatchFilter.logWelcomeBanner \__ \/ _ \ | '_| Install dir: null, Default config dir: null
[junit4] 2> 33889 T67 oass.SolrDispatchFilter.logWelcomeBanner |___/\___/_|_| Start time: 2017-09-09T00:50:33.541Z
[junit4] 2> 33893 T67 oasc.SolrXmlConfig.fromFile Loading container configuration from /x1/jenkins/jenkins-slave/workspace/Lucene-Solr-Tests-7.0/solr/build/contrib/solr-dataimporthandler/test/J0/temp/solr.handler.dataimport.TestContentStreamDataSource_DDB9573DBF1FD61A-001/inst-001/solr.xml
[junit4] 2> 33991 T67 oasc.SolrXmlConfig.getMetricReporterPluginInfos MBean server found: com.sun.jmx.mbeanserver.JmxMBeanServer@1547a729, but no JMX reporters were configured - adding default JMX reporter.
[junit4] 2> 34251 T67 oasmr.SolrJmxReporter.doInit JMX monitoring for 'solr.node' (registry 'solr.node') enabled at server: com.sun.jmx.mbeanserver.JmxMBeanServer@1547a729
[junit4] 2> 34252 T67 oasmr.SolrJmxReporter.doInit JMX monitoring for 'solr.jvm' (registry 'solr.jvm') enabled at server: com.sun.jmx.mbeanserver.JmxMBeanServer@1547a729
[junit4] 2> 34252 T67 oasmr.SolrJmxReporter.doInit JMX monitoring for 'solr.jetty' (registry 'solr.jetty') enabled at server: com.sun.jmx.mbeanserver.JmxMBeanServer@1547a729
[junit4] 2> 34286 T67 oasc.CorePropertiesLocator.discover Found 1 core definitions underneath /x1/jenkins/jenkins-slave/workspace/Lucene-Solr-Tests-7.0/solr/build/contrib/solr-dataimporthandler/test/J0/temp/solr.handler.dataimport.TestContentStreamDataSource_DDB9573DBF1FD61A-001/inst-001
[junit4] 2> 34287 T67 oasc.CorePropertiesLocator.discover Cores are: [collection1]
[junit4] 2> 34642 T80 x:x:collection1 oasc.SolrConfig.<init> Using Lucene MatchVersion: 7.0.0
[junit4] 2> 34695 T80 x:x:collection1 oass.IndexSchema.readSchema [collection1] Schema name=dih_test
[junit4] 2> 34769 T80 x:x:collection1 oass.IndexSchema.readSchema Loaded schema dih_test/4.0 with uniqueid field id
[junit4] 2> 34769 T80 x:x:collection1 oasc.CoreContainer.createFromDescriptor Creating SolrCore 'collection1' using configuration from instancedir /x1/jenkins/jenkins-slave/workspace/Lucene-Solr-Tests-7.0/solr/build/contrib/solr-dataimporthandler/test/J0/temp/solr.handler.dataimport.TestContentStreamDataSource_DDB9573DBF1FD61A-001/inst-001/collection1, trusted=true
[junit4] 2> 34771 T80 x:x:collection1 oasmr.SolrJmxReporter.doInit JMX monitoring for 'solr.core.collection1' (registry 'solr.core.collection1') enabled at server: com.sun.jmx.mbeanserver.JmxMBeanServer@1547a729
[junit4] 2> 34772 T80 x:x:collection1 oasc.SolrCore.initRecoveryStrategyBuilder solr.RecoveryStrategy.Builder
[junit4] 2> 34772 T80 x:x:collection1 oasc.SolrCore.<init> [[collection1] ] Opening new SolrCore at [/x1/jenkins/jenkins-slave/workspace/Lucene-Solr-Tests-7.0/solr/build/contrib/solr-dataimporthandler/test/J0/temp/solr.handler.dataimport.TestContentStreamDataSource_DDB9573DBF1FD61A-001/inst-001/collection1], dataDir=[/x1/jenkins/jenkins-slave/workspace/Lucene-Solr-Tests-7.0/solr/build/contrib/solr-dataimporthandler/test/J0/temp/solr.handler.dataimport.TestContentStreamDataSource_DDB9573DBF1FD61A-001/inst-001/collection1/data/]
[junit4] 2> 35016 T80 x:x:collection1 oasu.CommitTracker.<init> Hard AutoCommit: disabled
[junit4] 2> 35016 T80 x:x:collection1 oasu.CommitTracker.<init> Soft AutoCommit: disabled
[junit4] 2> 35029 T80 x:x:collection1 oass.SolrIndexSearcher.<init> Opening [Searcher@7e450a11[collection1] main]
[junit4] 2> 35031 T80 x:x:collection1 oasr.ManagedResourceStorage$FileStorageIO.configure File-based storage initialized to use dir: /x1/jenkins/jenkins-slave/workspace/Lucene-Solr-Tests-7.0/solr/build/contrib/solr-dataimporthandler/test/J0/temp/solr.handler.dataimport.TestContentStreamDataSource_DDB9573DBF1FD61A-001/inst-001/collection1/conf
[junit4] 2> 35032 T80 x:x:collection1 oash.ReplicationHandler.inform Commits will be reserved for 10000
[junit4] 2> 35036 T84 x:x:collection1 oasc.SolrCore.registerSearcher [collection1] Registered new searcher Searcher@7e450a11[collection1] main{ExitableDirectoryReader(UninvertingDirectoryReader())}
[junit4] 2> ASYNC NEW_CORE C6 name=collection1 org.apache.solr.core.SolrCore@887755
[junit4] 2> 37501 T76 x:x:collection1 C6 oashd.DataImporter.maybeReloadConfiguration Loading DIH Configuration: data-config.xml
[junit4] 2> 37503 T76 x:x:collection1 C6 oashd.DataImporter.loadDataConfig Data Configuration loaded successfully
[junit4] 2> 37504 T76 x:x:collection1 C6 oashd.DataImporter.doFullImport Starting Full Import
[junit4] 2> 37512 T76 x:x:collection1 C6 oashd.SimplePropertiesWriter.readIndexerProperties WARN Unable to read: dataimport.properties
[junit4] 2> 37620 T76 x:x:collection1 C6 oashd.DocBuilder.finish Import completed successfully
[junit4] 2> 37620 T76 x:x:collection1 C6 oashd.SimplePropertiesWriter.readIndexerProperties WARN Unable to read: dataimport.properties
[junit4] 2> 37621 T76 x:x:collection1 C6 oashd.SimplePropertiesWriter.persist Wrote last indexed time to dataimport.properties
[junit4] 2> 37621 T76 x:x:collection1 C6 oashd.DocBuilder.execute Time taken = 0:0:0.108
[junit4] 2> 37621 T76 x:x:collection1 C6 oasup.LogUpdateProcessorFactory$LogUpdateProcessor.finish [collection1] webapp=/solr path=/dataimport params={commitWithin=1000&commit=false&clean=false&wt=javabin&version=2&command=full-import}{add=[1, 2]} 0 591
[junit4] 2> 38640 T87 x:x:collection1 oasu.DirectUpdateHandler2.commit start commit{,optimize=false,openSearcher=true,waitSearcher=true,expungeDeletes=false,softCommit=true,prepareCommit=false}
[junit4] 2> 38741 T87 x:x:collection1 oass.SolrIndexSearcher.<init> Opening [Searcher@478f4b70[collection1] main]
[junit4] 2> 38743 T87 x:x:collection1 oasu.DirectUpdateHandler2.commit end_commit_flush
[junit4] 2> 38746 T84 x:x:collection1 oasc.SolrCore.registerSearcher [collection1] Registered new searcher Searcher@478f4b70[collection1] main{ExitableDirectoryReader(UninvertingDirectoryReader(Uninverting(_0(7.0.0):C2)))}
[junit4] 2> 38798 T69 x:x:collection1 C6 oasc.SolrCore.execute [collection1] webapp=/solr path=/select params={q=*&df=desc&wt=javabin&version=2} hits=2 status=0 QTime=0
[junit4] 2> 38816 T67 oejs.AbstractConnector.doStop Stopped ServerConnector@4215632{SSL,[ssl, http/1.1]}{127.0.0.1:0}
[junit4] 2> 38817 T67 oasc.CoreContainer.shutdown Shutting down CoreContainer instance=1984283532
[junit4] 2> 38818 T67 oasm.SolrMetricManager.closeReporters Closing metric reporters for registry=solr.node, tag=null
[junit4] 2> 38818 T67 oasmr.SolrJmxReporter.close Closing reporter [org.apache.solr.metrics.reporters.SolrJmxReporter@259cf7e8: rootName = null, domain = solr.node, service url = null, agent id = null] for registry solr.node / com.codahale.metrics.MetricRegistry@73ac64ce
[junit4] 2> 38829 T67 oasm.SolrMetricManager.closeReporters Closing metric reporters for registry=solr.jvm, tag=null
[junit4] 2> 38829 T67 oasmr.SolrJmxReporter.close Closing reporter [org.apache.solr.metrics.reporters.SolrJmxReporter@77460dbc: rootName = null, domain = solr.jvm, service url = null, agent id = null] for registry solr.jvm / com.codahale.metrics.MetricRegistry@5986708e
[junit4] 2> 38834 T67 oasm.SolrMetricManager.closeReporters Closing metric reporters for registry=solr.jetty, tag=null
[junit4] 2> 38835 T67 oasmr.SolrJmxReporter.close Closing reporter [org.apache.solr.metrics.reporters.SolrJmxReporter@49d764c0: rootName = null, domain = solr.jetty, service url = null, agent id = null] for registry solr.jetty / com.codahale.metrics.MetricRegistry@b7c1612
[junit4] 2> 38845 T67 oasc.TransientSolrCoreCacheDefault.doInit Allocating transient cache for 2147483647 transient cores
[junit4] 2> 38860 T88 x:x:collection1 oasc.SolrCore.close [collection1] CLOSING SolrCore org.apache.solr.core.SolrCore@887755
[junit4] 2> 38860 T88 x:x:collection1 oasm.SolrMetricManager.closeReporters Closing metric reporters for registry=solr.core.collection1, tag=8943445
[junit4] 2> 38860 T88 x:x:collection1 oasmr.SolrJmxReporter.close Closing reporter [org.apache.solr.metrics.reporters.SolrJmxReporter@31c290a3: rootName = null, domain = solr.core.collection1, service url = null, agent id = null] for registry solr.core.collection1 / com.codahale.metrics.MetricRegistry@29a060ab
[junit4] 2> 38918 T67 oejsh.ContextHandler.doStop Stopped o.e.j.s.ServletContextHandler@596314a0{/solr,null,UNAVAILABLE}
[junit4] 2> 38920 T67 oas.SolrTestCaseJ4.tearDown ###Ending testCommitWithin
[junit4] 2> NOTE: reproduce with: ant test -Dtestcase=TestContentStreamDataSource -Dtests.method=testCommitWithin -Dtests.seed=DDB9573DBF1FD61A -Dtests.multiplier=2 -Dtests.slow=true -Dtests.locale=sk -Dtests.timezone=Asia/Dhaka -Dtests.asserts=true -Dtests.file.encoding=US-ASCII
[junit4] FAILURE 5.98s J0 | TestContentStreamDataSource.testCommitWithin <<<
[junit4] > Throwable #1: java.lang.AssertionError: expected:<0> but was:<2>
[junit4] > at __randomizedtesting.SeedInfo.seed([DDB9573DBF1FD61A:676B38453C31380F]:0)
[junit4] > at org.apache.solr.handler.dataimport.TestContentStreamDataSource.testCommitWithin(TestContentStreamDataSource.java:98)
[junit4] > at java.lang.Thread.run(Thread.java:748)
[junit4] 2> 38929 T67 oas.SolrTestCaseJ4.setUp ###Starting testSimple
[junit4] 2> 38933 T67 oejs.Server.doStart jetty-9.3.14.v20161028
[junit4] 2> 39036 T67 oejsh.ContextHandler.doStart Started o.e.j.s.ServletContextHandler@72fafd42{/solr,null,AVAILABLE}
[junit4] 2> 39037 T67 oejs.AbstractConnector.doStart Started ServerConnector@5c54d251{SSL,[ssl, http/1.1]}{127.0.0.1:36067}
[junit4] 2> 39037 T67 oejs.Server.doStart Started @43734ms
[junit4] 2> 39037 T67 oascse.JettySolrRunner$1.lifeCycleStarted Jetty properties: {solr.data.dir=/x1/jenkins/jenkins-slave/workspace/Lucene-Solr-Tests-7.0/solr/build/contrib/solr-dataimporthandler/test/J0/temp/solr.handler.dataimport.TestContentStreamDataSource_DDB9573DBF1FD61A-001/inst-002/collection1/data, hostContext=/solr, hostPort=36067}
[junit4] 2> 39038 T67 oass.StartupLoggingUtils.checkLogDir ERROR Missing Java Option solr.log.dir. Logging may be missing or incomplete.
[junit4] 2> 39045 T67 oass.SolrDispatchFilter.logWelcomeBanner ___ _ Welcome to Apache Solr? version 7.0.0
[junit4] 2> 39045 T67 oass.SolrDispatchFilter.logWelcomeBanner / __| ___| |_ _ Starting in standalone mode on port null
[junit4] 2> 39045 T67 oass.SolrDispatchFilter.logWelcomeBanner \__ \/ _ \ | '_| Install dir: null, Default config dir: null
[junit4] 2> 39046 T67 oass.SolrDispatchFilter.logWelcomeBanner |___/\___/_|_| Start time: 2017-09-09T00:50:38.697Z
[junit4] 2> 39046 T67 oasc.SolrXmlConfig.fromFile Loading container configuration from /x1/jenkins/jenkins-slave/workspace/Lucene-Solr-Tests-7.0/solr/build/contrib/solr-dataimporthandler/test/J0/temp/solr.handler.dataimport.TestContentStreamDataSource_DDB9573DBF1FD61A-001/inst-002/solr.xml
[junit4] 2> 39055 T67 oasc.SolrXmlConfig.getMetricReporterPluginInfos MBean server found: com.sun.jmx.mbeanserver.JmxMBeanServer@1547a729, but no JMX reporters were configured - adding default JMX reporter.
[junit4] 2> 39240 T67 oasmr.SolrJmxReporter.doInit JMX monitoring for 'solr.node' (registry 'solr.node') enabled at server: com.sun.jmx.mbeanserver.JmxMBeanServer@1547a729
[junit4] 2> 39449 T67 oasmr.SolrJmxReporter.doInit JMX monitoring for 'solr.jvm' (registry 'solr.jvm') enabled at server: com.sun.jmx.mbeanserver.JmxMBeanServer@1547a729
[junit4] 2> 39449 T67 oasmr.SolrJmxReporter.doInit JMX monitoring for 'solr.jetty' (registry 'solr.jetty') enabled at server: com.sun.jmx.mbeanserver.JmxMBeanServer@1547a729
[junit4] 2> 39469 T67 oasc.CorePropertiesLocator.discover Found 1 core definitions underneath /x1/jenkins/jenkins-slave/workspace/Lucene-Solr-Tests-7.0/solr/build/contrib/solr-dataimporthandler/test/J0/temp/solr.handler.dataimport.TestContentStreamDataSource_DDB9573DBF1FD61A-001/inst-002
[junit4] 2> 39469 T67 oasc.CorePropertiesLocator.discover Cores are: [collection1]
[junit4] 2> 39523 T101 x:x:collection1 oasc.SolrConfig.<init> Using Lucene MatchVersion: 7.0.0
[junit4] 2> 39597 T101 x:x:collection1 oass.IndexSchema.readSchema [collection1] Schema name=dih_test
[junit4] 2> 39640 T101 x:x:collection1 oass.IndexSchema.readSchema Loaded schema dih_test/4.0 with uniqueid field id
[junit4] 2> 39640 T101 x:x:collection1 oasc.CoreContainer.createFromDescriptor Creating SolrCore 'collection1' using configuration from instancedir /x1/jenkins/jenkins-slave/workspace/Lucene-Solr-Tests-7.0/solr/build/contrib/solr-dataimporthandler/test/J0/temp/solr.handler.dataimport.TestContentStreamDataSource_DDB9573DBF1FD61A-001/inst-002/collection1, trusted=true
[junit4] 2> 39648 T101 x:x:collection1 oasmr.SolrJmxReporter.doInit JMX monitoring for 'solr.core.collection1' (registry 'solr.core.collection1') enabled at server: com.sun.jmx.mbeanserver.JmxMBeanServer@1547a729
[junit4] 2> 39648 T101 x:x:collection1 oasc.SolrCore.initRecoveryStrategyBuilder solr.RecoveryStrategy.Builder
[junit4] 2> 39648 T101 x:x:collection1 oasc.SolrCore.<init> [[collection1] ] Opening new SolrCore at [/x1/jenkins/jenkins-slave/workspace/Lucene-Solr-Tests-7.0/solr/build/contrib/solr-dataimporthandler/test/J0/temp/solr.handler.dataimport.TestContentStreamDataSource_DDB9573DBF1FD61A-001/inst-002/collection1], dataDir=[/x1/jenkins/jenkins-slave/workspace/Lucene-Solr-Tests-7.0/solr/build/contrib/solr-dataimporthandler/test/J0/temp/solr.handler.dataimport.TestContentStreamDataSource_DDB9573DBF1FD61A-001/inst-002/collection1/data/]
[junit4] 2> 39864 T101 x:x:collection1 oasu.CommitTracker.<init> Hard AutoCommit: disabled
[junit4] 2> 39864 T101 x:x:collection1 oasu.CommitTracker.<init> Soft AutoCommit: disabled
[junit4] 2> 39866 T101 x:x:collection1 oass.SolrIndexSearcher.<init> Opening [Searcher@1e2f1367[collection1] main]
[junit4] 2> 39866 T101 x:x:collection1 oasr.ManagedResourceStorage$FileStorageIO.configure File-based storage initialized to use dir: /x1/jenkins/jenkins-slave/workspace/Lucene-Solr-Tests-7.0/solr/build/contrib/solr-dataimporthandler/test/J0/temp/solr.handler.dataimport.TestContentStreamDataSource_DDB9573DBF1FD61A-001/inst-002/collection1/conf
[junit4] 2> 39868 T101 x:x:collection1 oash.ReplicationHandler.inform Commits will be reserved for 10000
[junit4] 2> 39870 T105 x:x:collection1 oasc.SolrCore.registerSearcher [collection1] Registered new searcher Searcher@1e2f1367[collection1] main{ExitableDirectoryReader(UninvertingDirectoryReader())}
[junit4] 2> ASYNC NEW_CORE C7 name=collection1 org.apache.solr.core.SolrCore@56bc60c5
[junit4] 2> 40141 T95 x:x:collection1 C7 oashd.DataImporter.maybeReloadConfiguration Loading DIH Configuration: data-config.xml
[junit4] 2> 40143 T95 x:x:collection1 C7 oashd.DataImporter.loadDataConfig Data Configuration loaded successfully
[junit4] 2> 40143 T95 x:x:collection1 C7 oashd.DataImporter.doFullImport Starting Full Import
[junit4] 2> 40144 T95 x:x:collection1 C7 oashd.SimplePropertiesWriter.readIndexerProperties WARN Unable to read: dataimport.properties
[junit4] 2> 40146 T95 x:x:collection1 C7 oashd.DocBuilder.finish Import completed successfully
[junit4] 2> 40147 T95 x:x:collection1 C7 oasu.DirectUpdateHandler2.commit start commit{,optimize=false,openSearcher=true,waitSearcher=true,expungeDeletes=false,softCommit=false,prepareCommit=false}
[junit4] 2> 40147 T95 x:x:collection1 C7 oasu.SolrIndexWriter.setCommitData Calling setCommitData with IW:org.apache.solr.update.SolrIndexWriter@71749604 commitCommandVersion:0
[junit4] 2> 40155 T95 x:x:collection1 C7 oass.SolrIndexSearcher.<init> Opening [Searcher@1ba1ebf5[collection1] main]
[junit4] 2> 40156 T95 x:x:collection1 C7 oasu.DirectUpdateHandler2.commit end_commit_flush
[junit4] 2> 40159 T105 x:x:collection1 C7 oasc.SolrCore.registerSearcher [collection1] Registered new searcher Searcher@1ba1ebf5[collection1] main{ExitableDirectoryReader(UninvertingDirectoryReader(Uninverting(_0(7.0.0):C2)))}
[junit4] 2> 40159 T95 x:x:collection1 C7 oashd.SimplePropertiesWriter.readIndexerProperties WARN Unable to read: dataimport.properties
[junit4] 2> 40160 T95 x:x:collection1 C7 oashd.SimplePropertiesWriter.persist Wrote last indexed time to dataimport.properties
[junit4] 2> 40160 T95 x:x:collection1 C7 oashd.DocBuilder.execute Time taken = 0:0:0.15
[junit4] 2> 40160 T95 x:x:collection1 C7 oasup.LogUpdateProcessorFactory$LogUpdateProcessor.finish [collection1] webapp=/solr path=/dataimport params={clean=false&wt=javabin&version=2&command=full-import}{add=[1, 2],commit=} 0 19
[junit4] 2> 40165 T95 x:x:collection1 C7 oasc.SolrCore.execute [collection1] webapp=/solr path=/select params={q=*:*&wt=javabin&version=2} hits=2 status=0 QTime=1
[junit4] 2> 40188 T67 oejs.AbstractConnector.doStop Stopped ServerConnector@5c54d251{SSL,[ssl, http/1.1]}{127.0.0.1:0}
[junit4] 2> 40188 T67 oasc.CoreContainer.shutdown Shutting down CoreContainer instance=1441155073
[junit4] 2> 40188 T67 oasm.SolrMetricManager.closeReporters Closing metric reporters for registry=solr.node, tag=null
[junit4] 2> 40189 T67 oasmr.SolrJmxReporter.close Closing reporter [org.apache.solr.metrics.reporters.SolrJmxReporter@77be48c2: rootName = null, domain = solr.node, service url = null, agent id = null] for registry solr.node / com.codahale.metrics.MetricRegistry@30b7e089
[junit4] 2> 40196 T67 oasm.SolrMetricManager.closeReporters Closing metric reporters for registry=solr.jvm, tag=null
[junit4] 2> 40197 T67 oasmr.SolrJmxReporter.close Closing reporter [org.apache.solr.metrics.reporters.SolrJmxReporter@1f88c07f: rootName = null, domain = solr.jvm, service url = null, agent id = null] for registry solr.jvm / com.codahale.metrics.MetricRegistry@5986708e
[junit4] 2> 40205 T67 oasm.SolrMetricManager.closeReporters Closing metric reporters for registry=solr.jetty, tag=null
[junit4] 2> 40206 T67 oasmr.SolrJmxReporter.close Closing reporter [org.apache.solr.metrics.reporters.SolrJmxReporter@1d7f3910: rootName = null, domain = solr.jetty, service url = null, agent id = null] for registry solr.jetty / com.codahale.metrics.MetricRegistry@b7c1612
[junit4] 2> 40207 T67 oasc.TransientSolrCoreCacheDefault.doInit Allocating transient cache for 2147483647 transient cores
[junit4] 2> 40218 T109 x:x:collection1 oasc.SolrCore.close [collection1] CLOSING SolrCore org.apache.solr.core.SolrCore@56bc60c5
[junit4] 2> 40218 T109 x:x:collection1 oasm.SolrMetricManager.closeReporters Closing metric reporters for registry=solr.core.collection1, tag=1455186117
[junit4] 2> 40218 T109 x:x:collection1 oasmr.SolrJmxReporter.close Closing reporter [org.apache.solr.metrics.reporters.SolrJmxReporter@2fed07d7: rootName = null, domain = solr.core.collection1, service url = null, agent id = null] for registry solr.core.collection1 / com.codahale.metrics.MetricRegistry@70f041fc
[junit4] 2> 40268 T67 oejsh.ContextHandler.doStop Stopped o.e.j.s.ServletContextHandler@72fafd42{/solr,null,UNAVAILABLE}
[junit4] 2> 40269 T67 oas.SolrTestCaseJ4.tearDown ###Ending testSimple
[junit4] 2> NOTE: leaving temporary files on disk at: /x1/jenkins/jenkins-slave/workspace/Lucene-Solr-Tests-7.0/solr/build/contrib/solr-dataimporthandler/test/J0/temp/solr.handler.dataimport.TestContentStreamDataSource_DDB9573DBF1FD61A-001
[junit4] 2> NOTE: test params are: codec=Asserting(Lucene70): {id=BlockTreeOrds(blocksize=128), desc=PostingsFormat(name=LuceneVarGapFixedInterval)}, docValues:{timestamp=DocValuesFormat(name=Memory)}, maxPointsInLeafNode=1053, maxMBSortInHeap=7.495138205424991, sim=RandomSimilarity(queryNorm=true): {}, locale=sk, timezone=Asia/Dhaka
[junit4] 2> NOTE: Linux 3.13.0-88-generic amd64/Oracle Corporation 1.8.0_144 (64-bit)/cpus=4,threads=1,free=287115464,total=368050176
[junit4] 2> NOTE: All tests run in this JVM: [TestHierarchicalDocBuilder, TestZKPropertiesWriter, TestNestedChildren, TestContentStreamDataSource]
[junit4] Completed [12/38 (1!)] on J0 in 7.54s, 2 tests, 1 failure <<< FAILURES!
[...truncated 38542 lines...]
[JENKINS] Lucene-Solr-Tests-7.0 - Build # 131 - Still Unstable
Posted by Apache Jenkins Server <je...@builds.apache.org>.
Build: https://builds.apache.org/job/Lucene-Solr-Tests-7.0/131/
1 tests failed.
FAILED: org.apache.solr.cloud.UnloadDistributedZkTest.test
Error Message:
Could not load collection from ZK: test_unload_shard_and_collection
Stack Trace:
org.apache.solr.common.SolrException: Could not load collection from ZK: test_unload_shard_and_collection
at __randomizedtesting.SeedInfo.seed([1C749CA420A6DBD3:9420A37E8E5AB62B]:0)
at org.apache.solr.common.cloud.ZkStateReader.getCollectionLive(ZkStateReader.java:1114)
at org.apache.solr.common.cloud.ZkStateReader$LazyCollectionRef.get(ZkStateReader.java:647)
at org.apache.solr.common.cloud.ClusterState.getCollectionOrNull(ClusterState.java:128)
at org.apache.solr.cloud.AbstractDistribZkTestBase.waitForRecoveriesToFinish(AbstractDistribZkTestBase.java:154)
at org.apache.solr.cloud.AbstractDistribZkTestBase.waitForRecoveriesToFinish(AbstractDistribZkTestBase.java:140)
at org.apache.solr.cloud.AbstractDistribZkTestBase.waitForRecoveriesToFinish(AbstractDistribZkTestBase.java:135)
at org.apache.solr.cloud.AbstractFullDistribZkTestBase.waitForRecoveriesToFinish(AbstractFullDistribZkTestBase.java:908)
at org.apache.solr.cloud.UnloadDistributedZkTest.testUnloadShardAndCollection(UnloadDistributedZkTest.java:128)
at org.apache.solr.cloud.UnloadDistributedZkTest.test(UnloadDistributedZkTest.java:71)
at sun.reflect.NativeMethodAccessorImpl.invoke0(Native Method)
at sun.reflect.NativeMethodAccessorImpl.invoke(NativeMethodAccessorImpl.java:62)
at sun.reflect.DelegatingMethodAccessorImpl.invoke(DelegatingMethodAccessorImpl.java:43)
at java.lang.reflect.Method.invoke(Method.java:498)
at com.carrotsearch.randomizedtesting.RandomizedRunner.invoke(RandomizedRunner.java:1713)
at com.carrotsearch.randomizedtesting.RandomizedRunner$8.evaluate(RandomizedRunner.java:907)
at com.carrotsearch.randomizedtesting.RandomizedRunner$9.evaluate(RandomizedRunner.java:943)
at com.carrotsearch.randomizedtesting.RandomizedRunner$10.evaluate(RandomizedRunner.java:957)
at org.apache.solr.BaseDistributedSearchTestCase$ShardsRepeatRule$ShardsFixedStatement.callStatement(BaseDistributedSearchTestCase.java:993)
at org.apache.solr.BaseDistributedSearchTestCase$ShardsRepeatRule$ShardsStatement.evaluate(BaseDistributedSearchTestCase.java:968)
at com.carrotsearch.randomizedtesting.rules.SystemPropertiesRestoreRule$1.evaluate(SystemPropertiesRestoreRule.java:57)
at org.apache.lucene.util.TestRuleSetupTeardownChained$1.evaluate(TestRuleSetupTeardownChained.java:49)
at org.apache.lucene.util.AbstractBeforeAfterRule$1.evaluate(AbstractBeforeAfterRule.java:45)
at org.apache.lucene.util.TestRuleThreadAndTestName$1.evaluate(TestRuleThreadAndTestName.java:48)
at org.apache.lucene.util.TestRuleIgnoreAfterMaxFailures$1.evaluate(TestRuleIgnoreAfterMaxFailures.java:64)
at org.apache.lucene.util.TestRuleMarkFailure$1.evaluate(TestRuleMarkFailure.java:47)
at com.carrotsearch.randomizedtesting.rules.StatementAdapter.evaluate(StatementAdapter.java:36)
at com.carrotsearch.randomizedtesting.ThreadLeakControl$StatementRunner.run(ThreadLeakControl.java:368)
at com.carrotsearch.randomizedtesting.ThreadLeakControl.forkTimeoutingTask(ThreadLeakControl.java:817)
at com.carrotsearch.randomizedtesting.ThreadLeakControl$3.evaluate(ThreadLeakControl.java:468)
at com.carrotsearch.randomizedtesting.RandomizedRunner.runSingleTest(RandomizedRunner.java:916)
at com.carrotsearch.randomizedtesting.RandomizedRunner$5.evaluate(RandomizedRunner.java:802)
at com.carrotsearch.randomizedtesting.RandomizedRunner$6.evaluate(RandomizedRunner.java:852)
at com.carrotsearch.randomizedtesting.RandomizedRunner$7.evaluate(RandomizedRunner.java:863)
at com.carrotsearch.randomizedtesting.rules.StatementAdapter.evaluate(StatementAdapter.java:36)
at com.carrotsearch.randomizedtesting.rules.SystemPropertiesRestoreRule$1.evaluate(SystemPropertiesRestoreRule.java:57)
at org.apache.lucene.util.AbstractBeforeAfterRule$1.evaluate(AbstractBeforeAfterRule.java:45)
at com.carrotsearch.randomizedtesting.rules.StatementAdapter.evaluate(StatementAdapter.java:36)
at org.apache.lucene.util.TestRuleStoreClassName$1.evaluate(TestRuleStoreClassName.java:41)
at com.carrotsearch.randomizedtesting.rules.NoShadowingOrOverridesOnMethodsRule$1.evaluate(NoShadowingOrOverridesOnMethodsRule.java:40)
at com.carrotsearch.randomizedtesting.rules.NoShadowingOrOverridesOnMethodsRule$1.evaluate(NoShadowingOrOverridesOnMethodsRule.java:40)
at com.carrotsearch.randomizedtesting.rules.StatementAdapter.evaluate(StatementAdapter.java:36)
at com.carrotsearch.randomizedtesting.rules.StatementAdapter.evaluate(StatementAdapter.java:36)
at com.carrotsearch.randomizedtesting.rules.StatementAdapter.evaluate(StatementAdapter.java:36)
at org.apache.lucene.util.TestRuleAssertionsRequired$1.evaluate(TestRuleAssertionsRequired.java:53)
at org.apache.lucene.util.TestRuleMarkFailure$1.evaluate(TestRuleMarkFailure.java:47)
at org.apache.lucene.util.TestRuleIgnoreAfterMaxFailures$1.evaluate(TestRuleIgnoreAfterMaxFailures.java:64)
at org.apache.lucene.util.TestRuleIgnoreTestSuites$1.evaluate(TestRuleIgnoreTestSuites.java:54)
at com.carrotsearch.randomizedtesting.rules.StatementAdapter.evaluate(StatementAdapter.java:36)
at com.carrotsearch.randomizedtesting.ThreadLeakControl$StatementRunner.run(ThreadLeakControl.java:368)
at java.lang.Thread.run(Thread.java:748)
Caused by: org.apache.zookeeper.KeeperException$SessionExpiredException: KeeperErrorCode = Session expired for /collections/test_unload_shard_and_collection/state.json
at org.apache.zookeeper.KeeperException.create(KeeperException.java:127)
at org.apache.zookeeper.KeeperException.create(KeeperException.java:51)
at org.apache.zookeeper.ZooKeeper.getData(ZooKeeper.java:1212)
at org.apache.solr.common.cloud.SolrZkClient$7.execute(SolrZkClient.java:357)
at org.apache.solr.common.cloud.SolrZkClient$7.execute(SolrZkClient.java:354)
at org.apache.solr.common.cloud.ZkCmdExecutor.retryOperation(ZkCmdExecutor.java:60)
at org.apache.solr.common.cloud.SolrZkClient.getData(SolrZkClient.java:354)
at org.apache.solr.common.cloud.ZkStateReader.fetchCollectionState(ZkStateReader.java:1126)
at org.apache.solr.common.cloud.ZkStateReader.getCollectionLive(ZkStateReader.java:1112)
... 49 more
Build Log:
[...truncated 10873 lines...]
[junit4] Suite: org.apache.solr.cloud.UnloadDistributedZkTest
[junit4] 2> Creating dataDir: /x1/jenkins/jenkins-slave/workspace/Lucene-Solr-Tests-7.0/solr/build/solr-core/test/J2/temp/solr.cloud.UnloadDistributedZkTest_1C749CA420A6DBD3-001/init-core-data-001
[junit4] 2> 0 INFO (SUITE-UnloadDistributedZkTest-seed#[1C749CA420A6DBD3]-worker) [ ] o.a.s.SolrTestCaseJ4 Using TrieFields (NUMERIC_POINTS_SYSPROP=false) w/NUMERIC_DOCVALUES_SYSPROP=true
[junit4] 2> 434 INFO (SUITE-UnloadDistributedZkTest-seed#[1C749CA420A6DBD3]-worker) [ ] o.e.j.u.log Logging initialized @9500ms
[junit4] 2> 439 INFO (SUITE-UnloadDistributedZkTest-seed#[1C749CA420A6DBD3]-worker) [ ] o.a.s.SolrTestCaseJ4 Randomized ssl (false) and clientAuth (false) via: @org.apache.solr.SolrTestCaseJ4$SuppressSSL(bugUrl=https://issues.apache.org/jira/browse/SOLR-5776)
[junit4] 2> 463 INFO (SUITE-UnloadDistributedZkTest-seed#[1C749CA420A6DBD3]-worker) [ ] o.a.s.BaseDistributedSearchTestCase Setting hostContext system property: /
[junit4] 2> 506 INFO (TEST-UnloadDistributedZkTest.test-seed#[1C749CA420A6DBD3]) [ ] o.a.s.c.ZkTestServer STARTING ZK TEST SERVER
[junit4] 2> 950 INFO (Thread-1) [ ] o.a.s.c.ZkTestServer client port:0.0.0.0/0.0.0.0:0
[junit4] 2> 957 INFO (Thread-1) [ ] o.a.s.c.ZkTestServer Starting server
[junit4] 2> 1766 INFO (TEST-UnloadDistributedZkTest.test-seed#[1C749CA420A6DBD3]) [ ] o.a.s.c.ZkTestServer start zk server on port:58668
[junit4] 2> 4032 ERROR (Thread-1) [ ] o.a.z.s.ZooKeeperServer ZKShutdownHandler is not registered, so ZooKeeper server won't take any action on ERROR or SHUTDOWN server state changes
[junit4] 2> 4587 WARN (NIOServerCxn.Factory:0.0.0.0/0.0.0.0:0) [ ] o.a.z.s.NIOServerCnxn caught end of stream exception
[junit4] 2> EndOfStreamException: Unable to read additional data from client sessionid 0x15e6c0921e30000, likely client has closed socket
[junit4] 2> at org.apache.zookeeper.server.NIOServerCnxn.doIO(NIOServerCnxn.java:239)
[junit4] 2> at org.apache.zookeeper.server.NIOServerCnxnFactory.run(NIOServerCnxnFactory.java:203)
[junit4] 2> at java.lang.Thread.run(Thread.java:748)
[junit4] 2> 4684 INFO (TEST-UnloadDistributedZkTest.test-seed#[1C749CA420A6DBD3]) [ ] o.a.s.c.AbstractZkTestCase put /x1/jenkins/jenkins-slave/workspace/Lucene-Solr-Tests-7.0/solr/core/src/test-files/solr/collection1/conf/solrconfig-tlog.xml to /configs/conf1/solrconfig.xml
[junit4] 2> 4760 INFO (TEST-UnloadDistributedZkTest.test-seed#[1C749CA420A6DBD3]) [ ] o.a.s.c.AbstractZkTestCase put /x1/jenkins/jenkins-slave/workspace/Lucene-Solr-Tests-7.0/solr/core/src/test-files/solr/collection1/conf/schema.xml to /configs/conf1/schema.xml
[junit4] 2> 4776 INFO (TEST-UnloadDistributedZkTest.test-seed#[1C749CA420A6DBD3]) [ ] o.a.s.c.AbstractZkTestCase put /x1/jenkins/jenkins-slave/workspace/Lucene-Solr-Tests-7.0/solr/core/src/test-files/solr/collection1/conf/solrconfig.snippet.randomindexconfig.xml to /configs/conf1/solrconfig.snippet.randomindexconfig.xml
[junit4] 2> 4788 INFO (TEST-UnloadDistributedZkTest.test-seed#[1C749CA420A6DBD3]) [ ] o.a.s.c.AbstractZkTestCase put /x1/jenkins/jenkins-slave/workspace/Lucene-Solr-Tests-7.0/solr/core/src/test-files/solr/collection1/conf/stopwords.txt to /configs/conf1/stopwords.txt
[junit4] 2> 4797 INFO (TEST-UnloadDistributedZkTest.test-seed#[1C749CA420A6DBD3]) [ ] o.a.s.c.AbstractZkTestCase put /x1/jenkins/jenkins-slave/workspace/Lucene-Solr-Tests-7.0/solr/core/src/test-files/solr/collection1/conf/protwords.txt to /configs/conf1/protwords.txt
[junit4] 2> 4805 INFO (TEST-UnloadDistributedZkTest.test-seed#[1C749CA420A6DBD3]) [ ] o.a.s.c.AbstractZkTestCase put /x1/jenkins/jenkins-slave/workspace/Lucene-Solr-Tests-7.0/solr/core/src/test-files/solr/collection1/conf/currency.xml to /configs/conf1/currency.xml
[junit4] 2> 4815 INFO (TEST-UnloadDistributedZkTest.test-seed#[1C749CA420A6DBD3]) [ ] o.a.s.c.AbstractZkTestCase put /x1/jenkins/jenkins-slave/workspace/Lucene-Solr-Tests-7.0/solr/core/src/test-files/solr/collection1/conf/enumsConfig.xml to /configs/conf1/enumsConfig.xml
[junit4] 2> 4823 INFO (TEST-UnloadDistributedZkTest.test-seed#[1C749CA420A6DBD3]) [ ] o.a.s.c.AbstractZkTestCase put /x1/jenkins/jenkins-slave/workspace/Lucene-Solr-Tests-7.0/solr/core/src/test-files/solr/collection1/conf/open-exchange-rates.json to /configs/conf1/open-exchange-rates.json
[junit4] 2> 4910 INFO (TEST-UnloadDistributedZkTest.test-seed#[1C749CA420A6DBD3]) [ ] o.a.s.c.AbstractZkTestCase put /x1/jenkins/jenkins-slave/workspace/Lucene-Solr-Tests-7.0/solr/core/src/test-files/solr/collection1/conf/mapping-ISOLatin1Accent.txt to /configs/conf1/mapping-ISOLatin1Accent.txt
[junit4] 2> 4916 INFO (TEST-UnloadDistributedZkTest.test-seed#[1C749CA420A6DBD3]) [ ] o.a.s.c.AbstractZkTestCase put /x1/jenkins/jenkins-slave/workspace/Lucene-Solr-Tests-7.0/solr/core/src/test-files/solr/collection1/conf/old_synonyms.txt to /configs/conf1/old_synonyms.txt
[junit4] 2> 4940 INFO (TEST-UnloadDistributedZkTest.test-seed#[1C749CA420A6DBD3]) [ ] o.a.s.c.AbstractZkTestCase put /x1/jenkins/jenkins-slave/workspace/Lucene-Solr-Tests-7.0/solr/core/src/test-files/solr/collection1/conf/synonyms.txt to /configs/conf1/synonyms.txt
[junit4] 2> 4945 INFO (TEST-UnloadDistributedZkTest.test-seed#[1C749CA420A6DBD3]) [ ] o.a.s.c.AbstractFullDistribZkTestBase Will use TLOG replicas unless explicitly asked otherwise
[junit4] 2> 10726 INFO (TEST-UnloadDistributedZkTest.test-seed#[1C749CA420A6DBD3]) [ ] o.e.j.s.Server jetty-9.3.14.v20161028
[junit4] 2> 11440 INFO (TEST-UnloadDistributedZkTest.test-seed#[1C749CA420A6DBD3]) [ ] o.e.j.s.h.ContextHandler Started o.e.j.s.ServletContextHandler@12007b94{/,null,AVAILABLE}
[junit4] 2> 11530 INFO (TEST-UnloadDistributedZkTest.test-seed#[1C749CA420A6DBD3]) [ ] o.e.j.s.AbstractConnector Started ServerConnector@7f7ca90a{HTTP/1.1,[http/1.1]}{127.0.0.1:45126}
[junit4] 2> 11530 INFO (TEST-UnloadDistributedZkTest.test-seed#[1C749CA420A6DBD3]) [ ] o.e.j.s.Server Started @20617ms
[junit4] 2> 11530 INFO (TEST-UnloadDistributedZkTest.test-seed#[1C749CA420A6DBD3]) [ ] o.a.s.c.s.e.JettySolrRunner Jetty properties: {solr.data.dir=/x1/jenkins/jenkins-slave/workspace/Lucene-Solr-Tests-7.0/solr/build/solr-core/test/J2/temp/solr.cloud.UnloadDistributedZkTest_1C749CA420A6DBD3-001/tempDir-001/control/data, replicaType=NRT, hostContext=/, hostPort=45126, coreRootDirectory=/x1/jenkins/jenkins-slave/workspace/Lucene-Solr-Tests-7.0/solr/build/solr-core/test/J2/temp/solr.cloud.UnloadDistributedZkTest_1C749CA420A6DBD3-001/control-001/cores}
[junit4] 2> 11681 ERROR (TEST-UnloadDistributedZkTest.test-seed#[1C749CA420A6DBD3]) [ ] o.a.s.s.StartupLoggingUtils Missing Java Option solr.log.dir. Logging may be missing or incomplete.
[junit4] 2> 11681 INFO (TEST-UnloadDistributedZkTest.test-seed#[1C749CA420A6DBD3]) [ ] o.a.s.s.SolrDispatchFilter ___ _ Welcome to Apache Solr? version 7.0.0
[junit4] 2> 11707 INFO (TEST-UnloadDistributedZkTest.test-seed#[1C749CA420A6DBD3]) [ ] o.a.s.s.SolrDispatchFilter / __| ___| |_ _ Starting in cloud mode on port null
[junit4] 2> 11716 INFO (TEST-UnloadDistributedZkTest.test-seed#[1C749CA420A6DBD3]) [ ] o.a.s.s.SolrDispatchFilter \__ \/ _ \ | '_| Install dir: null, Default config dir: null
[junit4] 2> 11791 INFO (TEST-UnloadDistributedZkTest.test-seed#[1C749CA420A6DBD3]) [ ] o.a.s.s.SolrDispatchFilter |___/\___/_|_| Start time: 2017-09-10T13:45:01.427Z
[junit4] 2> 11880 INFO (TEST-UnloadDistributedZkTest.test-seed#[1C749CA420A6DBD3]) [ ] o.a.s.c.SolrResourceLoader solr home defaulted to 'solr/' (could not find system property or JNDI)
[junit4] 2> 11909 INFO (TEST-UnloadDistributedZkTest.test-seed#[1C749CA420A6DBD3]) [ ] o.a.s.s.SolrDispatchFilter Loading solr.xml from SolrHome (not found in ZooKeeper)
[junit4] 2> 11922 INFO (TEST-UnloadDistributedZkTest.test-seed#[1C749CA420A6DBD3]) [ ] o.a.s.c.SolrXmlConfig Loading container configuration from /x1/jenkins/jenkins-slave/workspace/Lucene-Solr-Tests-7.0/solr/build/solr-core/test/J2/temp/solr.cloud.UnloadDistributedZkTest_1C749CA420A6DBD3-001/control-001/solr.xml
[junit4] 2> 12328 INFO (TEST-UnloadDistributedZkTest.test-seed#[1C749CA420A6DBD3]) [ ] o.a.s.c.SolrXmlConfig MBean server found: com.sun.jmx.mbeanserver.JmxMBeanServer@72f175fe, but no JMX reporters were configured - adding default JMX reporter.
[junit4] 2> 16307 INFO (TEST-UnloadDistributedZkTest.test-seed#[1C749CA420A6DBD3]) [ ] o.a.s.c.ZkContainer Zookeeper client=127.0.0.1:58668/solr
[junit4] 2> 17432 INFO (TEST-UnloadDistributedZkTest.test-seed#[1C749CA420A6DBD3]) [n:127.0.0.1:45126_ ] o.a.s.c.Overseer Overseer (id=null) closing
[junit4] 2> 17437 INFO (TEST-UnloadDistributedZkTest.test-seed#[1C749CA420A6DBD3]) [n:127.0.0.1:45126_ ] o.a.s.c.OverseerElectionContext I am going to be the leader 127.0.0.1:45126_
[junit4] 2> 17448 INFO (TEST-UnloadDistributedZkTest.test-seed#[1C749CA420A6DBD3]) [n:127.0.0.1:45126_ ] o.a.s.c.Overseer Overseer (id=98635028327759876-127.0.0.1:45126_-n_0000000000) starting
[junit4] 2> 18161 INFO (TEST-UnloadDistributedZkTest.test-seed#[1C749CA420A6DBD3]) [n:127.0.0.1:45126_ ] o.a.s.c.ZkController Register node as live in ZooKeeper:/live_nodes/127.0.0.1:45126_
[junit4] 2> 18165 INFO (zkCallback-7-thread-1-processing-n:127.0.0.1:45126_) [n:127.0.0.1:45126_ ] o.a.s.c.c.ZkStateReader Updated live nodes from ZooKeeper... (0) -> (1)
[junit4] 2> 22229 INFO (TEST-UnloadDistributedZkTest.test-seed#[1C749CA420A6DBD3]) [n:127.0.0.1:45126_ ] o.a.s.m.r.SolrJmxReporter JMX monitoring for 'solr.node' (registry 'solr.node') enabled at server: com.sun.jmx.mbeanserver.JmxMBeanServer@72f175fe
[junit4] 2> 22235 INFO (TEST-UnloadDistributedZkTest.test-seed#[1C749CA420A6DBD3]) [n:127.0.0.1:45126_ ] o.a.s.m.r.SolrJmxReporter JMX monitoring for 'solr.jvm' (registry 'solr.jvm') enabled at server: com.sun.jmx.mbeanserver.JmxMBeanServer@72f175fe
[junit4] 2> 22236 INFO (TEST-UnloadDistributedZkTest.test-seed#[1C749CA420A6DBD3]) [n:127.0.0.1:45126_ ] o.a.s.m.r.SolrJmxReporter JMX monitoring for 'solr.jetty' (registry 'solr.jetty') enabled at server: com.sun.jmx.mbeanserver.JmxMBeanServer@72f175fe
[junit4] 2> 22672 INFO (TEST-UnloadDistributedZkTest.test-seed#[1C749CA420A6DBD3]) [n:127.0.0.1:45126_ ] o.a.s.c.CorePropertiesLocator Found 0 core definitions underneath /x1/jenkins/jenkins-slave/workspace/Lucene-Solr-Tests-7.0/solr/build/solr-core/test/J2/temp/solr.cloud.UnloadDistributedZkTest_1C749CA420A6DBD3-001/control-001/cores
[junit4] 2> 24063 INFO (TEST-UnloadDistributedZkTest.test-seed#[1C749CA420A6DBD3]) [ ] o.a.s.c.c.ZkStateReader Updated live nodes from ZooKeeper... (0) -> (1)
[junit4] 2> 24064 INFO (TEST-UnloadDistributedZkTest.test-seed#[1C749CA420A6DBD3]) [ ] o.a.s.c.s.i.ZkClientClusterStateProvider Cluster at 127.0.0.1:58668/solr ready
[junit4] 2> 28175 INFO (qtp1638689167-28) [n:127.0.0.1:45126_ ] o.a.s.h.a.CollectionsHandler Invoked Collection Action :create with params replicationFactor=1&collection.configName=conf1&name=control_collection&nrtReplicas=1&action=CREATE&numShards=1&createNodeSet=127.0.0.1:45126_&wt=javabin&version=2 and sendToOCPQueue=true
[junit4] 2> 28439 INFO (OverseerThreadFactory-7-thread-1-processing-n:127.0.0.1:45126_) [n:127.0.0.1:45126_ ] o.a.s.c.CreateCollectionCmd Create collection control_collection
[junit4] 2> 28925 INFO (qtp1638689167-30) [n:127.0.0.1:45126_ ] o.a.s.h.a.CoreAdminOperation core create command qt=/admin/cores&collection.configName=conf1&newCollection=true&name=control_collection_shard1_replica_n1&action=CREATE&numShards=1&collection=control_collection&shard=shard1&wt=javabin&version=2&replicaType=NRT
[junit4] 2> 28928 INFO (qtp1638689167-30) [n:127.0.0.1:45126_ ] o.a.s.c.TransientSolrCoreCacheDefault Allocating transient cache for 4 transient cores
[junit4] 2> 29144 INFO (zkCallback-7-thread-1-processing-n:127.0.0.1:45126_) [n:127.0.0.1:45126_ ] o.a.s.c.c.ZkStateReader A cluster state change: [WatchedEvent state:SyncConnected type:NodeDataChanged path:/collections/control_collection/state.json] for collection [control_collection] has occurred - updating... (live nodes size: [1])
[junit4] 2> 30577 INFO (qtp1638689167-30) [n:127.0.0.1:45126_ c:control_collection s:shard1 x:control_collection_shard1_replica_n1] o.a.s.c.SolrConfig Using Lucene MatchVersion: 7.0.0
[junit4] 2> 32400 INFO (qtp1638689167-30) [n:127.0.0.1:45126_ c:control_collection s:shard1 x:control_collection_shard1_replica_n1] o.a.s.s.IndexSchema [control_collection_shard1_replica_n1] Schema name=test
[junit4] 2> 32794 WARN (qtp1638689167-30) [n:127.0.0.1:45126_ c:control_collection s:shard1 x:control_collection_shard1_replica_n1] o.a.s.c.SolrResourceLoader Solr loaded a deprecated plugin/analysis class [solr.TrieIntField]. Please consult documentation how to replace it accordingly.
[junit4] 2> 32920 WARN (qtp1638689167-30) [n:127.0.0.1:45126_ c:control_collection s:shard1 x:control_collection_shard1_replica_n1] o.a.s.c.SolrResourceLoader Solr loaded a deprecated plugin/analysis class [solr.TrieFloatField]. Please consult documentation how to replace it accordingly.
[junit4] 2> 32952 WARN (qtp1638689167-30) [n:127.0.0.1:45126_ c:control_collection s:shard1 x:control_collection_shard1_replica_n1] o.a.s.c.SolrResourceLoader Solr loaded a deprecated plugin/analysis class [solr.TrieLongField]. Please consult documentation how to replace it accordingly.
[junit4] 2> 33063 WARN (qtp1638689167-30) [n:127.0.0.1:45126_ c:control_collection s:shard1 x:control_collection_shard1_replica_n1] o.a.s.c.SolrResourceLoader Solr loaded a deprecated plugin/analysis class [solr.TrieDoubleField]. Please consult documentation how to replace it accordingly.
[junit4] 2> 34250 WARN (qtp1638689167-30) [n:127.0.0.1:45126_ c:control_collection s:shard1 x:control_collection_shard1_replica_n1] o.a.s.c.SolrResourceLoader Solr loaded a deprecated plugin/analysis class [solr.TrieDateField]. Please consult documentation how to replace it accordingly.
[junit4] 2> 34497 WARN (qtp1638689167-30) [n:127.0.0.1:45126_ c:control_collection s:shard1 x:control_collection_shard1_replica_n1] o.a.s.c.SolrResourceLoader Solr loaded a deprecated plugin/analysis class [solr.WordDelimiterFilterFactory]. Please consult documentation how to replace it accordingly.
[junit4] 2> 34626 WARN (qtp1638689167-30) [n:127.0.0.1:45126_ c:control_collection s:shard1 x:control_collection_shard1_replica_n1] o.a.s.c.SolrResourceLoader Solr loaded a deprecated plugin/analysis class [solr.GeoHashField]. Please consult documentation how to replace it accordingly.
[junit4] 2> 34633 WARN (qtp1638689167-30) [n:127.0.0.1:45126_ c:control_collection s:shard1 x:control_collection_shard1_replica_n1] o.a.s.c.SolrResourceLoader Solr loaded a deprecated plugin/analysis class [solr.LatLonType]. Please consult documentation how to replace it accordingly.
[junit4] 2> 34642 WARN (qtp1638689167-30) [n:127.0.0.1:45126_ c:control_collection s:shard1 x:control_collection_shard1_replica_n1] o.a.s.c.SolrResourceLoader Solr loaded a deprecated plugin/analysis class [solr.CurrencyField]. Please consult documentation how to replace it accordingly.
[junit4] 2> 34984 WARN (qtp1638689167-30) [n:127.0.0.1:45126_ c:control_collection s:shard1 x:control_collection_shard1_replica_n1] o.a.s.c.SolrResourceLoader Solr loaded a deprecated plugin/analysis class [solr.EnumField]. Please consult documentation how to replace it accordingly.
[junit4] 2> 35051 INFO (qtp1638689167-30) [n:127.0.0.1:45126_ c:control_collection s:shard1 x:control_collection_shard1_replica_n1] o.a.s.s.IndexSchema Loaded schema test/1.0 with uniqueid field id
[junit4] 2> 37257 INFO (qtp1638689167-30) [n:127.0.0.1:45126_ c:control_collection s:shard1 x:control_collection_shard1_replica_n1] o.a.s.c.CoreContainer Creating SolrCore 'control_collection_shard1_replica_n1' using configuration from collection control_collection, trusted=true
[junit4] 2> 37299 INFO (qtp1638689167-30) [n:127.0.0.1:45126_ c:control_collection s:shard1 x:control_collection_shard1_replica_n1] o.a.s.m.r.SolrJmxReporter JMX monitoring for 'solr.core.control_collection.shard1.replica_n1' (registry 'solr.core.control_collection.shard1.replica_n1') enabled at server: com.sun.jmx.mbeanserver.JmxMBeanServer@72f175fe
[junit4] 2> 37335 INFO (qtp1638689167-30) [n:127.0.0.1:45126_ c:control_collection s:shard1 x:control_collection_shard1_replica_n1] o.a.s.c.SolrCore solr.RecoveryStrategy.Builder
[junit4] 2> 37394 INFO (qtp1638689167-30) [n:127.0.0.1:45126_ c:control_collection s:shard1 x:control_collection_shard1_replica_n1] o.a.s.c.SolrCore [[control_collection_shard1_replica_n1] ] Opening new SolrCore at [/x1/jenkins/jenkins-slave/workspace/Lucene-Solr-Tests-7.0/solr/build/solr-core/test/J2/temp/solr.cloud.UnloadDistributedZkTest_1C749CA420A6DBD3-001/control-001/cores/control_collection_shard1_replica_n1], dataDir=[/x1/jenkins/jenkins-slave/workspace/Lucene-Solr-Tests-7.0/solr/build/solr-core/test/J2/temp/solr.cloud.UnloadDistributedZkTest_1C749CA420A6DBD3-001/control-001/cores/control_collection_shard1_replica_n1/data/]
[junit4] 2> 37943 INFO (qtp1638689167-30) [n:127.0.0.1:45126_ c:control_collection s:shard1 x:control_collection_shard1_replica_n1] o.a.s.u.RandomMergePolicy RandomMergePolicy wrapping class org.apache.lucene.index.TieredMergePolicy: [TieredMergePolicy: maxMergeAtOnce=37, maxMergeAtOnceExplicit=39, maxMergedSegmentMB=76.009765625, floorSegmentMB=0.609375, forceMergeDeletesPctAllowed=15.301188542761057, segmentsPerTier=42.0, maxCFSSegmentSizeMB=8.796093022207999E12, noCFSRatio=0.8869775876119809
[junit4] 2> 41981 WARN (qtp1638689167-30) [n:127.0.0.1:45126_ c:control_collection s:shard1 x:control_collection_shard1_replica_n1] o.a.s.c.RequestHandlers INVALID paramSet a in requestHandler {type = requestHandler,name = /dump,class = DumpRequestHandler,attributes = {initParams=a, name=/dump, class=DumpRequestHandler},args = {defaults={a=A,b=B}}}
[junit4] 2> 43928 INFO (qtp1638689167-30) [n:127.0.0.1:45126_ c:control_collection s:shard1 x:control_collection_shard1_replica_n1] o.a.s.u.UpdateHandler Using UpdateLog implementation: org.apache.solr.update.UpdateLog
[junit4] 2> 43938 INFO (qtp1638689167-30) [n:127.0.0.1:45126_ c:control_collection s:shard1 x:control_collection_shard1_replica_n1] o.a.s.u.UpdateLog Initializing UpdateLog: dataDir= defaultSyncLevel=FLUSH numRecordsToKeep=100 maxNumLogsToKeep=10 numVersionBuckets=65536
[junit4] 2> 44115 INFO (qtp1638689167-30) [n:127.0.0.1:45126_ c:control_collection s:shard1 x:control_collection_shard1_replica_n1] o.a.s.u.CommitTracker Hard AutoCommit: disabled
[junit4] 2> 44115 INFO (qtp1638689167-30) [n:127.0.0.1:45126_ c:control_collection s:shard1 x:control_collection_shard1_replica_n1] o.a.s.u.CommitTracker Soft AutoCommit: disabled
[junit4] 2> 44690 INFO (qtp1638689167-30) [n:127.0.0.1:45126_ c:control_collection s:shard1 x:control_collection_shard1_replica_n1] o.a.s.u.RandomMergePolicy RandomMergePolicy wrapping class org.apache.lucene.index.TieredMergePolicy: [TieredMergePolicy: maxMergeAtOnce=19, maxMergeAtOnceExplicit=17, maxMergedSegmentMB=72.98046875, floorSegmentMB=0.4990234375, forceMergeDeletesPctAllowed=17.556965689564507, segmentsPerTier=26.0, maxCFSSegmentSizeMB=8.796093022207999E12, noCFSRatio=1.0
[junit4] 2> 44739 INFO (qtp1638689167-30) [n:127.0.0.1:45126_ c:control_collection s:shard1 x:control_collection_shard1_replica_n1] o.a.s.s.SolrIndexSearcher Opening [Searcher@586a1929[control_collection_shard1_replica_n1] main]
[junit4] 2> 44842 INFO (qtp1638689167-30) [n:127.0.0.1:45126_ c:control_collection s:shard1 x:control_collection_shard1_replica_n1] o.a.s.r.ManagedResourceStorage Configured ZooKeeperStorageIO with znodeBase: /configs/conf1
[junit4] 2> 45059 INFO (qtp1638689167-30) [n:127.0.0.1:45126_ c:control_collection s:shard1 x:control_collection_shard1_replica_n1] o.a.s.r.ManagedResourceStorage Loaded null at path _rest_managed.json using ZooKeeperStorageIO:path=/configs/conf1
[junit4] 2> 45175 INFO (qtp1638689167-30) [n:127.0.0.1:45126_ c:control_collection s:shard1 x:control_collection_shard1_replica_n1] o.a.s.h.ReplicationHandler Commits will be reserved for 10000
[junit4] 2> 46468 INFO (searcherExecutor-10-thread-1-processing-n:127.0.0.1:45126_ x:control_collection_shard1_replica_n1 s:shard1 c:control_collection) [n:127.0.0.1:45126_ c:control_collection s:shard1 x:control_collection_shard1_replica_n1] o.a.s.c.SolrCore [control_collection_shard1_replica_n1] Registered new searcher Searcher@586a1929[control_collection_shard1_replica_n1] main{ExitableDirectoryReader(UninvertingDirectoryReader())}
[junit4] 2> 46510 INFO (qtp1638689167-30) [n:127.0.0.1:45126_ c:control_collection s:shard1 x:control_collection_shard1_replica_n1] o.a.s.u.UpdateLog Could not find max version in index or recent updates, using new clock 1578160500213022720
[junit4] 2> 46582 INFO (qtp1638689167-30) [n:127.0.0.1:45126_ c:control_collection s:shard1 x:control_collection_shard1_replica_n1] o.a.s.c.ShardLeaderElectionContext Enough replicas found to continue.
[junit4] 2> 46583 INFO (qtp1638689167-30) [n:127.0.0.1:45126_ c:control_collection s:shard1 x:control_collection_shard1_replica_n1] o.a.s.c.ShardLeaderElectionContext I may be the new leader - try and sync
[junit4] 2> 46583 INFO (qtp1638689167-30) [n:127.0.0.1:45126_ c:control_collection s:shard1 x:control_collection_shard1_replica_n1] o.a.s.c.SyncStrategy Sync replicas to http://127.0.0.1:45126/control_collection_shard1_replica_n1/
[junit4] 2> 46585 INFO (zkCallback-7-thread-1-processing-n:127.0.0.1:45126_) [n:127.0.0.1:45126_ ] o.a.s.c.c.ZkStateReader A cluster state change: [WatchedEvent state:SyncConnected type:NodeDataChanged path:/collections/control_collection/state.json] for collection [control_collection] has occurred - updating... (live nodes size: [1])
[junit4] 2> 46590 INFO (qtp1638689167-30) [n:127.0.0.1:45126_ c:control_collection s:shard1 x:control_collection_shard1_replica_n1] o.a.s.c.SyncStrategy Sync Success - now sync replicas to me
[junit4] 2> 46590 INFO (qtp1638689167-30) [n:127.0.0.1:45126_ c:control_collection s:shard1 x:control_collection_shard1_replica_n1] o.a.s.c.SyncStrategy http://127.0.0.1:45126/control_collection_shard1_replica_n1/ has no replicas
[junit4] 2> 46590 INFO (qtp1638689167-30) [n:127.0.0.1:45126_ c:control_collection s:shard1 x:control_collection_shard1_replica_n1] o.a.s.c.ShardLeaderElectionContext Found all replicas participating in election, clear LIR
[junit4] 2> 46638 INFO (qtp1638689167-30) [n:127.0.0.1:45126_ c:control_collection s:shard1 x:control_collection_shard1_replica_n1] o.a.s.c.ShardLeaderElectionContext I am the new leader: http://127.0.0.1:45126/control_collection_shard1_replica_n1/ shard1
[junit4] 2> 46743 INFO (zkCallback-7-thread-1-processing-n:127.0.0.1:45126_) [n:127.0.0.1:45126_ ] o.a.s.c.c.ZkStateReader A cluster state change: [WatchedEvent state:SyncConnected type:NodeDataChanged path:/collections/control_collection/state.json] for collection [control_collection] has occurred - updating... (live nodes size: [1])
[junit4] 2> 46792 INFO (qtp1638689167-30) [n:127.0.0.1:45126_ c:control_collection s:shard1 x:control_collection_shard1_replica_n1] o.a.s.c.ZkController I am the leader, no recovery necessary
[junit4] 2> 46799 INFO (qtp1638689167-30) [n:127.0.0.1:45126_ c:control_collection s:shard1 x:control_collection_shard1_replica_n1] o.a.s.s.HttpSolrCall [admin] webapp=null path=/admin/cores params={qt=/admin/cores&collection.configName=conf1&newCollection=true&name=control_collection_shard1_replica_n1&action=CREATE&numShards=1&collection=control_collection&shard=shard1&wt=javabin&version=2&replicaType=NRT} status=0 QTime=17879
[junit4] 2> 47007 INFO (zkCallback-7-thread-1-processing-n:127.0.0.1:45126_) [n:127.0.0.1:45126_ ] o.a.s.c.c.ZkStateReader A cluster state change: [WatchedEvent state:SyncConnected type:NodeDataChanged path:/collections/control_collection/state.json] for collection [control_collection] has occurred - updating... (live nodes size: [1])
[junit4] 2> 47048 INFO (qtp1638689167-28) [n:127.0.0.1:45126_ ] o.a.s.h.a.CollectionsHandler Wait for new collection to be active for at most 30 seconds. Check all shard replicas
[junit4] 2> 47049 INFO (OverseerCollectionConfigSetProcessor-98635028327759876-127.0.0.1:45126_-n_0000000000) [n:127.0.0.1:45126_ ] o.a.s.c.OverseerTaskQueue Response ZK path: /overseer/collection-queue-work/qnr-0000000000 doesn't exist. Requestor may have disconnected from ZooKeeper
[junit4] 2> 47048 INFO (qtp1638689167-28) [n:127.0.0.1:45126_ ] o.a.s.s.HttpSolrCall [admin] webapp=null path=/admin/collections params={replicationFactor=1&collection.configName=conf1&name=control_collection&nrtReplicas=1&action=CREATE&numShards=1&createNodeSet=127.0.0.1:45126_&wt=javabin&version=2} status=0 QTime=19669
[junit4] 2> 47089 INFO (TEST-UnloadDistributedZkTest.test-seed#[1C749CA420A6DBD3]) [ ] o.a.s.c.c.ZkStateReader Updated live nodes from ZooKeeper... (0) -> (1)
[junit4] 2> 47089 INFO (TEST-UnloadDistributedZkTest.test-seed#[1C749CA420A6DBD3]) [ ] o.a.s.c.s.i.ZkClientClusterStateProvider Cluster at 127.0.0.1:58668/solr ready
[junit4] 2> 47091 INFO (TEST-UnloadDistributedZkTest.test-seed#[1C749CA420A6DBD3]) [ ] o.a.s.c.ChaosMonkey monkey: init - expire sessions:false cause connection loss:false
[junit4] 2> 47094 INFO (qtp1638689167-25) [n:127.0.0.1:45126_ ] o.a.s.h.a.CollectionsHandler Invoked Collection Action :create with params replicationFactor=1&collection.configName=conf1&name=collection1&nrtReplicas=1&action=CREATE&numShards=2&createNodeSet=&stateFormat=1&wt=javabin&version=2 and sendToOCPQueue=true
[junit4] 2> 47114 INFO (OverseerThreadFactory-7-thread-2-processing-n:127.0.0.1:45126_) [n:127.0.0.1:45126_ ] o.a.s.c.CreateCollectionCmd Create collection collection1
[junit4] 2> 47117 WARN (OverseerThreadFactory-7-thread-2-processing-n:127.0.0.1:45126_) [n:127.0.0.1:45126_ ] o.a.s.c.CreateCollectionCmd It is unusual to create a collection (collection1) without cores.
[junit4] 2> 47330 INFO (qtp1638689167-25) [n:127.0.0.1:45126_ ] o.a.s.h.a.CollectionsHandler Wait for new collection to be active for at most 30 seconds. Check all shard replicas
[junit4] 2> 47330 INFO (qtp1638689167-25) [n:127.0.0.1:45126_ ] o.a.s.s.HttpSolrCall [admin] webapp=null path=/admin/collections params={replicationFactor=1&collection.configName=conf1&name=collection1&nrtReplicas=1&action=CREATE&numShards=2&createNodeSet=&stateFormat=1&wt=javabin&version=2} status=0 QTime=236
[junit4] 2> 48276 INFO (TEST-UnloadDistributedZkTest.test-seed#[1C749CA420A6DBD3]) [ ] o.a.s.c.AbstractFullDistribZkTestBase create jetty 1 in directory /x1/jenkins/jenkins-slave/workspace/Lucene-Solr-Tests-7.0/solr/build/solr-core/test/J2/temp/solr.cloud.UnloadDistributedZkTest_1C749CA420A6DBD3-001/shard-1-001 of type TLOG
[junit4] 2> 48308 INFO (TEST-UnloadDistributedZkTest.test-seed#[1C749CA420A6DBD3]) [ ] o.e.j.s.Server jetty-9.3.14.v20161028
[junit4] 2> 48327 INFO (TEST-UnloadDistributedZkTest.test-seed#[1C749CA420A6DBD3]) [ ] o.e.j.s.h.ContextHandler Started o.e.j.s.ServletContextHandler@98fe541{/,null,AVAILABLE}
[junit4] 2> 48345 INFO (TEST-UnloadDistributedZkTest.test-seed#[1C749CA420A6DBD3]) [ ] o.e.j.s.AbstractConnector Started ServerConnector@1956f7ee{HTTP/1.1,[http/1.1]}{127.0.0.1:42291}
[junit4] 2> 48345 INFO (TEST-UnloadDistributedZkTest.test-seed#[1C749CA420A6DBD3]) [ ] o.e.j.s.Server Started @57432ms
[junit4] 2> 48345 INFO (TEST-UnloadDistributedZkTest.test-seed#[1C749CA420A6DBD3]) [ ] o.a.s.c.s.e.JettySolrRunner Jetty properties: {solr.data.dir=/x1/jenkins/jenkins-slave/workspace/Lucene-Solr-Tests-7.0/solr/build/solr-core/test/J2/temp/solr.cloud.UnloadDistributedZkTest_1C749CA420A6DBD3-001/tempDir-001/jetty1, replicaType=TLOG, solrconfig=solrconfig.xml, hostContext=/, hostPort=42291, coreRootDirectory=/x1/jenkins/jenkins-slave/workspace/Lucene-Solr-Tests-7.0/solr/build/solr-core/test/J2/../../../../../../../../../../x1/jenkins/jenkins-slave/workspace/Lucene-Solr-Tests-7.0/solr/build/solr-core/test/J2/temp/solr.cloud.UnloadDistributedZkTest_1C749CA420A6DBD3-001/shard-1-001/cores}
[junit4] 2> 48346 ERROR (TEST-UnloadDistributedZkTest.test-seed#[1C749CA420A6DBD3]) [ ] o.a.s.s.StartupLoggingUtils Missing Java Option solr.log.dir. Logging may be missing or incomplete.
[junit4] 2> 48346 INFO (TEST-UnloadDistributedZkTest.test-seed#[1C749CA420A6DBD3]) [ ] o.a.s.s.SolrDispatchFilter ___ _ Welcome to Apache Solr? version 7.0.0
[junit4] 2> 48346 INFO (TEST-UnloadDistributedZkTest.test-seed#[1C749CA420A6DBD3]) [ ] o.a.s.s.SolrDispatchFilter / __| ___| |_ _ Starting in cloud mode on port null
[junit4] 2> 48346 INFO (TEST-UnloadDistributedZkTest.test-seed#[1C749CA420A6DBD3]) [ ] o.a.s.s.SolrDispatchFilter \__ \/ _ \ | '_| Install dir: null, Default config dir: null
[junit4] 2> 48346 INFO (TEST-UnloadDistributedZkTest.test-seed#[1C749CA420A6DBD3]) [ ] o.a.s.s.SolrDispatchFilter |___/\___/_|_| Start time: 2017-09-10T13:45:38.056Z
[junit4] 2> 48618 INFO (TEST-UnloadDistributedZkTest.test-seed#[1C749CA420A6DBD3]) [ ] o.a.s.s.SolrDispatchFilter Loading solr.xml from SolrHome (not found in ZooKeeper)
[junit4] 2> 48618 INFO (TEST-UnloadDistributedZkTest.test-seed#[1C749CA420A6DBD3]) [ ] o.a.s.c.SolrXmlConfig Loading container configuration from /x1/jenkins/jenkins-slave/workspace/Lucene-Solr-Tests-7.0/solr/build/solr-core/test/J2/temp/solr.cloud.UnloadDistributedZkTest_1C749CA420A6DBD3-001/shard-1-001/solr.xml
[junit4] 2> 48724 INFO (TEST-UnloadDistributedZkTest.test-seed#[1C749CA420A6DBD3]) [ ] o.a.s.c.SolrXmlConfig MBean server found: com.sun.jmx.mbeanserver.JmxMBeanServer@72f175fe, but no JMX reporters were configured - adding default JMX reporter.
[junit4] 2> 48828 INFO (TEST-UnloadDistributedZkTest.test-seed#[1C749CA420A6DBD3]) [ ] o.a.s.c.ZkContainer Zookeeper client=127.0.0.1:58668/solr
[junit4] 2> 50055 INFO (OverseerCollectionConfigSetProcessor-98635028327759876-127.0.0.1:45126_-n_0000000000) [n:127.0.0.1:45126_ ] o.a.s.c.OverseerTaskQueue Response ZK path: /overseer/collection-queue-work/qnr-0000000002 doesn't exist. Requestor may have disconnected from ZooKeeper
[junit4] 2> 50110 INFO (TEST-UnloadDistributedZkTest.test-seed#[1C749CA420A6DBD3]) [n:127.0.0.1:42291_ ] o.a.s.c.c.ZkStateReader Updated live nodes from ZooKeeper... (0) -> (1)
[junit4] 2> 50112 INFO (TEST-UnloadDistributedZkTest.test-seed#[1C749CA420A6DBD3]) [n:127.0.0.1:42291_ ] o.a.s.c.Overseer Overseer (id=null) closing
[junit4] 2> 50142 INFO (TEST-UnloadDistributedZkTest.test-seed#[1C749CA420A6DBD3]) [n:127.0.0.1:42291_ ] o.a.s.c.ZkController Register node as live in ZooKeeper:/live_nodes/127.0.0.1:42291_
[junit4] 2> 50144 INFO (zkCallback-14-thread-1) [ ] o.a.s.c.c.ZkStateReader Updated live nodes from ZooKeeper... (1) -> (2)
[junit4] 2> 50144 INFO (zkCallback-7-thread-1-processing-n:127.0.0.1:45126_) [n:127.0.0.1:45126_ ] o.a.s.c.c.ZkStateReader Updated live nodes from ZooKeeper... (1) -> (2)
[junit4] 2> 50198 INFO (zkCallback-19-thread-1-processing-n:127.0.0.1:42291_) [n:127.0.0.1:42291_ ] o.a.s.c.c.ZkStateReader Updated live nodes from ZooKeeper... (1) -> (2)
[junit4] 2> 52141 INFO (TEST-UnloadDistributedZkTest.test-seed#[1C749CA420A6DBD3]) [n:127.0.0.1:42291_ ] o.a.s.m.r.SolrJmxReporter JMX monitoring for 'solr.node' (registry 'solr.node') enabled at server: com.sun.jmx.mbeanserver.JmxMBeanServer@72f175fe
[junit4] 2> 52247 INFO (TEST-UnloadDistributedZkTest.test-seed#[1C749CA420A6DBD3]) [n:127.0.0.1:42291_ ] o.a.s.m.r.SolrJmxReporter JMX monitoring for 'solr.jvm' (registry 'solr.jvm') enabled at server: com.sun.jmx.mbeanserver.JmxMBeanServer@72f175fe
[junit4] 2> 52247 INFO (TEST-UnloadDistributedZkTest.test-seed#[1C749CA420A6DBD3]) [n:127.0.0.1:42291_ ] o.a.s.m.r.SolrJmxReporter JMX monitoring for 'solr.jetty' (registry 'solr.jetty') enabled at server: com.sun.jmx.mbeanserver.JmxMBeanServer@72f175fe
[junit4] 2> 52249 INFO (TEST-UnloadDistributedZkTest.test-seed#[1C749CA420A6DBD3]) [n:127.0.0.1:42291_ ] o.a.s.c.CorePropertiesLocator Found 0 core definitions underneath /x1/jenkins/jenkins-slave/workspace/Lucene-Solr-Tests-7.0/solr/build/solr-core/test/J2/../../../../../../../../../../x1/jenkins/jenkins-slave/workspace/Lucene-Solr-Tests-7.0/solr/build/solr-core/test/J2/temp/solr.cloud.UnloadDistributedZkTest_1C749CA420A6DBD3-001/shard-1-001/cores
[junit4] 2> 52603 INFO (qtp633894901-76) [n:127.0.0.1:42291_ ] o.a.s.h.a.CollectionsHandler Invoked Collection Action :addreplica with params node=127.0.0.1:42291_&action=ADDREPLICA&collection=collection1&shard=shard2&type=TLOG&wt=javabin&version=2 and sendToOCPQueue=true
[junit4] 2> 52619 INFO (OverseerThreadFactory-7-thread-3-processing-n:127.0.0.1:45126_) [n:127.0.0.1:45126_ ] o.a.s.c.AddReplicaCmd Node Identified 127.0.0.1:42291_ for creating new replica
[junit4] 2> 52651 INFO (qtp633894901-67) [n:127.0.0.1:42291_ ] o.a.s.h.a.CoreAdminOperation core create command qt=/admin/cores&collection.configName=conf1&name=collection1_shard2_replica_t0&action=CREATE&collection=collection1&shard=shard2&wt=javabin&version=2&replicaType=TLOG
[junit4] 2> 52653 INFO (qtp633894901-67) [n:127.0.0.1:42291_ ] o.a.s.c.TransientSolrCoreCacheDefault Allocating transient cache for 4 transient cores
[junit4] 2> 52743 INFO (qtp633894901-67) [n:127.0.0.1:42291_ c:collection1 s:shard2 x:collection1_shard2_replica_t0] o.a.s.c.SolrConfig Using Lucene MatchVersion: 7.0.0
[junit4] 2> 53150 INFO (qtp633894901-67) [n:127.0.0.1:42291_ c:collection1 s:shard2 x:collection1_shard2_replica_t0] o.a.s.s.IndexSchema [collection1_shard2_replica_t0] Schema name=test
[junit4] 2> 54253 INFO (qtp633894901-67) [n:127.0.0.1:42291_ c:collection1 s:shard2 x:collection1_shard2_replica_t0] o.a.s.s.IndexSchema Loaded schema test/1.0 with uniqueid field id
[junit4] 2> 54380 INFO (qtp633894901-67) [n:127.0.0.1:42291_ c:collection1 s:shard2 x:collection1_shard2_replica_t0] o.a.s.c.CoreContainer Creating SolrCore 'collection1_shard2_replica_t0' using configuration from collection collection1, trusted=true
[junit4] 2> 54381 INFO (qtp633894901-67) [n:127.0.0.1:42291_ c:collection1 s:shard2 x:collection1_shard2_replica_t0] o.a.s.m.r.SolrJmxReporter JMX monitoring for 'solr.core.collection1.shard2.replica_t0' (registry 'solr.core.collection1.shard2.replica_t0') enabled at server: com.sun.jmx.mbeanserver.JmxMBeanServer@72f175fe
[junit4] 2> 54381 INFO (qtp633894901-67) [n:127.0.0.1:42291_ c:collection1 s:shard2 x:collection1_shard2_replica_t0] o.a.s.c.SolrCore solr.RecoveryStrategy.Builder
[junit4] 2> 54381 INFO (qtp633894901-67) [n:127.0.0.1:42291_ c:collection1 s:shard2 x:collection1_shard2_replica_t0] o.a.s.c.SolrCore [[collection1_shard2_replica_t0] ] Opening new SolrCore at [/x1/jenkins/jenkins-slave/workspace/Lucene-Solr-Tests-7.0/solr/build/solr-core/test/J2/temp/solr.cloud.UnloadDistributedZkTest_1C749CA420A6DBD3-001/shard-1-001/cores/collection1_shard2_replica_t0], dataDir=[/x1/jenkins/jenkins-slave/workspace/Lucene-Solr-Tests-7.0/solr/build/solr-core/test/J2/../../../../../../../../../../x1/jenkins/jenkins-slave/workspace/Lucene-Solr-Tests-7.0/solr/build/solr-core/test/J2/temp/solr.cloud.UnloadDistributedZkTest_1C749CA420A6DBD3-001/shard-1-001/cores/collection1_shard2_replica_t0/data/]
[junit4] 2> 54683 INFO (qtp633894901-67) [n:127.0.0.1:42291_ c:collection1 s:shard2 x:collection1_shard2_replica_t0] o.a.s.u.RandomMergePolicy RandomMergePolicy wrapping class org.apache.lucene.index.TieredMergePolicy: [TieredMergePolicy: maxMergeAtOnce=37, maxMergeAtOnceExplicit=39, maxMergedSegmentMB=76.009765625, floorSegmentMB=0.609375, forceMergeDeletesPctAllowed=15.301188542761057, segmentsPerTier=42.0, maxCFSSegmentSizeMB=8.796093022207999E12, noCFSRatio=0.8869775876119809
[junit4] 2> 54735 WARN (qtp633894901-67) [n:127.0.0.1:42291_ c:collection1 s:shard2 x:collection1_shard2_replica_t0] o.a.s.c.RequestHandlers INVALID paramSet a in requestHandler {type = requestHandler,name = /dump,class = DumpRequestHandler,attributes = {initParams=a, name=/dump, class=DumpRequestHandler},args = {defaults={a=A,b=B}}}
[junit4] 2> 55276 INFO (qtp633894901-67) [n:127.0.0.1:42291_ c:collection1 s:shard2 x:collection1_shard2_replica_t0] o.a.s.u.UpdateHandler Using UpdateLog implementation: org.apache.solr.update.UpdateLog
[junit4] 2> 55291 INFO (qtp633894901-67) [n:127.0.0.1:42291_ c:collection1 s:shard2 x:collection1_shard2_replica_t0] o.a.s.u.UpdateLog Initializing UpdateLog: dataDir= defaultSyncLevel=FLUSH numRecordsToKeep=100 maxNumLogsToKeep=10 numVersionBuckets=65536
[junit4] 2> 55294 INFO (qtp633894901-67) [n:127.0.0.1:42291_ c:collection1 s:shard2 x:collection1_shard2_replica_t0] o.a.s.u.CommitTracker Hard AutoCommit: disabled
[junit4] 2> 55308 INFO (qtp633894901-67) [n:127.0.0.1:42291_ c:collection1 s:shard2 x:collection1_shard2_replica_t0] o.a.s.u.CommitTracker Soft AutoCommit: disabled
[junit4] 2> 55314 INFO (qtp633894901-67) [n:127.0.0.1:42291_ c:collection1 s:shard2 x:collection1_shard2_replica_t0] o.a.s.u.RandomMergePolicy RandomMergePolicy wrapping class org.apache.lucene.index.TieredMergePolicy: [TieredMergePolicy: maxMergeAtOnce=19, maxMergeAtOnceExplicit=17, maxMergedSegmentMB=72.98046875, floorSegmentMB=0.4990234375, forceMergeDeletesPctAllowed=17.556965689564507, segmentsPerTier=26.0, maxCFSSegmentSizeMB=8.796093022207999E12, noCFSRatio=1.0
[junit4] 2> 55323 INFO (qtp633894901-67) [n:127.0.0.1:42291_ c:collection1 s:shard2 x:collection1_shard2_replica_t0] o.a.s.s.SolrIndexSearcher Opening [Searcher@23461f06[collection1_shard2_replica_t0] main]
[junit4] 2> 55327 INFO (qtp633894901-67) [n:127.0.0.1:42291_ c:collection1 s:shard2 x:collection1_shard2_replica_t0] o.a.s.r.ManagedResourceStorage Configured ZooKeeperStorageIO with znodeBase: /configs/conf1
[junit4] 2> 55329 INFO (qtp633894901-67) [n:127.0.0.1:42291_ c:collection1 s:shard2 x:collection1_shard2_replica_t0] o.a.s.r.ManagedResourceStorage Loaded null at path _rest_managed.json using ZooKeeperStorageIO:path=/configs/conf1
[junit4] 2> 55331 INFO (qtp633894901-67) [n:127.0.0.1:42291_ c:collection1 s:shard2 x:collection1_shard2_replica_t0] o.a.s.h.ReplicationHandler Commits will be reserved for 10000
[junit4] 2> 55338 INFO (searcherExecutor-21-thread-1-processing-n:127.0.0.1:42291_ x:collection1_shard2_replica_t0 s:shard2 c:collection1) [n:127.0.0.1:42291_ c:collection1 s:shard2 x:collection1_shard2_replica_t0] o.a.s.c.SolrCore [collection1_shard2_replica_t0] Registered new searcher Searcher@23461f06[collection1_shard2_replica_t0] main{ExitableDirectoryReader(UninvertingDirectoryReader())}
[junit4] 2> 55339 INFO (qtp633894901-67) [n:127.0.0.1:42291_ c:collection1 s:shard2 x:collection1_shard2_replica_t0] o.a.s.u.UpdateLog Could not find max version in index or recent updates, using new clock 1578160509470900224
[junit4] 2> 55366 INFO (qtp633894901-67) [n:127.0.0.1:42291_ c:collection1 s:shard2 x:collection1_shard2_replica_t0] o.a.s.c.ShardLeaderElectionContext Enough replicas found to continue.
[junit4] 2> 55366 INFO (qtp633894901-67) [n:127.0.0.1:42291_ c:collection1 s:shard2 x:collection1_shard2_replica_t0] o.a.s.c.ShardLeaderElectionContext I may be the new leader - try and sync
[junit4] 2> 55366 INFO (qtp633894901-67) [n:127.0.0.1:42291_ c:collection1 s:shard2 x:collection1_shard2_replica_t0] o.a.s.c.SyncStrategy Sync replicas to http://127.0.0.1:42291/collection1_shard2_replica_t0/
[junit4] 2> 55366 INFO (qtp633894901-67) [n:127.0.0.1:42291_ c:collection1 s:shard2 x:collection1_shard2_replica_t0] o.a.s.c.SyncStrategy Sync Success - now sync replicas to me
[junit4] 2> 55367 INFO (qtp633894901-67) [n:127.0.0.1:42291_ c:collection1 s:shard2 x:collection1_shard2_replica_t0] o.a.s.c.SyncStrategy http://127.0.0.1:42291/collection1_shard2_replica_t0/ has no replicas
[junit4] 2> 55367 INFO (qtp633894901-67) [n:127.0.0.1:42291_ c:collection1 s:shard2 x:collection1_shard2_replica_t0] o.a.s.c.ShardLeaderElectionContext Found all replicas participating in election, clear LIR
[junit4] 2> 55368 INFO (qtp633894901-67) [n:127.0.0.1:42291_ c:collection1 s:shard2 x:collection1_shard2_replica_t0] o.a.s.c.ZkController collection1_shard2_replica_t0 stopping background replication from leader
[junit4] 2> 55375 INFO (qtp633894901-67) [n:127.0.0.1:42291_ c:collection1 s:shard2 x:collection1_shard2_replica_t0] o.a.s.c.ShardLeaderElectionContext I am the new leader: http://127.0.0.1:42291/collection1_shard2_replica_t0/ shard2
[junit4] 2> 55527 INFO (qtp633894901-67) [n:127.0.0.1:42291_ c:collection1 s:shard2 x:collection1_shard2_replica_t0] o.a.s.c.ZkController I am the leader, no recovery necessary
[junit4] 2> 55531 INFO (qtp633894901-67) [n:127.0.0.1:42291_ c:collection1 s:shard2 x:collection1_shard2_replica_t0] o.a.s.s.HttpSolrCall [admin] webapp=null path=/admin/cores params={qt=/admin/cores&collection.configName=conf1&name=collection1_shard2_replica_t0&action=CREATE&collection=collection1&shard=shard2&wt=javabin&version=2&replicaType=TLOG} status=0 QTime=2879
[junit4] 2> 55538 INFO (qtp633894901-76) [n:127.0.0.1:42291_ ] o.a.s.s.HttpSolrCall [admin] webapp=null path=/admin/collections params={node=127.0.0.1:42291_&action=ADDREPLICA&collection=collection1&shard=shard2&type=TLOG&wt=javabin&version=2} status=0 QTime=2935
[junit4] 2> 56412 INFO (TEST-UnloadDistributedZkTest.test-seed#[1C749CA420A6DBD3]) [ ] o.a.s.c.AbstractFullDistribZkTestBase create jetty 2 in directory /x1/jenkins/jenkins-slave/workspace/Lucene-Solr-Tests-7.0/solr/build/solr-core/test/J2/temp/solr.cloud.UnloadDistributedZkTest_1C749CA420A6DBD3-001/shard-2-001 of type TLOG
[junit4] 2> 56413 INFO (TEST-UnloadDistributedZkTest.test-seed#[1C749CA420A6DBD3]) [ ] o.e.j.s.Server jetty-9.3.14.v20161028
[junit4] 2> 56496 INFO (TEST-UnloadDistributedZkTest.test-seed#[1C749CA420A6DBD3]) [ ] o.e.j.s.h.ContextHandler Started o.e.j.s.ServletContextHandler@f01876d{/,null,AVAILABLE}
[junit4] 2> 56496 INFO (TEST-UnloadDistributedZkTest.test-seed#[1C749CA420A6DBD3]) [ ] o.e.j.s.AbstractConnector Started ServerConnector@3bf62e5f{HTTP/1.1,[http/1.1]}{127.0.0.1:55983}
[junit4] 2> 56496 INFO (TEST-UnloadDistributedZkTest.test-seed#[1C749CA420A6DBD3]) [ ] o.e.j.s.Server Started @65583ms
[junit4] 2> 56496 INFO (TEST-UnloadDistributedZkTest.test-seed#[1C749CA420A6DBD3]) [ ] o.a.s.c.s.e.JettySolrRunner Jetty properties: {solr.data.dir=/x1/jenkins/jenkins-slave/workspace/Lucene-Solr-Tests-7.0/solr/build/solr-core/test/J2/temp/solr.cloud.UnloadDistributedZkTest_1C749CA420A6DBD3-001/tempDir-001/jetty2, replicaType=TLOG, solrconfig=solrconfig.xml, hostContext=/, hostPort=55983, coreRootDirectory=/x1/jenkins/jenkins-slave/workspace/Lucene-Solr-Tests-7.0/solr/build/solr-core/test/J2/../../../../../../../../../../x1/jenkins/jenkins-slave/workspace/Lucene-Solr-Tests-7.0/solr/build/solr-core/test/J2/temp/solr.cloud.UnloadDistributedZkTest_1C749CA420A6DBD3-001/shard-2-001/cores}
[junit4] 2> 56497 ERROR (TEST-UnloadDistributedZkTest.test-seed#[1C749CA420A6DBD3]) [ ] o.a.s.s.StartupLoggingUtils Missing Java Option solr.log.dir. Logging may be missing or incomplete.
[junit4] 2> 56511 INFO (TEST-UnloadDistributedZkTest.test-seed#[1C749CA420A6DBD3]) [ ] o.a.s.s.SolrDispatchFilter ___ _ Welcome to Apache Solr? version 7.0.0
[junit4] 2> 56511 INFO (TEST-UnloadDistributedZkTest.test-seed#[1C749CA420A6DBD3]) [ ] o.a.s.s.SolrDispatchFilter / __| ___| |_ _ Starting in cloud mode on port null
[junit4] 2> 56511 INFO (TEST-UnloadDistributedZkTest.test-seed#[1C749CA420A6DBD3]) [ ] o.a.s.s.SolrDispatchFilter \__ \/ _ \ | '_| Install dir: null, Default config dir: null
[junit4] 2> 56511 INFO (TEST-UnloadDistributedZkTest.test-seed#[1C749CA420A6DBD3]) [ ] o.a.s.s.SolrDispatchFilter |___/\___/_|_| Start time: 2017-09-10T13:45:46.221Z
[junit4] 2> 56528 INFO (TEST-UnloadDistributedZkTest.test-seed#[1C749CA420A6DBD3]) [ ] o.a.s.s.SolrDispatchFilter Loading solr.xml from SolrHome (not found in ZooKeeper)
[junit4] 2> 56528 INFO (TEST-UnloadDistributedZkTest.test-seed#[1C749CA420A6DBD3]) [ ] o.a.s.c.SolrXmlConfig Loading container configuration from /x1/jenkins/jenkins-slave/workspace/Lucene-Solr-Tests-7.0/solr/build/solr-core/test/J2/temp/solr.cloud.UnloadDistributedZkTest_1C749CA420A6DBD3-001/shard-2-001/solr.xml
[junit4] 2> 56538 INFO (TEST-UnloadDistributedZkTest.test-seed#[1C749CA420A6DBD3]) [ ] o.a.s.c.SolrXmlConfig MBean server found: com.sun.jmx.mbeanserver.JmxMBeanServer@72f175fe, but no JMX reporters were configured - adding default JMX reporter.
[junit4] 2> 56543 INFO (TEST-UnloadDistributedZkTest.test-seed#[1C749CA420A6DBD3]) [ ] o.a.s.c.ZkContainer Zookeeper client=127.0.0.1:58668/solr
[junit4] 2> 56575 INFO (TEST-UnloadDistributedZkTest.test-seed#[1C749CA420A6DBD3]) [n:127.0.0.1:55983_ ] o.a.s.c.c.ZkStateReader Updated live nodes from ZooKeeper... (0) -> (2)
[junit4] 2> 56578 INFO (TEST-UnloadDistributedZkTest.test-seed#[1C749CA420A6DBD3]) [n:127.0.0.1:55983_ ] o.a.s.c.Overseer Overseer (id=null) closing
[junit4] 2> 56587 INFO (TEST-UnloadDistributedZkTest.test-seed#[1C749CA420A6DBD3]) [n:127.0.0.1:55983_ ] o.a.s.c.ZkController Register node as live in ZooKeeper:/live_nodes/127.0.0.1:55983_
[junit4] 2> 56589 INFO (zkCallback-14-thread-1) [ ] o.a.s.c.c.ZkStateReader Updated live nodes from ZooKeeper... (2) -> (3)
[junit4] 2> 56589 INFO (zkCallback-7-thread-1-processing-n:127.0.0.1:45126_) [n:127.0.0.1:45126_ ] o.a.s.c.c.ZkStateReader Updated live nodes from ZooKeeper... (2) -> (3)
[junit4] 2> 56589 INFO (zkCallback-19-thread-1-processing-n:127.0.0.1:42291_) [n:127.0.0.1:42291_ ] o.a.s.c.c.ZkStateReader Updated live nodes from ZooKeeper... (2) -> (3)
[junit4] 2> 56594 INFO (zkCallback-25-thread-1-processing-n:127.0.0.1:55983_) [n:127.0.0.1:55983_ ] o.a.s.c.c.ZkStateReader Updated live nodes from ZooKeeper... (2) -> (3)
[junit4] 2> 56614 INFO (OverseerCollectionConfigSetProcessor-98635028327759876-127.0.0.1:45126_-n_0000000000) [n:127.0.0.1:45126_ ] o.a.s.c.OverseerTaskQueue Response ZK path: /overseer/collection-queue-work/qnr-0000000004 doesn't exist. Requestor may have disconnected from ZooKeeper
[junit4] 2> 57379 INFO (TEST-UnloadDistributedZkTest.test-seed#[1C749CA420A6DBD3]) [n:127.0.0.1:55983_ ] o.a.s.m.r.SolrJmxReporter JMX monitoring for 'solr.node' (registry 'solr.node') enabled at server: com.sun.jmx.mbeanserver.JmxMBeanServer@72f175fe
[junit4] 2> 57449 INFO (TEST-UnloadDistributedZkTest.test-seed#[1C749CA420A6DBD3]) [n:127.0.0.1:55983_ ] o.a.s.m.r.SolrJmxReporter JMX monitoring for 'solr.jvm' (registry 'solr.jvm') enabled at server: com.sun.jmx.mbeanserver.JmxMBeanServer@72f175fe
[junit4] 2> 57450 INFO (TEST-UnloadDistributedZkTest.test-seed#[1C749CA420A6DBD3]) [n:127.0.0.1:55983_ ] o.a.s.m.r.SolrJmxReporter JMX monitoring for 'solr.jetty' (registry 'solr.jetty') enabled at server: com.sun.jmx.mbeanserver.JmxMBeanServer@72f175fe
[junit4] 2> 57483 INFO (TEST-UnloadDistributedZkTest.test-seed#[1C749CA420A6DBD3]) [n:127.0.0.1:55983_ ] o.a.s.c.CorePropertiesLocator Found 0 core definitions underneath /x1/jenkins/jenkins-slave/workspace/Lucene-Solr-Tests-7.0/solr/build/solr-core/test/J2/../../../../../../../../../../x1/jenkins/jenkins-slave/workspace/Lucene-Solr-Tests-7.0/solr/build/solr-core/test/J2/temp/solr.cloud.UnloadDistributedZkTest_1C749CA420A6DBD3-001/shard-2-001/cores
[junit4] 2> 57913 INFO (qtp1313215611-103) [n:127.0.0.1:55983_ ] o.a.s.h.a.CollectionsHandler Invoked Collection Action :addreplica with params node=127.0.0.1:55983_&action=ADDREPLICA&collection=collection1&shard=shard1&type=TLOG&wt=javabin&version=2 and sendToOCPQueue=true
[junit4] 2> 57944 INFO (OverseerThreadFactory-7-thread-4-processing-n:127.0.0.1:45126_) [n:127.0.0.1:45126_ ] o.a.s.c.AddReplicaCmd Node Identified 127.0.0.1:55983_ for creating new replica
[junit4] 2> 57947 INFO (qtp1313215611-106) [n:127.0.0.1:55983_ ] o.a.s.h.a.CoreAdminOperation core create command qt=/admin/cores&collection.configName=conf1&name=collection1_shard1_replica_t0&action=CREATE&collection=collection1&shard=shard1&wt=javabin&version=2&replicaType=TLOG
[junit4] 2> 57948 INFO (qtp1313215611-106) [n:127.0.0.1:55983_ ] o.a.s.c.TransientSolrCoreCacheDefault Allocating transient cache for 4 transient cores
[junit4] 2> 59255 INFO (qtp1313215611-106) [n:127.0.0.1:55983_ c:collection1 s:shard1 x:collection1_shard1_replica_t0] o.a.s.c.SolrConfig Using Lucene MatchVersion: 7.0.0
[junit4] 2> 59437 INFO (qtp1313215611-106) [n:127.0.0.1:55983_ c:collection1 s:shard1 x:collection1_shard1_replica_t0] o.a.s.s.IndexSchema [collection1_shard1_replica_t0] Schema name=test
[junit4] 2> 60271 INFO (qtp1313215611-106) [n:127.0.0.1:55983_ c:collection1 s:shard1 x:collection1_shard1_replica_t0] o.a.s.s.IndexSchema Loaded schema test/1.0 with uniqueid field id
[junit4] 2> 60410 INFO (qtp1313215611-106) [n:127.0.0.1:55983_ c:collection1 s:shard1 x:collection1_shard1_replica_t0] o.a.s.c.CoreContainer Creating SolrCore 'collection1_shard1_replica_t0' using configuration from collection collection1, trusted=true
[junit4] 2> 60411 INFO (qtp1313215611-106) [n:127.0.0.1:55983_ c:collection1 s:shard1 x:collection1_shard1_replica_t0] o.a.s.m.r.SolrJmxReporter JMX monitoring for 'solr.core.collection1.shard1.replica_t0' (registry 'solr.core.collection1.shard1.replica_t0') enabled at server: com.sun.jmx.mbeanserver.JmxMBeanServer@72f175fe
[junit4] 2> 60411 INFO (qtp1313215611-106) [n:127.0.0.1:55983_ c:collection1 s:shard1 x:collection1_shard1_replica_t0] o.a.s.c.SolrCore solr.RecoveryStrategy.Builder
[junit4] 2> 60411 INFO (qtp1313215611-106) [n:127.0.0.1:55983_ c:collection1 s:shard1 x:collection1_shard1_replica_t0] o.a.s.c.SolrCore [[collection1_shard1_replica_t0] ] Opening new SolrCore at [/x1/jenkins/jenkins-slave/workspace/Lucene-Solr-Tests-7.0/solr/build/solr-core/test/J2/temp/solr.cloud.UnloadDistributedZkTest_1C749CA420A6DBD3-001/shard-2-001/cores/collection1_shard1_replica_t0], dataDir=[/x1/jenkins/jenkins-slave/workspace/Lucene-Solr-Tests-7.0/solr/build/solr-core/test/J2/../../../../../../../../../../x1/jenkins/jenkins-slave/workspace/Lucene-Solr-Tests-7.0/solr/build/solr-core/test/J2/temp/solr.cloud.UnloadDistributedZkTest_1C749CA420A6DBD3-001/shard-2-001/cores/collection1_shard1_replica_t0/data/]
[junit4] 2> 60643 INFO (qtp1313215611-106) [n:127.0.0.1:55983_ c:collection1 s:shard1 x:collection1_shard1_replica_t0] o.a.s.u.RandomMergePolicy RandomMergePolicy wrapping class org.apache.lucene.index.TieredMergePolicy: [TieredMergePolicy: maxMergeAtOnce=37, maxMergeAtOnceExplicit=39, maxMergedSegmentMB=76.009765625, floorSegmentMB=0.609375, forceMergeDeletesPctAllowed=15.301188542761057, segmentsPerTier=42.0, maxCFSSegmentSizeMB=8.796093022207999E12, noCFSRatio=0.8869775876119809
[junit4] 2> 60658 WARN (qtp1313215611-106) [n:127.0.0.1:55983_ c:collection1 s:shard1 x:collection1_shard1_replica_t0] o.a.s.c.RequestHandlers INVALID paramSet a in requestHandler {type = requestHandler,name = /dump,class = DumpRequestHandler,attributes = {initParams=a, name=/dump, class=DumpRequestHandler},args = {defaults={a=A,b=B}}}
[junit4] 2> 61034 INFO (qtp1313215611-106) [n:127.0.0.1:55983_ c:collection1 s:shard1 x:collection1_shard1_replica_t0] o.a.s.u.UpdateHandler Using UpdateLog implementation: org.apache.solr.update.UpdateLog
[junit4] 2> 61035 INFO (qtp1313215611-106) [n:127.0.0.1:55983_ c:collection1 s:shard1 x:collection1_shard1_replica_t0] o.a.s.u.UpdateLog Initializing UpdateLog: dataDir= defaultSyncLevel=FLUSH numRecordsToKeep=100 maxNumLogsToKeep=10 numVersionBuckets=65536
[junit4] 2> 61036 INFO (qtp1313215611-106) [n:127.0.0.1:55983_ c:collection1 s:shard1 x:collection1_shard1_replica_t0] o.a.s.u.CommitTracker Hard AutoCommit: disabled
[junit4] 2> 61043 INFO (qtp1313215611-106) [n:127.0.0.1:55983_ c:collection1 s:shard1 x:collection1_shard1_replica_t0] o.a.s.u.CommitTracker Soft AutoCommit: disabled
[junit4] 2> 61059 INFO (qtp1313215611-106) [n:127.0.0.1:55983_ c:collection1 s:shard1 x:collection1_shard1_replica_t0] o.a.s.u.RandomMergePolicy RandomMergePolicy wrapping class org.apache.lucene.index.TieredMergePolicy: [TieredMergePolicy: maxMergeAtOnce=19, maxMergeAtOnceExplicit=17, maxMergedSegmentMB=72.98046875, floorSegmentMB=0.4990234375, forceMergeDeletesPctAllowed=17.556965689564507, segmentsPerTier=26.0, maxCFSSegmentSizeMB=8.796093022207999E12, noCFSRatio=1.0
[junit4] 2> 61061 INFO (qtp1313215611-106) [n:127.0.0.1:55983_ c:collection1 s:shard1 x:collection1_shard1_replica_t0] o.a.s.s.SolrIndexSearcher Opening [Searcher@37d9d28[collection1_shard1_replica_t0] main]
[junit4] 2> 61063 INFO (qtp1313215611-106) [n:127.0.0.1:55983_ c:collection1 s:shard1 x:collection1_shard1_replica_t0] o.a.s.r.ManagedResourceStorage Configured ZooKeeperStorageIO with znodeBase: /configs/conf1
[junit4] 2> 61065 INFO (qtp1313215611-106) [n:127.0.0.1:55983_ c:collection1 s:shard1 x:collection1_shard1_replica_t0] o.a.s.r.ManagedResourceStorage Loaded null at path _rest_managed.json using ZooKeeperStorageIO:path=/configs/conf1
[junit4] 2> 61065 INFO (qtp1313215611-106) [n:127.0.0.1:55983_ c:collection1 s:shard1 x:collection1_shard1_replica_t0] o.a.s.h.ReplicationHandler Commits will be reserved for 10000
[junit4] 2> 61070 INFO (searcherExecutor-32-thread-1-processing-n:127.0.0.1:55983_ x:collection1_shard1_replica_t0 s:shard1 c:collection1) [n:127.0.0.1:55983_ c:collection1 s:shard1 x:collection1_shard1_replica_t0] o.a.s.c.SolrCore [collection1_shard1_replica_t0] Registered new searcher Searcher@37d9d28[collection1_shard1_replica_t0] main{ExitableDirectoryReader(UninvertingDirectoryReader())}
[junit4] 2> 61074 INFO (qtp1313215611-106) [n:127.0.0.1:55983_ c:collection1 s:shard1 x:collection1_shard1_replica_t0] o.a.s.u.UpdateLog Could not find max version in index or recent updates, using new clock 1578160515484483584
[junit4] 2> 61086 INFO (qtp1313215611-106) [n:127.0.0.1:55983_ c:collection1 s:shard1 x:collection1_shard1_replica_t0] o.a.s.c.ShardLeaderElectionContext Enough replicas found to continue.
[junit4] 2> 61086 INFO (qtp1313215611-106) [n:127.0.0.1:55983_ c:collection1 s:shard1 x:collection1_shard1_replica_t0] o.a.s.c.ShardLeaderElectionContext I may be the new leader - try and sync
[junit4] 2> 61086 INFO (qtp1313215611-106) [n:127.0.0.1:55983_ c:collection1 s:shard1 x:collection1_shard1_replica_t0] o.a.s.c.SyncStrategy Sync replicas to http://127.0.0.1:55983/collection1_shard1_replica_t0/
[junit4] 2> 61086 INFO (qtp1313215611-106) [n:127.0.0.1:55983_ c:collection1 s:shard1 x:collection1_shard1_replica_t0] o.a.s.c.SyncStrategy Sync Success - now sync replicas to me
[junit4] 2> 61087 INFO (qtp1313215611-106) [n:127.0.0.1:55983_ c:collection1 s:shard1 x:collection1_shard1_replica_t0] o.a.s.c.SyncStrategy http://127.0.0.1:55983/collection1_shard1_replica_t0/ has no replicas
[junit4] 2> 61087 INFO (qtp1313215611-106) [n:127.0.0.1:55983_ c:collection1 s:shard1 x:collection1_shard1_replica_t0] o.a.s.c.ShardLeaderElectionContext Found all replicas participating in election, clear LIR
[junit4] 2> 61087 INFO (qtp1313215611-106) [n:127.0.0.1:55983_ c:collection1 s:shard1 x:collection1_shard1_replica_t0] o.a.s.c.ZkController collection1_shard1_replica_t0 stopping background replication from leader
[junit4] 2> 61098 INFO (qtp1313215611-106) [n:127.0.0.1:55983_ c:collection1 s:shard1 x:collection1_shard1_replica_t0] o.a.s.c.ShardLeaderElectionContext I am the new leader: http://127.0.0.1:55983/collection1_shard1_replica_t0/ shard1
[junit4] 2> 61199 INFO (qtp1313215611-106) [n:127.0.0.1:55983_ c:collection1 s:shard1 x:collection1_shard1_replica_t0] o.a.s.c.ZkController I am the leader, no recovery necessary
[junit4] 2> 61201 INFO (qtp1313215611-106) [n:127.0.0.1:55983_ c:collection1 s:shard1 x:collection1_shard1_replica_t0] o.a.s.s.HttpSolrCall [admin] webapp=null path=/admin/cores params={qt=/admin/cores&collection.configName=conf1&name=collection1_shard1_replica_t0&action=CREATE&collection=collection1&shard=shard1&wt=javabin&version=2&replicaType=TLOG} status=0 QTime=3253
[junit4] 2> 61207 INFO (qtp1313215611-103) [n:127.0.0.1:55983_ ] o.a.s.s.HttpSolrCall [admin] webapp=null path=/admin/collections params={node=127.0.0.1:55983_&action=ADDREPLICA&collection=collection1&shard=shard1&type=TLOG&wt=javabin&version=2} status=0 QTime=3294
[junit4] 2> 62061 INFO (OverseerCollectionConfigSetProcessor-98635028327759876-127.0.0.1:45126_-n_0000000000) [n:127.0.0.1:45126_ ] o.a.s.c.OverseerTaskQueue Response ZK path: /overseer/collection-queue-work/qnr-0000000006 doesn't exist. Requestor may have disconnected from ZooKeeper
[junit4] 2> 62665 INFO (TEST-UnloadDistributedZkTest.test-seed#[1C749CA420A6DBD3]) [ ] o.a.s.c.AbstractFullDistribZkTestBase create jetty 3 in directory /x1/jenkins/jenkins-slave/workspace/Lucene-Solr-Tests-7.0/solr/build/solr-core/test/J2/temp/solr.cloud.UnloadDistributedZkTest_1C749CA420A6DBD3-001/shard-3-001 of type TLOG
[junit4] 2> 62678 INFO (TEST-UnloadDistributedZkTest.test-seed#[1C749CA420A6DBD3]) [ ] o.e.j.s.Server jetty-9.3.14.v20161028
[junit4] 2> 62738 INFO (TEST-UnloadDistributedZkTest.test-seed#[1C749CA420A6DBD3]) [ ] o.e.j.s.h.ContextHandler Started o.e.j.s.ServletContextHandler@14e78ca4{/,null,AVAILABLE}
[junit4] 2> 62739 INFO (TEST-UnloadDistributedZkTest.test-seed#[1C749CA420A6DBD3]) [ ] o.e.j.s.AbstractConnector Started ServerConnector@5f1b66cd{HTTP/1.1,[http/1.1]}{127.0.0.1:54993}
[junit4] 2> 62739 INFO (TEST-UnloadDistributedZkTest.test-seed#[1C749CA420A6DBD3]) [ ] o.e.j.s.Server Started @71825ms
[junit4] 2> 62739 INFO (TEST-UnloadDistributedZkTest.test-seed#[1C749CA420A6DBD3]) [ ] o.a.s.c.s.e.JettySolrRunner Jetty properties: {solr.data.dir=/x1/jenkins/jenkins-slave/workspace/Lucene-Solr-Tests-7.0/solr/build/solr-core/test/J2/temp/solr.cloud.UnloadDistributedZkTest_1C749CA420A6DBD3-001/tempDir-001/jetty3, replicaType=TLOG, solrconfig=solrconfig.xml, hostContext=/, hostPort=54993, coreRootDirectory=/x1/jenkins/jenkins-slave/workspace/Lucene-Solr-Tests-7.0/solr/build/solr-core/test/J2/temp/solr.cloud.UnloadDistributedZkTest_1C749CA420A6DBD3-001/shard-3-001/cores}
[junit4] 2> 62739 ERROR (TEST-UnloadDistributedZkTest.test-seed#[1C749CA420A6DBD3]) [ ] o.a.s.s.StartupLoggingUtils Missing Java Option solr.log.dir. Logging may be missing or incomplete.
[junit4] 2> 62753 INFO (TEST-UnloadDistributedZkTest.test-seed#[1C749CA420A6DBD3]) [ ] o.a.s.s.SolrDispatchFilter ___ _ Welcome to Apache Solr? version 7.0.0
[junit4] 2> 62754 INFO (TEST-UnloadDistributedZkTest.test-seed#[1C749CA420A6DBD3]) [ ] o.a.s.s.SolrDispatchFilter / __| ___| |_ _ Starting in cloud mode on port null
[junit4] 2> 62754 INFO (TEST-UnloadDistributedZkTest.test-seed#[1C749CA420A6DBD3]) [ ] o.a.s.s.SolrDispatchFilter \__ \/ _ \ | '_| Install dir: null, Default config dir: null
[junit4] 2> 62754 INFO (TEST-UnloadDistributedZkTest.test-seed#[1C749CA420A6DBD3]) [ ] o.a.s.s.SolrDispatchFilter |___/\___/_|_| Start time: 2017-09-10T13:45:52.464Z
[junit4] 2> 62794 INFO (TEST-UnloadDistributedZkTest.test-seed#[1C749CA420A6DBD3]) [ ] o.a.s.s.SolrDispatchFilter Loading solr.xml from SolrHome (not found in ZooKeeper)
[junit4] 2> 62794 INFO (TEST-UnloadDistributedZkTest.test-seed#[1C749CA420A6DBD3]) [ ] o.a.s.c.SolrXmlConfig Loading container configuration from /x1/jenkins/jenkins-slave/workspace/Lucene-Solr-Tests-7.0/solr/build/solr-core/test/J2/temp/solr.cloud.UnloadDistributedZkTest_1C749CA420A6DBD3-001/shard-3-001/solr.xml
[junit4] 2> 62804 INFO (TEST-UnloadDistributedZkTest.test-seed#[1C749CA420A6DBD3]) [ ] o.a.s.c.SolrXmlConfig MBean server found: com.sun.jmx.mbeanserver.JmxMBeanServer@72f175fe, but no JMX reporters were configured - adding default JMX reporter.
[junit4] 2> 62932 INFO (TEST-UnloadDistributedZkTest.test-seed#[1C749CA420A6DBD3]) [ ] o.a.s.c.ZkContainer Zookeeper client=127.0.0.1:58668/solr
[junit4] 2> 63068 INFO (TEST-UnloadDistributedZkTest.test-seed#[1C749CA420A6DBD3]) [n:127.0.0.1:54993_ ] o.a.s.c.c.ZkStateReader Updated live nodes from ZooKeeper... (0) -> (3)
[junit4] 2> 63074 INFO (TEST-UnloadDistributedZkTest.test-seed#[1C749CA420A6DBD3]) [n:127.0.0.1:54993_ ] o.a.s.c.Overseer Overseer (id=null) closing
[junit4] 2> 63078 INFO (TEST-UnloadDistributedZkTest.test-seed#[1C749CA420A6DBD3]) [n:127.0.0.1:54993_ ] o.a.s.c.ZkController Register node as live in ZooKeeper:/live_nodes/127.0.0.1:54993_
[junit4] 2> 63084 INFO (zkCallback-25-thread-1-processing-n:127.0.0.1:55983_) [n:127.0.0.1:55983_ ] o.a.s.c.c.ZkStateReader Updated live nodes from ZooKeeper... (3) -> (4)
[junit4] 2> 63084 INFO (zkCallback-14-thread-1) [ ] o.a.s.c.c.ZkStateReader Updated live nodes from ZooKeeper... (3) -> (4)
[junit4] 2> 63084 INFO (zkCallback-7-thread-1-processing-n:127.0.0.1:45126_) [n:127.0.0.1:45126_ ] o.a.s.c.c.ZkStateReader Updated live nodes from ZooKeeper... (3) -> (4)
[junit4] 2> 63084 INFO (zkCallback-19-thread-1-processing-n:127.0.0.1:42291_) [n:127.0.0.1:42291_ ] o.a.s.c.c.ZkStateReader Updated live nodes from ZooKeeper... (3) -> (4)
[junit4] 2> 63154 INFO (zkCallback-31-thread-2-processing-n:127.0.0.1:54993_) [n:127.0.0.1:54993_ ] o.a.s.c.c.ZkStateReader Updated live nodes from ZooKeeper... (3) -> (4)
[junit4] 2> 64133 INFO (TEST-UnloadDistributedZkTest.test-seed#[1C749CA420A6DBD3]) [n:127.0.0.1:54993_ ] o.a.s.m.r.SolrJmxReporter JMX monitoring for 'solr.node' (registry 'solr.node') enabled at server: com.sun.jmx.mbeanserver.JmxMBeanServer@72f175fe
[junit4] 2> 64313 INFO (TEST-UnloadDistributedZkTest.test-seed#[1C749CA420A6DBD3]) [n:127.0.0.1:54993_ ] o.a.s.m.r.SolrJmxReporter JMX monitoring for 'solr.jvm' (registry 'solr.jvm') enabled at server: com.sun.jmx.mbeanserver.JmxMBeanServer@72f175fe
[junit4] 2> 64313 INFO (TEST-UnloadDistributedZkTest.test-seed#[1C749CA420A6DBD3]) [n:127.0.0.1:54993_ ] o.a.s.m.r.SolrJmxReporter JMX monitoring for 'solr.jetty' (registry 'solr.jetty') enabled at server: com.sun.jmx.mbeanserver.JmxMBeanServer@72f175fe
[junit4] 2> 64398 INFO (TEST-UnloadDistributedZkTest.test-seed#[1C749CA420A6DBD3]) [n:127.0.0.1:54993_ ] o.a.s.c.CorePropertiesLocator Found 0 core definitions underneath /x1/jenkins/jenkins-slave/workspace/Lucene-Solr-Tests-7.0/solr/build/solr-core/test/J2/temp/solr.cloud.UnloadDistributedZkTest_1C749CA420A6DBD3-001/shard-3-001/cores
[junit4] 2> 65215 INFO (qtp1313215611-104) [n:127.0.0.1:55983_ ] o.a.s.h.a.CollectionsHandler Invoked Collection Action :addreplica with params node=127.0.0.1:54993_&action=ADDREPLICA&collection=collection1&shard=shard2&type=TLOG&wt=javabin&version=2 and sendToOCPQueue=true
[junit4] 2> 65315 INFO (OverseerThreadFactory-7-thread-5-processing-n:127.0.0.1:45126_) [n:127.0.0.1:45126_ ] o.a.s.c.AddReplicaCmd Node Identified 127.0.0.1:54993_ for creating new replica
[junit4] 2> 65395 INFO (qtp1857991799-133) [n:127.0.0.1:54993_ ] o.a.s.h.a.CoreAdminOperation core create command qt=/admin/cores&collection.configName=conf1&name=collection1_shard2_replica_t1&action=CREATE&collection=collection1&shard=shard2&wt=javabin&version=2&replicaType=TLOG
[junit4] 2> 65402 INFO (qtp1857991799-133) [n:127.0.0.1:54993_ ] o.a.s.c.TransientSolrCoreCacheDefault Allocating transient cache for 4 transient cores
[junit4] 2> 65637 INFO (qtp1857991799-133) [n:127.0.0.1:54993_ c:collection1 s:shard2 x:collection1_shard2_replica_t1] o.a.s.c.SolrConfig Using Lucene MatchVersion: 7.0.0
[junit4] 2> 65687 INFO (qtp1857991799-133) [n:127.0.0.1:54993_ c:collection1 s:shard2 x:collection1_shard2_replica_t1] o.a.s.s.IndexSchema [collection1_shard2_replica_t1] Schema name=test
[junit4] 2> 65827 INFO (qtp1857991799-133) [n:127.0.0.1:54993_ c:collection1 s:shard2 x:collection1_shard2_replica_t1] o.a.s.s.IndexSchema Loaded schema test/1.0 with uniqueid field id
[junit4] 2> 65884 INFO (qtp1857991799-133) [n:127.0.0.1:54993_ c:collection1 s:shard2 x:collection1_shard2_replica_t1] o.a.s.c.CoreContainer Creating SolrCore 'collection1_shard2_replica_t1' using configuration from collection collection1, trusted=true
[junit4] 2> 65885 INFO (qtp1857991799-133) [n:127.0.0.1:54993_ c:collection1 s:shard2 x:collection1_shard2_replica_t1] o.a.s.m.r.SolrJmxReporter JMX monitoring for 'solr.core.collection1.shard2.replica_t1' (registry 'solr.core.collection1.shard2.replica_t1') enabled at server: com.sun.jmx.mbeanserver.JmxMBeanServer@72f175fe
[junit4] 2> 65885 INFO (qtp1857991799-133) [n:127.0.0.1:54993_ c:collection1 s:shard2 x:collection1_shard2_replica_t1] o.a.s.c.SolrCore solr.RecoveryStrategy.Builder
[junit4] 2> 65886 INFO (qtp1857991799-133) [n:127.0.0.1:54993_ c:collection1 s:shard2 x:collection1_shard2_replica_t1] o.a.s.c.SolrCore [[collection1_shard2_replica_t1] ] Opening new SolrCore at [/x1/jenkins/jenkins-slave/workspace/Lucene-Solr-Tests-7.0/solr/build/solr-core/test/J2/temp/solr.cloud.UnloadDistributedZkTest_1C749CA420A6DBD3-001/shard-3-001/cores/collection1_shard2_replica_t1], dataDir=[/x1/jenkins/jenkins-slave/workspace/Lucene-Solr-Tests-7.0/solr/build/solr-core/test/J2/temp/solr.cloud.UnloadDistributedZkTest_1C749CA420A6DBD3-001/shard-3-001/cores/collection1_shard2_replica_t1/data/]
[junit4] 2> 65889 INFO (qtp1857991799-133) [n:127.0.0.1:54993_ c:collection1 s:shard2 x:collection1_shard2_replica_t1] o.a.s.u.RandomMergePolicy RandomMergePolicy wrapping class org.apache.lucene.index.TieredMergePolicy: [TieredMergePolicy: maxMergeAtOnce=37, maxMergeAtOnceExplicit=39, maxMergedSegmentMB=76.009765625, floorSegmentMB=0.609375, forceMergeDeletesPctAllowed=15.301188542761057, segmentsPerTier=42.0, maxCFSSegmentSizeMB=8.796093022207999E12, noCFSRatio=0.8869775876119809
[junit4] 2> 65893 WARN (qtp1857991799-133) [n:127.0.0.1:54993_ c:collection1 s:shard2 x:collection1_shard2_replica_t1] o.a.s.c.RequestHandlers INVALID paramSet a in requestHandler {type = requestHandler,name = /dump,class = DumpRequestHandler,attributes = {initParams=a, name=/dump, class=DumpRequestHandler},args = {defaults={a=A,b=B}}}
[junit4] 2> 66088 INFO (qtp1857991799-133) [n:127.0.0.1:54993_ c:collection1 s:shard2 x:collection1_shard2_replica_t1] o.a.s.u.UpdateHandler Using UpdateLog implementation: org.apache.solr.update.UpdateLog
[junit4] 2> 66088 INFO (qtp1857991799-133) [n:127.0.0.1:54993_ c:collection1 s:shard2 x:collection1_shard2_replica_t1] o.a.s.u.UpdateLog Initializing UpdateLog: dataDir= defaultSyncLevel=FLUSH numRecordsToKeep=100 maxNumLogsToKeep=10 numVersionBuckets=65536
[junit4] 2> 66089 INFO (qtp1857991799-133) [n:127.0.0.1:54993_ c:collection1 s:shard2 x:collection1_shard2_replica_t1] o.a.s.u.CommitTracker Hard AutoCommit: disabled
[junit4] 2> 66089 INFO (qtp1857991799-133) [n:127.0.0.1:54993_ c:collection1 s:shard2 x:collection1_shard2_replica_t1] o.a.s.u.CommitTracker Soft AutoCommit: disabled
[junit4] 2> 66091 INFO (qtp1857991799-133) [n:127.0.0.1:54993_ c:collection1 s:shard2 x:collection1_shard2_replica_t1] o.a.s.u.RandomMergePolicy RandomMergePolicy wrapping class org.apache.lucene.index.TieredMergePolicy: [TieredMergePolicy: maxMergeAtOnce=19, maxMergeAtOnceExplicit=17, maxMergedSegmentMB=72.98046875, floorSegmentMB=0.4990234375, forceMergeDeletesPctAllowed=17.556965689564507, segmentsPerTier=26.0, maxCFSSegmentSizeMB=8.796093022207999E12, noCFSRatio=1.0
[junit4] 2> 66091 INFO (qtp1857991799-133) [n:127.0.0.1:54993_ c:collection1 s:shard2 x:collection1_shard2_replica_t1] o.a.s.s.SolrIndexSearcher Opening [Searcher@64956db9[collection1_shard2_replica_t1] main]
[junit4] 2> 66093 INFO (qtp1857991799-133) [n:127.0.0.1:54993_ c:collection1 s:shard2 x:collection1_shard2_replica_t1] o.a.s.r.ManagedResourceStorage Configured ZooKeeperStorageIO with znodeBase: /configs/conf1
[junit4] 2> 66093 INFO (qtp1857991799-133) [n:127.0.0.1:54993_ c:collection1 s:shard2 x:collection1_shard2_replica_t1] o.a.s.r.ManagedResourceStorage Loaded null at path _rest_managed.json using ZooKeeperStorageIO:path=/configs/conf1
[junit4] 2> 66094 INFO (qtp1857991799-133) [n:127.0.0.1:54993_ c:collection1 s:shard2 x:collection1_shard2_replica_t1] o.a.s.h.ReplicationHandler Commits will be reserved for 10000
[junit4] 2> 66094 INFO (qtp1857991799-133) [n:127.0.0.1:54993_ c:collection1 s:shard2 x:collection1_shard2_replica_t1] o.a.s.u.UpdateLog Could not find max version in index or recent updates, using new clock 1578160520748335104
[junit4] 2> 66100 INFO (searcherExecutor-43-thread-1-processing-n:127.0.0.1:54993_ x:collection1_shard2_replica_t1 s:shard2 c:collection1) [n:127.0.0.1:54993_ c:collection1 s:shard2 x:collection1_shard2_replica_t1] o.a.s.c.SolrCore [collection1_shard2_replica_t1] Registered new searcher Searcher@64956db9[collection1_shard2_replica_t1] main{ExitableDirectoryReader(UninvertingDirectoryReader())}
[junit4] 2> 66101 INFO (qtp1857991799-133) [n:127.0.0.1:54993_ c:collection1 s:shard2 x:collection1_shard2_replica_t1] o.a.s.c.ZkController Core needs to recover:collection1_shard2_replica_t1
[junit4] 2> 66103 INFO (qtp1857991799-133) [n:127.0.0.1:54993_ c:collection1 s:shard2 x:collection1_shard2_replica_t1] o.a.s.s.HttpSolrCall [admin] webapp=null path=/admin/cores params={qt=/admin/cores&collection.configName=conf1&name=collection1_shard2_replica_t1&action=CREATE&collection=collection1&shard=shard2&wt=javabin&version=2&replicaType=TLOG} status=0 QTime=707
[junit4] 2> 66107 INFO (updateExecutor-28-thread-1-processing-n:127.0.0.1:54993_ x:collection1_shard2_replica_t1 s:shard2 c:collection1) [n:127.0.0.1:54993_ c:collection1 s:shard2 r:core_node3 x:collection1_shard2_replica_t1] o.a.s.u.DefaultSolrCoreState Running recovery
[junit4] 2> 66124 INFO (recoveryExecutor-29-thread-1-processing-n:127.0.0.1:54993_ x:collection1_shard2_replica_t1 s:shard2 c:collection1 r:core_node3) [n:127.0.0.1:54993_ c:collection1 s:shard2 r:core_node3 x:collection1_shard2_replica_t1] o.a.s.c.RecoveryStrategy Starting recovery process. recoveringAfterStartup=true
[junit4] 2> 66126 INFO (recoveryExecutor-29-thread-1-processing-n:127.0.0.1:54993_ x:collection1_shard2_replica_t1 s:shard2 c:collection1 r:core_node3) [n:127.0.0.1:54993_ c:collection1 s:shard2 r:core_node3 x:collection1_shard2_replica_t1] o.a.s.c.RecoveryStrategy ###### startupVersions=[[]]
[junit4] 2> 66126 INFO (recoveryExecutor-29-thread-1-processing-n:127.0.0.1:54993_ x:collection1_shard2_replica_t1 s:shard2 c:collection1 r:core_node3) [n:127.0.0.1:54993_ c:collection1 s:shard2 r:core_node3 x:collection1_shard2_replica_t1] o.a.s.c.ZkController collection1_shard2_replica_t1 stopping background replication from leader
[junit4] 2> 66126 INFO (recoveryExecutor-29-thread-1-processing-n:127.0.0.1:54993_ x:collection1_shard2_replica_t1 s:shard2 c:collection1 r:core_node3) [n:127.0.0.1:54993_ c:collection1 s:shard2 r:core_node3 x:collection1_shard2_replica_t1] o.a.s.c.RecoveryStrategy Begin buffering updates. core=[collection1_shard2_replica_t1]
[junit4] 2> 66126 INFO (recoveryExecutor-29-thread-1-processing-n:127.0.0.1:54993_ x:collection1_shard2_replica_t1 s:shard2 c:collection1 r:core_node3) [n:127.0.0.1:54993_ c:collection1 s:shard2 r:core_node3 x:collection1_shard2_replica_t1] o.a.s.u.UpdateLog Starting to buffer updates. FSUpdateLog{state=ACTIVE, tlog=null}
[junit4] 2> 66126 INFO (recoveryExecutor-29-thread-1-processing-n:127.0.0.1:54993_ x:collection1_shard2_replica_t1 s:shard2 c:collection1 r:core_node3) [n:127.0.0.1:54993_ c:collection1 s:shard2 r:core_node3 x:collection1_shard2_replica_t1] o.a.s.c.RecoveryStrategy Publishing state of core [collection1_shard2_replica_t1] as recovering, leader is [http://127.0.0.1:42291/collection1_shard2_replica_t0/] and I am [http://127.0.0.1:54993/collection1_shard2_replica_t1/]
[junit4] 2> 66136 INFO (qtp1313215611-104) [n:127.0.0.1:55983_ ] o.a.s.s.HttpSolrCall [admin] webapp=null path=/admin/collections params={node=127.0.0.1:54993_&action=ADDREPLICA&collection=collection1&shard=shard2&type=TLOG&wt=javabin&version=2} status=0 QTime=920
[junit4] 2> 66212 INFO (qtp633894901-70) [n:127.0.0.1:42291_ ] o.a.s.h.a.PrepRecoveryOp Going to wait for coreNodeName: core_node3, state: recovering, checkLive: true, onlyIfLeader: true, onlyIfLeaderActive: true, maxTime: 183 s
[junit4] 2> 66212 INFO (recoveryExecutor-29-thread-1-processing-n:127.0.0.1:54993_ x:collection1_shard2_replica_t1 s:shard2 c:collection1 r:core_node3) [n:127.0.0.1:54993_ c:collection1 s:shard2 r:core_node3 x:collection1_shard2_replica_t1] o.a.s.c.RecoveryStrategy Sending prep recovery command to [http://127.0.0.1:42291]; [WaitForState: action=PREPRECOVERY&core=collection1_shard2_replica_t0&nodeName=127.0.0.1:54993_&coreNodeName=core_node3&state=recovering&checkLive=true&onlyIfLeader=true&onlyIfLeaderActive=true]
[junit4] 2> 66215 INFO (qtp633894901-70) [n:127.0.0.1:42291_ ] o.a.s.h.a.PrepRecoveryOp In WaitForState(recovering): collection=collection1, shard=shard2, thisCore=collection1_shard2_replica_t0, leaderDoesNotNeedRecovery=false, isLeader? true, live=true, checkLive=true, currentState=down, localState=active, nodeName=127.0.0.1:54993_, coreNodeName=core_node3, onlyIfActiveCheckResult=false, nodeProps: core_node3:{"core":"collection1_shard2_replica_t1","base_url":"http://127.0.0.1:54993","node_name":"127.0.0.1:54993_","state":"down","type":"TLOG"}
[junit4] 2> 66875 INFO (TEST-UnloadDistributedZkTest.test-seed#[1C749CA420A6DBD3]) [ ] o.a.s.c.AbstractFullDistribZkTestBase create jetty 4 in directory /x1/jenkins/jenkins-slave/workspace/Lucene-Solr-Tests-7.0/solr/build/solr-core/test/J2/temp/solr.cloud.UnloadDistributedZkTest_1C749CA420A6DBD3-001/shard-4-001 of type TLOG
[junit4] 2> 66876 INFO (TEST-UnloadDistributedZkTest.test-seed#[1C749CA420A6DBD3]) [ ] o.e.j.s.Server jetty-9.3.14.v20161028
[junit4] 2> 67147 INFO (TEST-UnloadDistributedZkTest.test-seed#[1C749CA420A6DBD3]) [ ] o.e.j.s.h.ContextHandler Started o.e.j.s.ServletContextHandler@7d4dcaf0{/,null,AVAILABLE}
[junit4] 2> 67148 INFO (TEST-UnloadDistributedZkTest.test-seed#[1C749CA420A6DBD3]) [ ] o.e.j.s.AbstractConnector Started ServerConnector@29581161{HTTP/1.1,[http/1.1]}{127.0.0.1:49613}
[junit4] 2> 67148 INFO (TEST-UnloadDistributedZkTest.test-seed#[1C749CA420A6DBD3]) [ ] o.e.j.s.Server Started @76235ms
[junit4] 2> 67148 INFO (TEST-UnloadDistributedZkTest.test-seed#[1C749CA420A6DBD3]) [ ] o.a.s.c.s.e.JettySolrRunner Jetty properties: {solr.data.dir=/x1/jenkins/jenkins-slave/workspace/Lucene-Solr-Tests-7.0/solr/build/solr-core/test/J2/temp/solr.cloud.UnloadDistributedZkTest_1C749CA420A6DBD3-001/tempDir-001/jetty4, replicaType=TLOG, solrconfig=solrconfig.xml, hostContext=/, hostPort=49613, coreRootDirectory=/x1/jenkins/jenkins-slave/workspace/Lucene-Solr-Tests-7.0/solr/build/solr-core/test/J2/temp/solr.cloud.UnloadDistributedZkTest_1C749CA420A6DBD3-001/shard-4-001/cores}
[junit4] 2> 67149 ERROR (TEST-UnloadDistributedZkTest.test-seed#[1C749CA420A6DBD3]) [ ] o.a.s.s.StartupLoggingUtils Missing Java Option solr.log.dir. Logging may be missing or incomplete.
[junit4] 2> 67157 INFO (TEST-UnloadDistributedZkTest.test-seed#[1C749CA420A6DBD3]) [ ] o.a.s.s.SolrDispatchFilter ___ _ Welcome to Apache Solr? version 7.0.0
[junit4] 2> 67157 INFO (TEST-UnloadDistributedZkTest.test-seed#[1C749CA420A6DBD3]) [ ] o.a.s.s.SolrDispatchFilter / __| ___| |_ _ Starting in cloud mode on port null
[junit4] 2> 67157 INFO (TEST-UnloadDistributedZkTest.test-seed#[1C749CA420A6DBD3]) [ ] o.a.s.s.SolrDispatchFilter \__ \/ _ \ | '_| Install dir: null, Default config dir: null
[junit4] 2> 67157 INFO (TEST-UnloadDistributedZkTest.test-seed#[1C749CA420A6DBD3]) [ ] o.a.s.s.SolrDispatchFilter |___/\___/_|_| Start time: 2017-09-10T13:45:56.867Z
[junit4] 2> 67196 INFO (TEST-UnloadDistributedZkTest.test-seed#[1C749CA420A6DBD3]) [ ] o.a.s.s.SolrDispatchFilter Loading solr.xml from SolrHome (not found in ZooKeeper)
[junit4] 2> 67196 INFO (TEST-UnloadDistributedZkTest.test-seed#[1C749CA420A6DBD3]) [ ] o.a.s.c.SolrXmlConfig Loading container configuration from /x1/jenkins/jenkins-slave/workspace/Lucene-Solr-Tests-7.0/solr/build/solr-core/test/J2/temp/solr.cloud.UnloadDistributedZkTest_1C749CA420A6DBD3-001/shard-4-001/solr.xml
[junit4] 2> 67215 INFO (TEST-UnloadDistributedZkTest.test-seed#[1C749CA420A6DBD3]) [ ] o.a.s.c.SolrXmlConfig MBean server found: com.sun.jmx.mbeanserver.JmxMBeanServer@72f175fe, but no JMX reporters were configured - adding default JMX reporter.
[junit4] 2> 67215 INFO (qtp633894901-70) [n:127.0.0.1:42291_ ] o.a.s.h.a.PrepRecoveryOp In WaitForState(recovering): collection=collection1, shard=shard2, thisCore=collection1_shard2_replica_t0, leaderDoesNotNeedRecovery=false, isLeader? true, live=true, checkLive=true, currentState=recovering, localState=active, nodeName=127.0.0.1:54993_, coreNodeName=core_node3, onlyIfActiveCheckResult=false, nodeProps: core_node3:{"core":"collection1_shard2_replica_t1","base_url":"http://127.0.0.1:54993","node_name":"127.0.0.1:54993_","state":"recovering","type":"TLOG"}
[junit4] 2> 67215 INFO (qtp633894901-70) [n:127.0.0.1:42291_ ] o.a.s.h.a.PrepRecoveryOp Waited coreNodeName: core_node3, state: recovering, checkLive: true, onlyIfLeader: true for: 1 seconds.
[junit4] 2> 67215 INFO (qtp633894901-70) [n:127.0.0.1:42291_ ] o.a.s.s.HttpSolrCall [admin] webapp=null path=/admin/cores params={nodeName=127.0.0.1:54993_&onlyIfLeaderActive=true&core=collection1_shard2_replica_t0&coreNodeName=core_node3&action=PREPRECOVERY&checkLive=true&state=recovering&onlyIfLeader=true&wt=javabin&version=2} status=0 QTime=1004
[junit4] 2> 67242 INFO (TEST-UnloadDistributedZkTest.test-seed#[1C749CA420A6DBD3]) [ ] o.a.s.c.ZkContainer Zookeeper client=127.0.0.1:58668/solr
[junit4] 2> 67270 INFO (OverseerCollectionConfigSetProcessor-98635028327759876-127.0.0.1:45126_-n_0000000000) [n:127.0.0.1:45126_ ] o.a.s.c.OverseerTaskQueue Response ZK path: /overseer/collection-queue-work/qnr-0000000008 doesn't exist. Requestor may have disconnected from ZooKeeper
[junit4] 2> 67319 INFO (TEST-UnloadDistributedZkTest.test-seed#[1C749CA420A6DBD3]) [n:127.0.0.1:49613_ ] o.a.s.c.c.ZkStateReader Updated live nodes from ZooKeeper... (0) -> (4)
[junit4] 2> 67338 INFO (TEST-UnloadDistributedZkTest.test-seed#[1C749CA420A6DBD3]) [n:127.0.0.1:49613_ ] o.a.s.c.Overseer Overseer (id=null) closing
[junit4] 2> 67344 INFO (TEST-UnloadDistributedZkTest.test-seed#[1C749CA420A6DBD3]) [n:127.0.0.1:49613_ ] o.a.s.c.ZkController Register node as live in ZooKeeper:/live_nodes/127.0.0.1:49613_
[junit4] 2> 67346 INFO (zkCallback-19-thread-1-processing-n:127.0.0.1:42291_) [n:127.0.0.1:42291_ ] o.a.s.c.c.ZkStateReader Updated live nodes from ZooKeeper... (4) -> (5)
[junit4] 2> 67346 INFO (zkCallback-14-thread-1) [ ] o.a.s.c.c.ZkStateReader Updated live nodes from ZooKeeper... (4) -> (5)
[junit4] 2> 67346 INFO (zkCallback-25-thread-1-processing-n:127.0.0.1:55983_) [n:127.0.0.1:55983_ ] o.a.s.c.c.ZkStateReader Updated live nodes from ZooKeeper... (4) -> (5)
[junit4] 2> 67347 INFO (zkCallback-31-thread-2-processing-n:127.0.0.1:54993_) [n:127.0.0.1:54993_ ] o.a.s.c.c.ZkStateReader Updated live nodes from ZooKeeper... (4) -> (5)
[junit4] 2> 67347 INFO (zkCallback-7-thread-1-processing-n:127.0.0.1:45126_) [n:127.0.0.1:45126_ ] o.a.s.c.c.ZkStateReader Updated live nodes from ZooKeeper... (4) -> (5)
[junit4] 2> 67363 INFO (zkCallback-38-thread-1-processing-n:127.0.0.1:49613_) [n:127.0.0.1:49613_ ] o.a.s.c.c.ZkStateReader Updated live nodes from ZooKeeper... (4) -> (5)
[junit4] 2> 67728 INFO (recoveryExecutor-29-thread-1-processing-n:127.0.0.1:54993_ x:collection1_shard2_replica_t1 s:shard2 c:collection1 r:core_node3) [n:127.0.0.1:54993_ c:collection1 s:shard2 r:core_node3 x:collection1_shard2_replica_t1] o.a.s.c.RecoveryStrategy Starting Replication Recovery.
[junit4] 2> 67728 INFO (recoveryExecutor-29-thread-1-processing-n:127.0.0.1:54993_ x:collection1_shard2_replica_t1 s:shard2 c:collection1 r:core_node3) [n:127.0.0.1:54993_ c:collection1 s:shard2 r:core_node3 x:collection1_shard2_replica_t1] o.a.s.c.RecoveryStrategy Attempting to replicate from [http://127.0.0.1:42291/collection1_shard2_replica_t0/].
[junit4] 2> 67802 INFO (qtp633894901-73) [n:127.0.0.1:42291_ c:collection1 s:shard2 r:core_node1 x:collection1_shard2_replica_t0] o.a.s.u.DirectUpdateHandler2 start commit{_version_=1578160522539302912,optimize=false,openSearcher=false,waitSearcher=true,expungeDeletes=false,softCommit=false,prepareCommit=false}
[junit4] 2> 67811 INFO (qtp633894901-73) [n:127.0.0.1:42291_ c:collection1 s:shard2 r:core_node1 x:collection1_shard2_replica_t0] o.a.s.u.DirectUpdateHandler2 No uncommitted changes. Skipping IW.commit.
[junit4] 2> 67811 INFO (qtp633894901-73) [n:127.0.0.1:42291_ c:collection1 s:shard2 r:core_node1 x:collection1_shard2_replica_t0] o.a.s.u.DirectUpdateHandler2 end_commit_flush
[junit4] 2> 67812 INFO (qtp633894901-73) [n:127.0.0.1:42291_ c:collection1 s:shard2 r:core_node1 x:collection1_shard2_replica_t0] o.a.s.u.p.LogUpdateProcessorFactory [collection1_shard2_replica_t0] webapp= path=/update params={waitSearcher=true&openSearcher=false&commit=true&softCommit=false&commit_end_point=true&wt=javabin&version=2}{commit=} 0 78
[junit4] 2> 67829 INFO (qtp633894901-69) [n:127.0.0.1:42291_ c:collection1 s:shard2 r:core_node1 x:collection1_shard2_replica_t0] o.a.s.c.S.Request [collection1_shard2_replica_t0] webapp= path=/replication params={qt=/replication&wt=javabin&version=2&command=indexversion} status=
[...truncated too long message...]
e.metrics.MetricRegistry@7e1e03d
[junit4] 2> 159654 INFO (TEST-UnloadDistributedZkTest.test-seed#[1C749CA420A6DBD3]) [ ] o.a.s.m.SolrMetricManager Closing metric reporters for registry=solr.cluster, tag=null
[junit4] 2> 159670 INFO (coreCloseExecutor-159-thread-1) [n:127.0.0.1:49613_ c:collection1 s:shard1 r:core_node4 x:collection1_shard1_replica_t1] o.a.s.c.SolrCore [collection1_shard1_replica_t1] CLOSING SolrCore org.apache.solr.core.SolrCore@2906464d
[junit4] 2> 159670 INFO (coreCloseExecutor-159-thread-1) [n:127.0.0.1:49613_ c:collection1 s:shard1 r:core_node4 x:collection1_shard1_replica_t1] o.a.s.m.SolrMetricManager Closing metric reporters for registry=solr.core.collection1.shard1.replica_t1, tag=688277069
[junit4] 2> 159670 INFO (coreCloseExecutor-159-thread-1) [n:127.0.0.1:49613_ c:collection1 s:shard1 r:core_node4 x:collection1_shard1_replica_t1] o.a.s.m.r.SolrJmxReporter Closing reporter [org.apache.solr.metrics.reporters.SolrJmxReporter@437ff8ed: rootName = null, domain = solr.core.collection1.shard1.replica_t1, service url = null, agent id = null] for registry solr.core.collection1.shard1.replica_t1 / com.codahale.metrics.MetricRegistry@14a5b787
[junit4] 2> 159711 INFO (coreCloseExecutor-159-thread-1) [n:127.0.0.1:49613_ c:collection1 s:shard1 r:core_node4 x:collection1_shard1_replica_t1] o.a.s.m.SolrMetricManager Closing metric reporters for registry=solr.collection.collection1.shard1.leader, tag=688277069
[junit4] 2> 159750 INFO (TEST-UnloadDistributedZkTest.test-seed#[1C749CA420A6DBD3]) [ ] o.a.s.c.Overseer Overseer (id=98635028327759890-127.0.0.1:49613_-n_0000000004) closing
[junit4] 2> 159750 INFO (OverseerStateUpdate-98635028327759890-127.0.0.1:49613_-n_0000000004) [n:127.0.0.1:49613_ ] o.a.s.c.Overseer Overseer Loop exiting : 127.0.0.1:49613_
[junit4] 2> 160644 WARN (zkCallback-38-thread-1-processing-n:127.0.0.1:49613_) [n:127.0.0.1:49613_ c:unloadcollection s:shard1 r:core_node4 x:unloadcollection_shard1_replica4] o.a.s.c.SyncStrategy Closed, skipping sync up.
[junit4] 2> 160645 INFO (zkCallback-38-thread-1-processing-n:127.0.0.1:49613_) [n:127.0.0.1:49613_ c:unloadcollection s:shard1 r:core_node4 x:unloadcollection_shard1_replica4] o.a.s.c.ShardLeaderElectionContext We failed sync, but we have no versions - we can't sync in that case - we were active before, so become leader anyway
[junit4] 2> 160645 INFO (zkCallback-38-thread-1-processing-n:127.0.0.1:49613_) [n:127.0.0.1:49613_ c:unloadcollection s:shard1 r:core_node4 x:unloadcollection_shard1_replica4] o.a.s.c.SolrCore [unloadcollection_shard1_replica4] CLOSING SolrCore org.apache.solr.core.SolrCore@1bdcb184
[junit4] 2> 160645 INFO (zkCallback-38-thread-1-processing-n:127.0.0.1:49613_) [n:127.0.0.1:49613_ c:unloadcollection s:shard1 r:core_node4 x:unloadcollection_shard1_replica4] o.a.s.m.SolrMetricManager Closing metric reporters for registry=solr.core.unloadcollection.shard1.replica4, tag=467448196
[junit4] 2> 160645 INFO (zkCallback-38-thread-1-processing-n:127.0.0.1:49613_) [n:127.0.0.1:49613_ c:unloadcollection s:shard1 r:core_node4 x:unloadcollection_shard1_replica4] o.a.s.m.r.SolrJmxReporter Closing reporter [org.apache.solr.metrics.reporters.SolrJmxReporter@a7136ec: rootName = null, domain = solr.core.unloadcollection.shard1.replica4, service url = null, agent id = null] for registry solr.core.unloadcollection.shard1.replica4 / com.codahale.metrics.MetricRegistry@2c3054fd
[junit4] 2> 160653 INFO (zkCallback-38-thread-1-processing-n:127.0.0.1:49613_) [n:127.0.0.1:49613_ c:unloadcollection s:shard1 r:core_node4 x:unloadcollection_shard1_replica4] o.a.s.m.SolrMetricManager Closing metric reporters for registry=solr.collection.unloadcollection.shard1.leader, tag=467448196
[junit4] 2> 161261 WARN (zkCallback-38-thread-2-processing-n:127.0.0.1:49613_) [n:127.0.0.1:49613_ ] o.a.s.c.c.ZkStateReader ZooKeeper watch triggered, but Solr cannot talk to ZK: [KeeperErrorCode = Session expired for /live_nodes]
[junit4] 2> 161414 INFO (TEST-UnloadDistributedZkTest.test-seed#[1C749CA420A6DBD3]) [ ] o.e.j.s.AbstractConnector Stopped ServerConnector@29581161{HTTP/1.1,[http/1.1]}{127.0.0.1:0}
[junit4] 2> 161414 INFO (TEST-UnloadDistributedZkTest.test-seed#[1C749CA420A6DBD3]) [ ] o.e.j.s.h.ContextHandler Stopped o.e.j.s.ServletContextHandler@7d4dcaf0{/,null,UNAVAILABLE}
[junit4] 2> 161415 ERROR (TEST-UnloadDistributedZkTest.test-seed#[1C749CA420A6DBD3]) [ ] o.a.z.s.ZooKeeperServer ZKShutdownHandler is not registered, so ZooKeeper server won't take any action on ERROR or SHUTDOWN server state changes
[junit4] 2> 161418 INFO (TEST-UnloadDistributedZkTest.test-seed#[1C749CA420A6DBD3]) [ ] o.a.s.c.ZkTestServer connecting to 127.0.0.1:58668 58668
[junit4] 2> 161554 INFO (Thread-1) [ ] o.a.s.c.ZkTestServer connecting to 127.0.0.1:58668 58668
[junit4] 2> 161557 WARN (Thread-1) [ ] o.a.s.c.ZkTestServer Watch limit violations:
[junit4] 2> Maximum concurrent create/delete watches above limit:
[junit4] 2>
[junit4] 2> 10 /solr/aliases.json
[junit4] 2> 5 /solr/security.json
[junit4] 2> 5 /solr/configs/conf1
[junit4] 2> 4 /solr/collections/collection1/state.json
[junit4] 2>
[junit4] 2> Maximum concurrent data watches above limit:
[junit4] 2>
[junit4] 2> 10 /solr/clusterprops.json
[junit4] 2> 10 /solr/clusterstate.json
[junit4] 2> 3 /solr/collections/unloadcollection/state.json
[junit4] 2> 2 /solr/collections/multiunload/leader_elect/shard2/election/98635028327759881-core_node4-n_0000000001
[junit4] 2>
[junit4] 2> Maximum concurrent children watches above limit:
[junit4] 2>
[junit4] 2> 10 /solr/live_nodes
[junit4] 2> 10 /solr/collections
[junit4] 2> 5 /solr/overseer/queue
[junit4] 2> 5 /solr/overseer/collection-queue-work
[junit4] 2> 5 /solr/overseer/queue-work
[junit4] 2>
[junit4] 2> NOTE: reproduce with: ant test -Dtestcase=UnloadDistributedZkTest -Dtests.method=test -Dtests.seed=1C749CA420A6DBD3 -Dtests.multiplier=2 -Dtests.slow=true -Dtests.locale=ro -Dtests.timezone=America/Araguaina -Dtests.asserts=true -Dtests.file.encoding=ISO-8859-1
[junit4] ERROR 161s J2 | UnloadDistributedZkTest.test <<<
[junit4] > Throwable #1: org.apache.solr.common.SolrException: Could not load collection from ZK: test_unload_shard_and_collection
[junit4] > at __randomizedtesting.SeedInfo.seed([1C749CA420A6DBD3:9420A37E8E5AB62B]:0)
[junit4] > at org.apache.solr.common.cloud.ZkStateReader.getCollectionLive(ZkStateReader.java:1114)
[junit4] > at org.apache.solr.common.cloud.ZkStateReader$LazyCollectionRef.get(ZkStateReader.java:647)
[junit4] > at org.apache.solr.common.cloud.ClusterState.getCollectionOrNull(ClusterState.java:128)
[junit4] > at org.apache.solr.cloud.AbstractDistribZkTestBase.waitForRecoveriesToFinish(AbstractDistribZkTestBase.java:154)
[junit4] > at org.apache.solr.cloud.AbstractDistribZkTestBase.waitForRecoveriesToFinish(AbstractDistribZkTestBase.java:140)
[junit4] > at org.apache.solr.cloud.AbstractDistribZkTestBase.waitForRecoveriesToFinish(AbstractDistribZkTestBase.java:135)
[junit4] > at org.apache.solr.cloud.AbstractFullDistribZkTestBase.waitForRecoveriesToFinish(AbstractFullDistribZkTestBase.java:908)
[junit4] > at org.apache.solr.cloud.UnloadDistributedZkTest.testUnloadShardAndCollection(UnloadDistributedZkTest.java:128)
[junit4] > at org.apache.solr.cloud.UnloadDistributedZkTest.test(UnloadDistributedZkTest.java:71)
[junit4] > at org.apache.solr.BaseDistributedSearchTestCase$ShardsRepeatRule$ShardsFixedStatement.callStatement(BaseDistributedSearchTestCase.java:993)
[junit4] > at org.apache.solr.BaseDistributedSearchTestCase$ShardsRepeatRule$ShardsStatement.evaluate(BaseDistributedSearchTestCase.java:968)
[junit4] > at java.lang.Thread.run(Thread.java:748)
[junit4] > Caused by: org.apache.zookeeper.KeeperException$SessionExpiredException: KeeperErrorCode = Session expired for /collections/test_unload_shard_and_collection/state.json
[junit4] > at org.apache.zookeeper.KeeperException.create(KeeperException.java:127)
[junit4] > at org.apache.zookeeper.KeeperException.create(KeeperException.java:51)
[junit4] > at org.apache.zookeeper.ZooKeeper.getData(ZooKeeper.java:1212)
[junit4] > at org.apache.solr.common.cloud.SolrZkClient$7.execute(SolrZkClient.java:357)
[junit4] > at org.apache.solr.common.cloud.SolrZkClient$7.execute(SolrZkClient.java:354)
[junit4] > at org.apache.solr.common.cloud.ZkCmdExecutor.retryOperation(ZkCmdExecutor.java:60)
[junit4] > at org.apache.solr.common.cloud.SolrZkClient.getData(SolrZkClient.java:354)
[junit4] > at org.apache.solr.common.cloud.ZkStateReader.fetchCollectionState(ZkStateReader.java:1126)
[junit4] > at org.apache.solr.common.cloud.ZkStateReader.getCollectionLive(ZkStateReader.java:1112)
[junit4] > ... 49 more
[junit4] 2> NOTE: leaving temporary files on disk at: /x1/jenkins/jenkins-slave/workspace/Lucene-Solr-Tests-7.0/solr/build/solr-core/test/J2/temp/solr.cloud.UnloadDistributedZkTest_1C749CA420A6DBD3-001
[junit4] 2> Sep 10, 2017 1:47:31 PM com.carrotsearch.randomizedtesting.ThreadLeakControl checkThreadLeaks
[junit4] 2> WARNING: Will linger awaiting termination of 1 leaked thread(s).
[junit4] 2> NOTE: test params are: codec=Asserting(Lucene70), sim=RandomSimilarity(queryNorm=false): {}, locale=ro, timezone=America/Araguaina
[junit4] 2> NOTE: Linux 3.13.0-88-generic amd64/Oracle Corporation 1.8.0_144 (64-bit)/cpus=4,threads=1,free=158176264,total=361234432
[junit4] 2> NOTE: All tests run in this JVM: [UnloadDistributedZkTest]
[junit4] Completed [14/729 (1!)] on J2 in 166.90s, 1 test, 1 error <<< FAILURES!
[...truncated 45794 lines...]
[JENKINS] Lucene-Solr-Tests-7.0 - Build # 130 - Still Unstable
Posted by Apache Jenkins Server <je...@builds.apache.org>.
Build: https://builds.apache.org/job/Lucene-Solr-Tests-7.0/130/
1 tests failed.
FAILED: org.apache.solr.cloud.LeaderFailoverAfterPartitionTest.test
Error Message:
Expected 2 of 3 replicas to be active but only found 1; [core_node3:{"core":"c8n_1x3_lf_shard1_replica_n3","base_url":"http://127.0.0.1:46248","node_name":"127.0.0.1:46248_","state":"active","type":"NRT","leader":"true"}]; clusterState: DocCollection(c8n_1x3_lf//clusterstate.json/30)={ "pullReplicas":"0", "replicationFactor":"1", "shards":{"shard1":{ "range":"80000000-7fffffff", "state":"active", "replicas":{ "core_node1":{ "core":"c8n_1x3_lf_shard1_replica_n1", "base_url":"http://127.0.0.1:34302", "node_name":"127.0.0.1:34302_", "state":"down", "type":"NRT"}, "core_node2":{ "state":"down", "base_url":"http://127.0.0.1:42338", "core":"c8n_1x3_lf_shard1_replica_n2", "node_name":"127.0.0.1:42338_", "type":"NRT"}, "core_node3":{ "core":"c8n_1x3_lf_shard1_replica_n3", "base_url":"http://127.0.0.1:46248", "node_name":"127.0.0.1:46248_", "state":"active", "type":"NRT", "leader":"true"}}}}, "router":{"name":"compositeId"}, "maxShardsPerNode":"1", "autoAddReplicas":"false", "nrtReplicas":"3", "tlogReplicas":"0"}
Stack Trace:
java.lang.AssertionError: Expected 2 of 3 replicas to be active but only found 1; [core_node3:{"core":"c8n_1x3_lf_shard1_replica_n3","base_url":"http://127.0.0.1:46248","node_name":"127.0.0.1:46248_","state":"active","type":"NRT","leader":"true"}]; clusterState: DocCollection(c8n_1x3_lf//clusterstate.json/30)={
"pullReplicas":"0",
"replicationFactor":"1",
"shards":{"shard1":{
"range":"80000000-7fffffff",
"state":"active",
"replicas":{
"core_node1":{
"core":"c8n_1x3_lf_shard1_replica_n1",
"base_url":"http://127.0.0.1:34302",
"node_name":"127.0.0.1:34302_",
"state":"down",
"type":"NRT"},
"core_node2":{
"state":"down",
"base_url":"http://127.0.0.1:42338",
"core":"c8n_1x3_lf_shard1_replica_n2",
"node_name":"127.0.0.1:42338_",
"type":"NRT"},
"core_node3":{
"core":"c8n_1x3_lf_shard1_replica_n3",
"base_url":"http://127.0.0.1:46248",
"node_name":"127.0.0.1:46248_",
"state":"active",
"type":"NRT",
"leader":"true"}}}},
"router":{"name":"compositeId"},
"maxShardsPerNode":"1",
"autoAddReplicas":"false",
"nrtReplicas":"3",
"tlogReplicas":"0"}
at __randomizedtesting.SeedInfo.seed([E90DB851661CA74:86C4E45FB89DA78C]:0)
at org.junit.Assert.fail(Assert.java:93)
at org.junit.Assert.assertTrue(Assert.java:43)
at org.apache.solr.cloud.LeaderFailoverAfterPartitionTest.testRf3WithLeaderFailover(LeaderFailoverAfterPartitionTest.java:169)
at org.apache.solr.cloud.LeaderFailoverAfterPartitionTest.test(LeaderFailoverAfterPartitionTest.java:56)
at sun.reflect.NativeMethodAccessorImpl.invoke0(Native Method)
at sun.reflect.NativeMethodAccessorImpl.invoke(NativeMethodAccessorImpl.java:62)
at sun.reflect.DelegatingMethodAccessorImpl.invoke(DelegatingMethodAccessorImpl.java:43)
at java.lang.reflect.Method.invoke(Method.java:498)
at com.carrotsearch.randomizedtesting.RandomizedRunner.invoke(RandomizedRunner.java:1713)
at com.carrotsearch.randomizedtesting.RandomizedRunner$8.evaluate(RandomizedRunner.java:907)
at com.carrotsearch.randomizedtesting.RandomizedRunner$9.evaluate(RandomizedRunner.java:943)
at com.carrotsearch.randomizedtesting.RandomizedRunner$10.evaluate(RandomizedRunner.java:957)
at org.apache.solr.BaseDistributedSearchTestCase$ShardsRepeatRule$ShardsFixedStatement.callStatement(BaseDistributedSearchTestCase.java:993)
at org.apache.solr.BaseDistributedSearchTestCase$ShardsRepeatRule$ShardsStatement.evaluate(BaseDistributedSearchTestCase.java:968)
at com.carrotsearch.randomizedtesting.rules.SystemPropertiesRestoreRule$1.evaluate(SystemPropertiesRestoreRule.java:57)
at org.apache.lucene.util.TestRuleSetupTeardownChained$1.evaluate(TestRuleSetupTeardownChained.java:49)
at org.apache.lucene.util.AbstractBeforeAfterRule$1.evaluate(AbstractBeforeAfterRule.java:45)
at org.apache.lucene.util.TestRuleThreadAndTestName$1.evaluate(TestRuleThreadAndTestName.java:48)
at org.apache.lucene.util.TestRuleIgnoreAfterMaxFailures$1.evaluate(TestRuleIgnoreAfterMaxFailures.java:64)
at org.apache.lucene.util.TestRuleMarkFailure$1.evaluate(TestRuleMarkFailure.java:47)
at com.carrotsearch.randomizedtesting.rules.StatementAdapter.evaluate(StatementAdapter.java:36)
at com.carrotsearch.randomizedtesting.ThreadLeakControl$StatementRunner.run(ThreadLeakControl.java:368)
at com.carrotsearch.randomizedtesting.ThreadLeakControl.forkTimeoutingTask(ThreadLeakControl.java:817)
at com.carrotsearch.randomizedtesting.ThreadLeakControl$3.evaluate(ThreadLeakControl.java:468)
at com.carrotsearch.randomizedtesting.RandomizedRunner.runSingleTest(RandomizedRunner.java:916)
at com.carrotsearch.randomizedtesting.RandomizedRunner$5.evaluate(RandomizedRunner.java:802)
at com.carrotsearch.randomizedtesting.RandomizedRunner$6.evaluate(RandomizedRunner.java:852)
at com.carrotsearch.randomizedtesting.RandomizedRunner$7.evaluate(RandomizedRunner.java:863)
at com.carrotsearch.randomizedtesting.rules.StatementAdapter.evaluate(StatementAdapter.java:36)
at com.carrotsearch.randomizedtesting.rules.SystemPropertiesRestoreRule$1.evaluate(SystemPropertiesRestoreRule.java:57)
at org.apache.lucene.util.AbstractBeforeAfterRule$1.evaluate(AbstractBeforeAfterRule.java:45)
at com.carrotsearch.randomizedtesting.rules.StatementAdapter.evaluate(StatementAdapter.java:36)
at org.apache.lucene.util.TestRuleStoreClassName$1.evaluate(TestRuleStoreClassName.java:41)
at com.carrotsearch.randomizedtesting.rules.NoShadowingOrOverridesOnMethodsRule$1.evaluate(NoShadowingOrOverridesOnMethodsRule.java:40)
at com.carrotsearch.randomizedtesting.rules.NoShadowingOrOverridesOnMethodsRule$1.evaluate(NoShadowingOrOverridesOnMethodsRule.java:40)
at com.carrotsearch.randomizedtesting.rules.StatementAdapter.evaluate(StatementAdapter.java:36)
at com.carrotsearch.randomizedtesting.rules.StatementAdapter.evaluate(StatementAdapter.java:36)
at com.carrotsearch.randomizedtesting.rules.StatementAdapter.evaluate(StatementAdapter.java:36)
at org.apache.lucene.util.TestRuleAssertionsRequired$1.evaluate(TestRuleAssertionsRequired.java:53)
at org.apache.lucene.util.TestRuleMarkFailure$1.evaluate(TestRuleMarkFailure.java:47)
at org.apache.lucene.util.TestRuleIgnoreAfterMaxFailures$1.evaluate(TestRuleIgnoreAfterMaxFailures.java:64)
at org.apache.lucene.util.TestRuleIgnoreTestSuites$1.evaluate(TestRuleIgnoreTestSuites.java:54)
at com.carrotsearch.randomizedtesting.rules.StatementAdapter.evaluate(StatementAdapter.java:36)
at com.carrotsearch.randomizedtesting.ThreadLeakControl$StatementRunner.run(ThreadLeakControl.java:368)
at java.lang.Thread.run(Thread.java:748)
Build Log:
[...truncated 11167 lines...]
[junit4] Suite: org.apache.solr.cloud.LeaderFailoverAfterPartitionTest
[junit4] 2> Creating dataDir: /home/jenkins/jenkins-slave/workspace/Lucene-Solr-Tests-7.0/solr/build/solr-core/test/J2/temp/solr.cloud.LeaderFailoverAfterPartitionTest_E90DB851661CA74-001/init-core-data-001
[junit4] 2> 462771 INFO (SUITE-LeaderFailoverAfterPartitionTest-seed#[E90DB851661CA74]-worker) [ ] o.a.s.SolrTestCaseJ4 Using PointFields (NUMERIC_POINTS_SYSPROP=true) w/NUMERIC_DOCVALUES_SYSPROP=true
[junit4] 2> 462772 INFO (SUITE-LeaderFailoverAfterPartitionTest-seed#[E90DB851661CA74]-worker) [ ] o.a.s.SolrTestCaseJ4 Randomized ssl (false) and clientAuth (false) via: @org.apache.solr.SolrTestCaseJ4$SuppressSSL(bugUrl=https://issues.apache.org/jira/browse/SOLR-5776)
[junit4] 2> 462772 INFO (SUITE-LeaderFailoverAfterPartitionTest-seed#[E90DB851661CA74]-worker) [ ] o.a.s.BaseDistributedSearchTestCase Setting hostContext system property: /
[junit4] 2> 462867 INFO (TEST-LeaderFailoverAfterPartitionTest.test-seed#[E90DB851661CA74]) [ ] o.a.s.c.ZkTestServer STARTING ZK TEST SERVER
[junit4] 2> 462875 INFO (Thread-440) [ ] o.a.s.c.ZkTestServer client port:0.0.0.0/0.0.0.0:0
[junit4] 2> 462875 INFO (Thread-440) [ ] o.a.s.c.ZkTestServer Starting server
[junit4] 2> 462891 ERROR (Thread-440) [ ] o.a.z.s.ZooKeeperServer ZKShutdownHandler is not registered, so ZooKeeper server won't take any action on ERROR or SHUTDOWN server state changes
[junit4] 2> 462975 INFO (TEST-LeaderFailoverAfterPartitionTest.test-seed#[E90DB851661CA74]) [ ] o.a.s.c.ZkTestServer start zk server on port:45768
[junit4] 2> 463178 INFO (TEST-LeaderFailoverAfterPartitionTest.test-seed#[E90DB851661CA74]) [ ] o.a.s.c.AbstractZkTestCase put /home/jenkins/jenkins-slave/workspace/Lucene-Solr-Tests-7.0/solr/core/src/test-files/solr/collection1/conf/solrconfig-tlog.xml to /configs/conf1/solrconfig.xml
[junit4] 2> 463207 INFO (TEST-LeaderFailoverAfterPartitionTest.test-seed#[E90DB851661CA74]) [ ] o.a.s.c.AbstractZkTestCase put /home/jenkins/jenkins-slave/workspace/Lucene-Solr-Tests-7.0/solr/core/src/test-files/solr/collection1/conf/schema.xml to /configs/conf1/schema.xml
[junit4] 2> 463208 INFO (TEST-LeaderFailoverAfterPartitionTest.test-seed#[E90DB851661CA74]) [ ] o.a.s.c.AbstractZkTestCase put /home/jenkins/jenkins-slave/workspace/Lucene-Solr-Tests-7.0/solr/core/src/test-files/solr/collection1/conf/solrconfig.snippet.randomindexconfig.xml to /configs/conf1/solrconfig.snippet.randomindexconfig.xml
[junit4] 2> 463209 INFO (TEST-LeaderFailoverAfterPartitionTest.test-seed#[E90DB851661CA74]) [ ] o.a.s.c.AbstractZkTestCase put /home/jenkins/jenkins-slave/workspace/Lucene-Solr-Tests-7.0/solr/core/src/test-files/solr/collection1/conf/stopwords.txt to /configs/conf1/stopwords.txt
[junit4] 2> 463209 INFO (TEST-LeaderFailoverAfterPartitionTest.test-seed#[E90DB851661CA74]) [ ] o.a.s.c.AbstractZkTestCase put /home/jenkins/jenkins-slave/workspace/Lucene-Solr-Tests-7.0/solr/core/src/test-files/solr/collection1/conf/protwords.txt to /configs/conf1/protwords.txt
[junit4] 2> 463210 INFO (TEST-LeaderFailoverAfterPartitionTest.test-seed#[E90DB851661CA74]) [ ] o.a.s.c.AbstractZkTestCase put /home/jenkins/jenkins-slave/workspace/Lucene-Solr-Tests-7.0/solr/core/src/test-files/solr/collection1/conf/currency.xml to /configs/conf1/currency.xml
[junit4] 2> 463211 INFO (TEST-LeaderFailoverAfterPartitionTest.test-seed#[E90DB851661CA74]) [ ] o.a.s.c.AbstractZkTestCase put /home/jenkins/jenkins-slave/workspace/Lucene-Solr-Tests-7.0/solr/core/src/test-files/solr/collection1/conf/enumsConfig.xml to /configs/conf1/enumsConfig.xml
[junit4] 2> 463224 INFO (TEST-LeaderFailoverAfterPartitionTest.test-seed#[E90DB851661CA74]) [ ] o.a.s.c.AbstractZkTestCase put /home/jenkins/jenkins-slave/workspace/Lucene-Solr-Tests-7.0/solr/core/src/test-files/solr/collection1/conf/open-exchange-rates.json to /configs/conf1/open-exchange-rates.json
[junit4] 2> 463224 INFO (TEST-LeaderFailoverAfterPartitionTest.test-seed#[E90DB851661CA74]) [ ] o.a.s.c.AbstractZkTestCase put /home/jenkins/jenkins-slave/workspace/Lucene-Solr-Tests-7.0/solr/core/src/test-files/solr/collection1/conf/mapping-ISOLatin1Accent.txt to /configs/conf1/mapping-ISOLatin1Accent.txt
[junit4] 2> 463225 INFO (TEST-LeaderFailoverAfterPartitionTest.test-seed#[E90DB851661CA74]) [ ] o.a.s.c.AbstractZkTestCase put /home/jenkins/jenkins-slave/workspace/Lucene-Solr-Tests-7.0/solr/core/src/test-files/solr/collection1/conf/old_synonyms.txt to /configs/conf1/old_synonyms.txt
[junit4] 2> 463226 INFO (TEST-LeaderFailoverAfterPartitionTest.test-seed#[E90DB851661CA74]) [ ] o.a.s.c.AbstractZkTestCase put /home/jenkins/jenkins-slave/workspace/Lucene-Solr-Tests-7.0/solr/core/src/test-files/solr/collection1/conf/synonyms.txt to /configs/conf1/synonyms.txt
[junit4] 2> 463227 INFO (TEST-LeaderFailoverAfterPartitionTest.test-seed#[E90DB851661CA74]) [ ] o.a.s.c.AbstractFullDistribZkTestBase Will use NRT replicas unless explicitly asked otherwise
[junit4] 2> 464275 INFO (TEST-LeaderFailoverAfterPartitionTest.test-seed#[E90DB851661CA74]) [ ] o.e.j.s.Server jetty-9.3.14.v20161028
[junit4] 2> 464277 INFO (TEST-LeaderFailoverAfterPartitionTest.test-seed#[E90DB851661CA74]) [ ] o.e.j.s.h.ContextHandler Started o.e.j.s.ServletContextHandler@7f5012fc{/,null,AVAILABLE}
[junit4] 2> 464320 INFO (TEST-LeaderFailoverAfterPartitionTest.test-seed#[E90DB851661CA74]) [ ] o.e.j.s.AbstractConnector Started ServerConnector@16866eb4{HTTP/1.1,[http/1.1]}{127.0.0.1:44828}
[junit4] 2> 464320 INFO (TEST-LeaderFailoverAfterPartitionTest.test-seed#[E90DB851661CA74]) [ ] o.e.j.s.Server Started @476126ms
[junit4] 2> 464321 INFO (TEST-LeaderFailoverAfterPartitionTest.test-seed#[E90DB851661CA74]) [ ] o.a.s.c.s.e.JettySolrRunner Jetty properties: {solr.data.dir=/home/jenkins/jenkins-slave/workspace/Lucene-Solr-Tests-7.0/solr/build/solr-core/test/J2/temp/solr.cloud.LeaderFailoverAfterPartitionTest_E90DB851661CA74-001/tempDir-001/control/data, hostContext=/, hostPort=37291, coreRootDirectory=/home/jenkins/jenkins-slave/workspace/Lucene-Solr-Tests-7.0/solr/build/solr-core/test/J2/temp/solr.cloud.LeaderFailoverAfterPartitionTest_E90DB851661CA74-001/control-001/cores}
[junit4] 2> 464321 ERROR (TEST-LeaderFailoverAfterPartitionTest.test-seed#[E90DB851661CA74]) [ ] o.a.s.s.StartupLoggingUtils Missing Java Option solr.log.dir. Logging may be missing or incomplete.
[junit4] 2> 464321 INFO (TEST-LeaderFailoverAfterPartitionTest.test-seed#[E90DB851661CA74]) [ ] o.a.s.s.SolrDispatchFilter ___ _ Welcome to Apache Solr? version 7.0.0
[junit4] 2> 464321 INFO (TEST-LeaderFailoverAfterPartitionTest.test-seed#[E90DB851661CA74]) [ ] o.a.s.s.SolrDispatchFilter / __| ___| |_ _ Starting in cloud mode on port null
[junit4] 2> 464321 INFO (TEST-LeaderFailoverAfterPartitionTest.test-seed#[E90DB851661CA74]) [ ] o.a.s.s.SolrDispatchFilter \__ \/ _ \ | '_| Install dir: null, Default config dir: null
[junit4] 2> 464321 INFO (TEST-LeaderFailoverAfterPartitionTest.test-seed#[E90DB851661CA74]) [ ] o.a.s.s.SolrDispatchFilter |___/\___/_|_| Start time: 2017-09-10T06:10:17.173Z
[junit4] 2> 464499 INFO (TEST-LeaderFailoverAfterPartitionTest.test-seed#[E90DB851661CA74]) [ ] o.a.s.s.SolrDispatchFilter Loading solr.xml from SolrHome (not found in ZooKeeper)
[junit4] 2> 464499 INFO (TEST-LeaderFailoverAfterPartitionTest.test-seed#[E90DB851661CA74]) [ ] o.a.s.c.SolrXmlConfig Loading container configuration from /home/jenkins/jenkins-slave/workspace/Lucene-Solr-Tests-7.0/solr/build/solr-core/test/J2/temp/solr.cloud.LeaderFailoverAfterPartitionTest_E90DB851661CA74-001/control-001/solr.xml
[junit4] 2> 464548 INFO (TEST-LeaderFailoverAfterPartitionTest.test-seed#[E90DB851661CA74]) [ ] o.a.s.c.SolrXmlConfig MBean server found: com.sun.jmx.mbeanserver.JmxMBeanServer@286776a1, but no JMX reporters were configured - adding default JMX reporter.
[junit4] 2> 464580 INFO (TEST-LeaderFailoverAfterPartitionTest.test-seed#[E90DB851661CA74]) [ ] o.a.s.c.ZkContainer Zookeeper client=127.0.0.1:45768/solr
[junit4] 2> 464932 INFO (TEST-LeaderFailoverAfterPartitionTest.test-seed#[E90DB851661CA74]) [n:127.0.0.1:37291_ ] o.a.s.c.Overseer Overseer (id=null) closing
[junit4] 2> 464932 INFO (TEST-LeaderFailoverAfterPartitionTest.test-seed#[E90DB851661CA74]) [n:127.0.0.1:37291_ ] o.a.s.c.OverseerElectionContext I am going to be the leader 127.0.0.1:37291_
[junit4] 2> 464953 INFO (TEST-LeaderFailoverAfterPartitionTest.test-seed#[E90DB851661CA74]) [n:127.0.0.1:37291_ ] o.a.s.c.Overseer Overseer (id=98633240787550212-127.0.0.1:37291_-n_0000000000) starting
[junit4] 2> 465014 INFO (TEST-LeaderFailoverAfterPartitionTest.test-seed#[E90DB851661CA74]) [n:127.0.0.1:37291_ ] o.a.s.c.ZkController Register node as live in ZooKeeper:/live_nodes/127.0.0.1:37291_
[junit4] 2> 465016 INFO (zkCallback-166-thread-1-processing-n:127.0.0.1:37291_) [n:127.0.0.1:37291_ ] o.a.s.c.c.ZkStateReader Updated live nodes from ZooKeeper... (0) -> (1)
[junit4] 2> 465503 INFO (TEST-LeaderFailoverAfterPartitionTest.test-seed#[E90DB851661CA74]) [n:127.0.0.1:37291_ ] o.a.s.m.r.SolrJmxReporter JMX monitoring for 'solr.node' (registry 'solr.node') enabled at server: com.sun.jmx.mbeanserver.JmxMBeanServer@286776a1
[junit4] 2> 465587 INFO (TEST-LeaderFailoverAfterPartitionTest.test-seed#[E90DB851661CA74]) [n:127.0.0.1:37291_ ] o.a.s.m.r.SolrJmxReporter JMX monitoring for 'solr.jvm' (registry 'solr.jvm') enabled at server: com.sun.jmx.mbeanserver.JmxMBeanServer@286776a1
[junit4] 2> 465587 INFO (TEST-LeaderFailoverAfterPartitionTest.test-seed#[E90DB851661CA74]) [n:127.0.0.1:37291_ ] o.a.s.m.r.SolrJmxReporter JMX monitoring for 'solr.jetty' (registry 'solr.jetty') enabled at server: com.sun.jmx.mbeanserver.JmxMBeanServer@286776a1
[junit4] 2> 465589 INFO (TEST-LeaderFailoverAfterPartitionTest.test-seed#[E90DB851661CA74]) [n:127.0.0.1:37291_ ] o.a.s.c.CorePropertiesLocator Found 0 core definitions underneath /home/jenkins/jenkins-slave/workspace/Lucene-Solr-Tests-7.0/solr/build/solr-core/test/J2/temp/solr.cloud.LeaderFailoverAfterPartitionTest_E90DB851661CA74-001/control-001/cores
[junit4] 2> 465729 INFO (TEST-LeaderFailoverAfterPartitionTest.test-seed#[E90DB851661CA74]) [ ] o.a.s.c.c.ZkStateReader Updated live nodes from ZooKeeper... (0) -> (1)
[junit4] 2> 465729 INFO (TEST-LeaderFailoverAfterPartitionTest.test-seed#[E90DB851661CA74]) [ ] o.a.s.c.s.i.ZkClientClusterStateProvider Cluster at 127.0.0.1:45768/solr ready
[junit4] 2> 465730 INFO (SocketProxy-Acceptor-37291) [ ] o.a.s.c.SocketProxy accepted Socket[addr=/127.0.0.1,port=55702,localport=37291], receiveBufferSize:531000
[junit4] 2> 465863 INFO (SocketProxy-Acceptor-37291) [ ] o.a.s.c.SocketProxy proxy connection Socket[addr=/127.0.0.1,port=44828,localport=49152], receiveBufferSize=530904
[junit4] 2> 465864 INFO (qtp1530434230-1302) [n:127.0.0.1:37291_ ] o.a.s.h.a.CollectionsHandler Invoked Collection Action :create with params replicationFactor=1&collection.configName=conf1&name=control_collection&nrtReplicas=1&action=CREATE&numShards=1&createNodeSet=127.0.0.1:37291_&wt=javabin&version=2 and sendToOCPQueue=true
[junit4] 2> 465878 INFO (OverseerThreadFactory-433-thread-1-processing-n:127.0.0.1:37291_) [n:127.0.0.1:37291_ ] o.a.s.c.CreateCollectionCmd Create collection control_collection
[junit4] 2> 466013 INFO (SocketProxy-Acceptor-37291) [ ] o.a.s.c.SocketProxy accepted Socket[addr=/127.0.0.1,port=55712,localport=37291], receiveBufferSize:531000
[junit4] 2> 466045 INFO (SocketProxy-Acceptor-37291) [ ] o.a.s.c.SocketProxy proxy connection Socket[addr=/127.0.0.1,port=44828,localport=49162], receiveBufferSize=530904
[junit4] 2> 466140 INFO (qtp1530434230-1300) [n:127.0.0.1:37291_ ] o.a.s.h.a.CoreAdminOperation core create command qt=/admin/cores&collection.configName=conf1&newCollection=true&name=control_collection_shard1_replica_n1&action=CREATE&numShards=1&collection=control_collection&shard=shard1&wt=javabin&version=2&replicaType=NRT
[junit4] 2> 466141 INFO (qtp1530434230-1300) [n:127.0.0.1:37291_ ] o.a.s.c.TransientSolrCoreCacheDefault Allocating transient cache for 4 transient cores
[junit4] 2> 466282 INFO (zkCallback-166-thread-1-processing-n:127.0.0.1:37291_) [n:127.0.0.1:37291_ ] o.a.s.c.c.ZkStateReader A cluster state change: [WatchedEvent state:SyncConnected type:NodeDataChanged path:/collections/control_collection/state.json] for collection [control_collection] has occurred - updating... (live nodes size: [1])
[junit4] 2> 467335 INFO (qtp1530434230-1300) [n:127.0.0.1:37291_ c:control_collection s:shard1 x:control_collection_shard1_replica_n1] o.a.s.c.SolrConfig Using Lucene MatchVersion: 7.0.0
[junit4] 2> 467485 INFO (qtp1530434230-1300) [n:127.0.0.1:37291_ c:control_collection s:shard1 x:control_collection_shard1_replica_n1] o.a.s.s.IndexSchema [control_collection_shard1_replica_n1] Schema name=test
[junit4] 2> 468312 INFO (qtp1530434230-1300) [n:127.0.0.1:37291_ c:control_collection s:shard1 x:control_collection_shard1_replica_n1] o.a.s.s.IndexSchema Loaded schema test/1.0 with uniqueid field id
[junit4] 2> 468722 INFO (qtp1530434230-1300) [n:127.0.0.1:37291_ c:control_collection s:shard1 x:control_collection_shard1_replica_n1] o.a.s.c.CoreContainer Creating SolrCore 'control_collection_shard1_replica_n1' using configuration from collection control_collection, trusted=true
[junit4] 2> 468723 INFO (qtp1530434230-1300) [n:127.0.0.1:37291_ c:control_collection s:shard1 x:control_collection_shard1_replica_n1] o.a.s.m.r.SolrJmxReporter JMX monitoring for 'solr.core.control_collection.shard1.replica_n1' (registry 'solr.core.control_collection.shard1.replica_n1') enabled at server: com.sun.jmx.mbeanserver.JmxMBeanServer@286776a1
[junit4] 2> 468723 INFO (qtp1530434230-1300) [n:127.0.0.1:37291_ c:control_collection s:shard1 x:control_collection_shard1_replica_n1] o.a.s.c.SolrCore solr.RecoveryStrategy.Builder
[junit4] 2> 468723 INFO (qtp1530434230-1300) [n:127.0.0.1:37291_ c:control_collection s:shard1 x:control_collection_shard1_replica_n1] o.a.s.c.SolrCore [[control_collection_shard1_replica_n1] ] Opening new SolrCore at [/home/jenkins/jenkins-slave/workspace/Lucene-Solr-Tests-7.0/solr/build/solr-core/test/J2/temp/solr.cloud.LeaderFailoverAfterPartitionTest_E90DB851661CA74-001/control-001/cores/control_collection_shard1_replica_n1], dataDir=[/home/jenkins/jenkins-slave/workspace/Lucene-Solr-Tests-7.0/solr/build/solr-core/test/J2/temp/solr.cloud.LeaderFailoverAfterPartitionTest_E90DB851661CA74-001/control-001/cores/control_collection_shard1_replica_n1/data/]
[junit4] 2> 468818 INFO (qtp1530434230-1300) [n:127.0.0.1:37291_ c:control_collection s:shard1 x:control_collection_shard1_replica_n1] o.a.s.u.RandomMergePolicy RandomMergePolicy wrapping class org.apache.lucene.index.LogDocMergePolicy: [LogDocMergePolicy: minMergeSize=1000, mergeFactor=48, maxMergeSize=9223372036854775807, maxMergeSizeForForcedMerge=9223372036854775807, calibrateSizeByDeletes=true, maxMergeDocs=2147483647, maxCFSSegmentSizeMB=8.796093022207999E12, noCFSRatio=0.11959486981959443]
[junit4] 2> 468886 WARN (qtp1530434230-1300) [n:127.0.0.1:37291_ c:control_collection s:shard1 x:control_collection_shard1_replica_n1] o.a.s.c.RequestHandlers INVALID paramSet a in requestHandler {type = requestHandler,name = /dump,class = DumpRequestHandler,attributes = {initParams=a, name=/dump, class=DumpRequestHandler},args = {defaults={a=A,b=B}}}
[junit4] 2> 469159 INFO (qtp1530434230-1300) [n:127.0.0.1:37291_ c:control_collection s:shard1 x:control_collection_shard1_replica_n1] o.a.s.u.UpdateHandler Using UpdateLog implementation: org.apache.solr.update.UpdateLog
[junit4] 2> 469159 INFO (qtp1530434230-1300) [n:127.0.0.1:37291_ c:control_collection s:shard1 x:control_collection_shard1_replica_n1] o.a.s.u.UpdateLog Initializing UpdateLog: dataDir= defaultSyncLevel=FLUSH numRecordsToKeep=100 maxNumLogsToKeep=10 numVersionBuckets=65536
[junit4] 2> 469160 INFO (qtp1530434230-1300) [n:127.0.0.1:37291_ c:control_collection s:shard1 x:control_collection_shard1_replica_n1] o.a.s.u.CommitTracker Hard AutoCommit: disabled
[junit4] 2> 469160 INFO (qtp1530434230-1300) [n:127.0.0.1:37291_ c:control_collection s:shard1 x:control_collection_shard1_replica_n1] o.a.s.u.CommitTracker Soft AutoCommit: disabled
[junit4] 2> 469161 INFO (qtp1530434230-1300) [n:127.0.0.1:37291_ c:control_collection s:shard1 x:control_collection_shard1_replica_n1] o.a.s.u.RandomMergePolicy RandomMergePolicy wrapping class org.apache.lucene.index.TieredMergePolicy: [TieredMergePolicy: maxMergeAtOnce=34, maxMergeAtOnceExplicit=32, maxMergedSegmentMB=88.3232421875, floorSegmentMB=0.8603515625, forceMergeDeletesPctAllowed=3.2927754839359533, segmentsPerTier=20.0, maxCFSSegmentSizeMB=8.796093022207999E12, noCFSRatio=0.11789839612533255
[junit4] 2> 469175 INFO (qtp1530434230-1300) [n:127.0.0.1:37291_ c:control_collection s:shard1 x:control_collection_shard1_replica_n1] o.a.s.s.SolrIndexSearcher Opening [Searcher@6ebfcfa7[control_collection_shard1_replica_n1] main]
[junit4] 2> 469223 INFO (qtp1530434230-1300) [n:127.0.0.1:37291_ c:control_collection s:shard1 x:control_collection_shard1_replica_n1] o.a.s.r.ManagedResourceStorage Configured ZooKeeperStorageIO with znodeBase: /configs/conf1
[junit4] 2> 469240 INFO (qtp1530434230-1300) [n:127.0.0.1:37291_ c:control_collection s:shard1 x:control_collection_shard1_replica_n1] o.a.s.r.ManagedResourceStorage Loaded null at path _rest_managed.json using ZooKeeperStorageIO:path=/configs/conf1
[junit4] 2> 469240 INFO (qtp1530434230-1300) [n:127.0.0.1:37291_ c:control_collection s:shard1 x:control_collection_shard1_replica_n1] o.a.s.h.ReplicationHandler Commits will be reserved for 10000
[junit4] 2> 469241 INFO (qtp1530434230-1300) [n:127.0.0.1:37291_ c:control_collection s:shard1 x:control_collection_shard1_replica_n1] o.a.s.u.UpdateLog Could not find max version in index or recent updates, using new clock 1578131859274989568
[junit4] 2> 469371 INFO (searcherExecutor-436-thread-1-processing-n:127.0.0.1:37291_ x:control_collection_shard1_replica_n1 s:shard1 c:control_collection) [n:127.0.0.1:37291_ c:control_collection s:shard1 x:control_collection_shard1_replica_n1] o.a.s.c.SolrCore [control_collection_shard1_replica_n1] Registered new searcher Searcher@6ebfcfa7[control_collection_shard1_replica_n1] main{ExitableDirectoryReader(UninvertingDirectoryReader())}
[junit4] 2> 469376 INFO (qtp1530434230-1300) [n:127.0.0.1:37291_ c:control_collection s:shard1 x:control_collection_shard1_replica_n1] o.a.s.c.ShardLeaderElectionContext Enough replicas found to continue.
[junit4] 2> 469376 INFO (qtp1530434230-1300) [n:127.0.0.1:37291_ c:control_collection s:shard1 x:control_collection_shard1_replica_n1] o.a.s.c.ShardLeaderElectionContext I may be the new leader - try and sync
[junit4] 2> 469376 INFO (qtp1530434230-1300) [n:127.0.0.1:37291_ c:control_collection s:shard1 x:control_collection_shard1_replica_n1] o.a.s.c.SyncStrategy Sync replicas to http://127.0.0.1:37291/control_collection_shard1_replica_n1/
[junit4] 2> 469376 INFO (qtp1530434230-1300) [n:127.0.0.1:37291_ c:control_collection s:shard1 x:control_collection_shard1_replica_n1] o.a.s.c.SyncStrategy Sync Success - now sync replicas to me
[junit4] 2> 469376 INFO (qtp1530434230-1300) [n:127.0.0.1:37291_ c:control_collection s:shard1 x:control_collection_shard1_replica_n1] o.a.s.c.SyncStrategy http://127.0.0.1:37291/control_collection_shard1_replica_n1/ has no replicas
[junit4] 2> 469376 INFO (qtp1530434230-1300) [n:127.0.0.1:37291_ c:control_collection s:shard1 x:control_collection_shard1_replica_n1] o.a.s.c.ShardLeaderElectionContext Found all replicas participating in election, clear LIR
[junit4] 2> 469409 INFO (zkCallback-166-thread-1-processing-n:127.0.0.1:37291_) [n:127.0.0.1:37291_ ] o.a.s.c.c.ZkStateReader A cluster state change: [WatchedEvent state:SyncConnected type:NodeDataChanged path:/collections/control_collection/state.json] for collection [control_collection] has occurred - updating... (live nodes size: [1])
[junit4] 2> 469425 INFO (qtp1530434230-1300) [n:127.0.0.1:37291_ c:control_collection s:shard1 x:control_collection_shard1_replica_n1] o.a.s.c.ShardLeaderElectionContext I am the new leader: http://127.0.0.1:37291/control_collection_shard1_replica_n1/ shard1
[junit4] 2> 469605 INFO (zkCallback-166-thread-1-processing-n:127.0.0.1:37291_) [n:127.0.0.1:37291_ ] o.a.s.c.c.ZkStateReader A cluster state change: [WatchedEvent state:SyncConnected type:NodeDataChanged path:/collections/control_collection/state.json] for collection [control_collection] has occurred - updating... (live nodes size: [1])
[junit4] 2> 469670 INFO (qtp1530434230-1300) [n:127.0.0.1:37291_ c:control_collection s:shard1 x:control_collection_shard1_replica_n1] o.a.s.c.ZkController I am the leader, no recovery necessary
[junit4] 2> 469671 INFO (qtp1530434230-1300) [n:127.0.0.1:37291_ c:control_collection s:shard1 x:control_collection_shard1_replica_n1] o.a.s.s.HttpSolrCall [admin] webapp=null path=/admin/cores params={qt=/admin/cores&collection.configName=conf1&newCollection=true&name=control_collection_shard1_replica_n1&action=CREATE&numShards=1&collection=control_collection&shard=shard1&wt=javabin&version=2&replicaType=NRT} status=0 QTime=3530
[junit4] 2> 469845 INFO (zkCallback-166-thread-1-processing-n:127.0.0.1:37291_) [n:127.0.0.1:37291_ ] o.a.s.c.c.ZkStateReader A cluster state change: [WatchedEvent state:SyncConnected type:NodeDataChanged path:/collections/control_collection/state.json] for collection [control_collection] has occurred - updating... (live nodes size: [1])
[junit4] 2> 469926 INFO (qtp1530434230-1302) [n:127.0.0.1:37291_ ] o.a.s.h.a.CollectionsHandler Wait for new collection to be active for at most 30 seconds. Check all shard replicas
[junit4] 2> 469926 INFO (qtp1530434230-1302) [n:127.0.0.1:37291_ ] o.a.s.s.HttpSolrCall [admin] webapp=null path=/admin/collections params={replicationFactor=1&collection.configName=conf1&name=control_collection&nrtReplicas=1&action=CREATE&numShards=1&createNodeSet=127.0.0.1:37291_&wt=javabin&version=2} status=0 QTime=4062
[junit4] 2> 469927 INFO (OverseerCollectionConfigSetProcessor-98633240787550212-127.0.0.1:37291_-n_0000000000) [n:127.0.0.1:37291_ ] o.a.s.c.OverseerTaskQueue Response ZK path: /overseer/collection-queue-work/qnr-0000000000 doesn't exist. Requestor may have disconnected from ZooKeeper
[junit4] 2> 470312 INFO (TEST-LeaderFailoverAfterPartitionTest.test-seed#[E90DB851661CA74]) [ ] o.a.s.c.c.ZkStateReader Updated live nodes from ZooKeeper... (0) -> (1)
[junit4] 2> 470312 INFO (TEST-LeaderFailoverAfterPartitionTest.test-seed#[E90DB851661CA74]) [ ] o.a.s.c.s.i.ZkClientClusterStateProvider Cluster at 127.0.0.1:45768/solr ready
[junit4] 2> 470312 INFO (TEST-LeaderFailoverAfterPartitionTest.test-seed#[E90DB851661CA74]) [ ] o.a.s.c.ChaosMonkey monkey: init - expire sessions:false cause connection loss:false
[junit4] 2> 470313 INFO (SocketProxy-Acceptor-37291) [ ] o.a.s.c.SocketProxy accepted Socket[addr=/127.0.0.1,port=55720,localport=37291], receiveBufferSize:531000
[junit4] 2> 470313 INFO (SocketProxy-Acceptor-37291) [ ] o.a.s.c.SocketProxy proxy connection Socket[addr=/127.0.0.1,port=44828,localport=49170], receiveBufferSize=530904
[junit4] 2> 470356 INFO (qtp1530434230-1303) [n:127.0.0.1:37291_ ] o.a.s.h.a.CollectionsHandler Invoked Collection Action :create with params replicationFactor=1&collection.configName=conf1&name=collection1&nrtReplicas=1&action=CREATE&numShards=2&createNodeSet=&stateFormat=1&wt=javabin&version=2 and sendToOCPQueue=true
[junit4] 2> 470474 INFO (OverseerThreadFactory-433-thread-2-processing-n:127.0.0.1:37291_) [n:127.0.0.1:37291_ ] o.a.s.c.CreateCollectionCmd Create collection collection1
[junit4] 2> 470475 WARN (OverseerThreadFactory-433-thread-2-processing-n:127.0.0.1:37291_) [n:127.0.0.1:37291_ ] o.a.s.c.CreateCollectionCmd It is unusual to create a collection (collection1) without cores.
[junit4] 2> 470836 INFO (qtp1530434230-1303) [n:127.0.0.1:37291_ ] o.a.s.h.a.CollectionsHandler Wait for new collection to be active for at most 30 seconds. Check all shard replicas
[junit4] 2> 470836 INFO (qtp1530434230-1303) [n:127.0.0.1:37291_ ] o.a.s.s.HttpSolrCall [admin] webapp=null path=/admin/collections params={replicationFactor=1&collection.configName=conf1&name=collection1&nrtReplicas=1&action=CREATE&numShards=2&createNodeSet=&stateFormat=1&wt=javabin&version=2} status=0 QTime=480
[junit4] 2> 471434 INFO (TEST-LeaderFailoverAfterPartitionTest.test-seed#[E90DB851661CA74]) [ ] o.a.s.c.AbstractFullDistribZkTestBase create jetty 1 in directory /home/jenkins/jenkins-slave/workspace/Lucene-Solr-Tests-7.0/solr/build/solr-core/test/J2/temp/solr.cloud.LeaderFailoverAfterPartitionTest_E90DB851661CA74-001/shard-1-001 of type NRT
[junit4] 2> 471435 INFO (TEST-LeaderFailoverAfterPartitionTest.test-seed#[E90DB851661CA74]) [ ] o.e.j.s.Server jetty-9.3.14.v20161028
[junit4] 2> 471665 INFO (TEST-LeaderFailoverAfterPartitionTest.test-seed#[E90DB851661CA74]) [ ] o.e.j.s.h.ContextHandler Started o.e.j.s.ServletContextHandler@5670fdf7{/,null,AVAILABLE}
[junit4] 2> 471665 INFO (TEST-LeaderFailoverAfterPartitionTest.test-seed#[E90DB851661CA74]) [ ] o.e.j.s.AbstractConnector Started ServerConnector@6c204588{HTTP/1.1,[http/1.1]}{127.0.0.1:33266}
[junit4] 2> 471665 INFO (TEST-LeaderFailoverAfterPartitionTest.test-seed#[E90DB851661CA74]) [ ] o.e.j.s.Server Started @483470ms
[junit4] 2> 471665 INFO (TEST-LeaderFailoverAfterPartitionTest.test-seed#[E90DB851661CA74]) [ ] o.a.s.c.s.e.JettySolrRunner Jetty properties: {solr.data.dir=/home/jenkins/jenkins-slave/workspace/Lucene-Solr-Tests-7.0/solr/build/solr-core/test/J2/temp/solr.cloud.LeaderFailoverAfterPartitionTest_E90DB851661CA74-001/tempDir-001/jetty1, solrconfig=solrconfig.xml, hostContext=/, hostPort=42338, coreRootDirectory=/home/jenkins/jenkins-slave/workspace/Lucene-Solr-Tests-7.0/solr/build/solr-core/test/J2/temp/solr.cloud.LeaderFailoverAfterPartitionTest_E90DB851661CA74-001/shard-1-001/cores}
[junit4] 2> 471665 ERROR (TEST-LeaderFailoverAfterPartitionTest.test-seed#[E90DB851661CA74]) [ ] o.a.s.s.StartupLoggingUtils Missing Java Option solr.log.dir. Logging may be missing or incomplete.
[junit4] 2> 471665 INFO (TEST-LeaderFailoverAfterPartitionTest.test-seed#[E90DB851661CA74]) [ ] o.a.s.s.SolrDispatchFilter ___ _ Welcome to Apache Solr? version 7.0.0
[junit4] 2> 471665 INFO (TEST-LeaderFailoverAfterPartitionTest.test-seed#[E90DB851661CA74]) [ ] o.a.s.s.SolrDispatchFilter / __| ___| |_ _ Starting in cloud mode on port null
[junit4] 2> 471665 INFO (TEST-LeaderFailoverAfterPartitionTest.test-seed#[E90DB851661CA74]) [ ] o.a.s.s.SolrDispatchFilter \__ \/ _ \ | '_| Install dir: null, Default config dir: null
[junit4] 2> 471666 INFO (TEST-LeaderFailoverAfterPartitionTest.test-seed#[E90DB851661CA74]) [ ] o.a.s.s.SolrDispatchFilter |___/\___/_|_| Start time: 2017-09-10T06:10:24.517Z
[junit4] 2> 471731 INFO (TEST-LeaderFailoverAfterPartitionTest.test-seed#[E90DB851661CA74]) [ ] o.a.s.s.SolrDispatchFilter Loading solr.xml from SolrHome (not found in ZooKeeper)
[junit4] 2> 471731 INFO (TEST-LeaderFailoverAfterPartitionTest.test-seed#[E90DB851661CA74]) [ ] o.a.s.c.SolrXmlConfig Loading container configuration from /home/jenkins/jenkins-slave/workspace/Lucene-Solr-Tests-7.0/solr/build/solr-core/test/J2/temp/solr.cloud.LeaderFailoverAfterPartitionTest_E90DB851661CA74-001/shard-1-001/solr.xml
[junit4] 2> 471781 INFO (TEST-LeaderFailoverAfterPartitionTest.test-seed#[E90DB851661CA74]) [ ] o.a.s.c.SolrXmlConfig MBean server found: com.sun.jmx.mbeanserver.JmxMBeanServer@286776a1, but no JMX reporters were configured - adding default JMX reporter.
[junit4] 2> 471806 INFO (TEST-LeaderFailoverAfterPartitionTest.test-seed#[E90DB851661CA74]) [ ] o.a.s.c.ZkContainer Zookeeper client=127.0.0.1:45768/solr
[junit4] 2> 471994 INFO (TEST-LeaderFailoverAfterPartitionTest.test-seed#[E90DB851661CA74]) [n:127.0.0.1:42338_ ] o.a.s.c.c.ZkStateReader Updated live nodes from ZooKeeper... (0) -> (1)
[junit4] 2> 471995 INFO (TEST-LeaderFailoverAfterPartitionTest.test-seed#[E90DB851661CA74]) [n:127.0.0.1:42338_ ] o.a.s.c.Overseer Overseer (id=null) closing
[junit4] 2> 472027 INFO (TEST-LeaderFailoverAfterPartitionTest.test-seed#[E90DB851661CA74]) [n:127.0.0.1:42338_ ] o.a.s.c.ZkController Register node as live in ZooKeeper:/live_nodes/127.0.0.1:42338_
[junit4] 2> 472056 INFO (zkCallback-173-thread-1) [ ] o.a.s.c.c.ZkStateReader Updated live nodes from ZooKeeper... (1) -> (2)
[junit4] 2> 472158 INFO (zkCallback-178-thread-1-processing-n:127.0.0.1:42338_) [n:127.0.0.1:42338_ ] o.a.s.c.c.ZkStateReader Updated live nodes from ZooKeeper... (1) -> (2)
[junit4] 2> 472197 INFO (zkCallback-166-thread-2-processing-n:127.0.0.1:37291_) [n:127.0.0.1:37291_ ] o.a.s.c.c.ZkStateReader Updated live nodes from ZooKeeper... (1) -> (2)
[junit4] 2> 472454 INFO (OverseerCollectionConfigSetProcessor-98633240787550212-127.0.0.1:37291_-n_0000000000) [n:127.0.0.1:37291_ ] o.a.s.c.OverseerTaskQueue Response ZK path: /overseer/collection-queue-work/qnr-0000000002 doesn't exist. Requestor may have disconnected from ZooKeeper
[junit4] 2> 472613 INFO (TEST-LeaderFailoverAfterPartitionTest.test-seed#[E90DB851661CA74]) [n:127.0.0.1:42338_ ] o.a.s.m.r.SolrJmxReporter JMX monitoring for 'solr.node' (registry 'solr.node') enabled at server: com.sun.jmx.mbeanserver.JmxMBeanServer@286776a1
[junit4] 2> 472726 INFO (TEST-LeaderFailoverAfterPartitionTest.test-seed#[E90DB851661CA74]) [n:127.0.0.1:42338_ ] o.a.s.m.r.SolrJmxReporter JMX monitoring for 'solr.jvm' (registry 'solr.jvm') enabled at server: com.sun.jmx.mbeanserver.JmxMBeanServer@286776a1
[junit4] 2> 472726 INFO (TEST-LeaderFailoverAfterPartitionTest.test-seed#[E90DB851661CA74]) [n:127.0.0.1:42338_ ] o.a.s.m.r.SolrJmxReporter JMX monitoring for 'solr.jetty' (registry 'solr.jetty') enabled at server: com.sun.jmx.mbeanserver.JmxMBeanServer@286776a1
[junit4] 2> 472727 INFO (TEST-LeaderFailoverAfterPartitionTest.test-seed#[E90DB851661CA74]) [n:127.0.0.1:42338_ ] o.a.s.c.CorePropertiesLocator Found 0 core definitions underneath /home/jenkins/jenkins-slave/workspace/Lucene-Solr-Tests-7.0/solr/build/solr-core/test/J2/temp/solr.cloud.LeaderFailoverAfterPartitionTest_E90DB851661CA74-001/shard-1-001/cores
[junit4] 2> 473068 INFO (SocketProxy-Acceptor-42338) [ ] o.a.s.c.SocketProxy accepted Socket[addr=/127.0.0.1,port=45230,localport=42338], receiveBufferSize:531000
[junit4] 2> 473119 INFO (SocketProxy-Acceptor-42338) [ ] o.a.s.c.SocketProxy proxy connection Socket[addr=/127.0.0.1,port=33266,localport=48382], receiveBufferSize=530904
[junit4] 2> 473181 INFO (qtp370504570-1350) [n:127.0.0.1:42338_ ] o.a.s.h.a.CollectionsHandler Invoked Collection Action :addreplica with params node=127.0.0.1:42338_&action=ADDREPLICA&collection=collection1&shard=shard2&type=NRT&wt=javabin&version=2 and sendToOCPQueue=true
[junit4] 2> 473184 INFO (OverseerThreadFactory-433-thread-3-processing-n:127.0.0.1:37291_) [n:127.0.0.1:37291_ ] o.a.s.c.AddReplicaCmd Node Identified 127.0.0.1:42338_ for creating new replica
[junit4] 2> 473229 INFO (SocketProxy-Acceptor-42338) [ ] o.a.s.c.SocketProxy accepted Socket[addr=/127.0.0.1,port=45234,localport=42338], receiveBufferSize:531000
[junit4] 2> 473229 INFO (SocketProxy-Acceptor-42338) [ ] o.a.s.c.SocketProxy proxy connection Socket[addr=/127.0.0.1,port=33266,localport=48386], receiveBufferSize=530904
[junit4] 2> 473262 INFO (qtp370504570-1349) [n:127.0.0.1:42338_ ] o.a.s.h.a.CoreAdminOperation core create command qt=/admin/cores&collection.configName=conf1&name=collection1_shard2_replica_n0&action=CREATE&collection=collection1&shard=shard2&wt=javabin&version=2&replicaType=NRT
[junit4] 2> 473262 INFO (qtp370504570-1349) [n:127.0.0.1:42338_ ] o.a.s.c.TransientSolrCoreCacheDefault Allocating transient cache for 4 transient cores
[junit4] 2> 474363 INFO (qtp370504570-1349) [n:127.0.0.1:42338_ c:collection1 s:shard2 x:collection1_shard2_replica_n0] o.a.s.c.SolrConfig Using Lucene MatchVersion: 7.0.0
[junit4] 2> 474444 INFO (qtp370504570-1349) [n:127.0.0.1:42338_ c:collection1 s:shard2 x:collection1_shard2_replica_n0] o.a.s.s.IndexSchema [collection1_shard2_replica_n0] Schema name=test
[junit4] 2> 475099 INFO (qtp370504570-1349) [n:127.0.0.1:42338_ c:collection1 s:shard2 x:collection1_shard2_replica_n0] o.a.s.s.IndexSchema Loaded schema test/1.0 with uniqueid field id
[junit4] 2> 475219 INFO (qtp370504570-1349) [n:127.0.0.1:42338_ c:collection1 s:shard2 x:collection1_shard2_replica_n0] o.a.s.c.CoreContainer Creating SolrCore 'collection1_shard2_replica_n0' using configuration from collection collection1, trusted=true
[junit4] 2> 475220 INFO (qtp370504570-1349) [n:127.0.0.1:42338_ c:collection1 s:shard2 x:collection1_shard2_replica_n0] o.a.s.m.r.SolrJmxReporter JMX monitoring for 'solr.core.collection1.shard2.replica_n0' (registry 'solr.core.collection1.shard2.replica_n0') enabled at server: com.sun.jmx.mbeanserver.JmxMBeanServer@286776a1
[junit4] 2> 475220 INFO (qtp370504570-1349) [n:127.0.0.1:42338_ c:collection1 s:shard2 x:collection1_shard2_replica_n0] o.a.s.c.SolrCore solr.RecoveryStrategy.Builder
[junit4] 2> 475220 INFO (qtp370504570-1349) [n:127.0.0.1:42338_ c:collection1 s:shard2 x:collection1_shard2_replica_n0] o.a.s.c.SolrCore [[collection1_shard2_replica_n0] ] Opening new SolrCore at [/home/jenkins/jenkins-slave/workspace/Lucene-Solr-Tests-7.0/solr/build/solr-core/test/J2/temp/solr.cloud.LeaderFailoverAfterPartitionTest_E90DB851661CA74-001/shard-1-001/cores/collection1_shard2_replica_n0], dataDir=[/home/jenkins/jenkins-slave/workspace/Lucene-Solr-Tests-7.0/solr/build/solr-core/test/J2/temp/solr.cloud.LeaderFailoverAfterPartitionTest_E90DB851661CA74-001/shard-1-001/cores/collection1_shard2_replica_n0/data/]
[junit4] 2> 475291 INFO (qtp370504570-1349) [n:127.0.0.1:42338_ c:collection1 s:shard2 x:collection1_shard2_replica_n0] o.a.s.u.RandomMergePolicy RandomMergePolicy wrapping class org.apache.lucene.index.LogDocMergePolicy: [LogDocMergePolicy: minMergeSize=1000, mergeFactor=48, maxMergeSize=9223372036854775807, maxMergeSizeForForcedMerge=9223372036854775807, calibrateSizeByDeletes=true, maxMergeDocs=2147483647, maxCFSSegmentSizeMB=8.796093022207999E12, noCFSRatio=0.11959486981959443]
[junit4] 2> 475308 WARN (qtp370504570-1349) [n:127.0.0.1:42338_ c:collection1 s:shard2 x:collection1_shard2_replica_n0] o.a.s.c.RequestHandlers INVALID paramSet a in requestHandler {type = requestHandler,name = /dump,class = DumpRequestHandler,attributes = {initParams=a, name=/dump, class=DumpRequestHandler},args = {defaults={a=A,b=B}}}
[junit4] 2> 475708 INFO (qtp370504570-1349) [n:127.0.0.1:42338_ c:collection1 s:shard2 x:collection1_shard2_replica_n0] o.a.s.u.UpdateHandler Using UpdateLog implementation: org.apache.solr.update.UpdateLog
[junit4] 2> 475708 INFO (qtp370504570-1349) [n:127.0.0.1:42338_ c:collection1 s:shard2 x:collection1_shard2_replica_n0] o.a.s.u.UpdateLog Initializing UpdateLog: dataDir= defaultSyncLevel=FLUSH numRecordsToKeep=100 maxNumLogsToKeep=10 numVersionBuckets=65536
[junit4] 2> 475709 INFO (qtp370504570-1349) [n:127.0.0.1:42338_ c:collection1 s:shard2 x:collection1_shard2_replica_n0] o.a.s.u.CommitTracker Hard AutoCommit: disabled
[junit4] 2> 475709 INFO (qtp370504570-1349) [n:127.0.0.1:42338_ c:collection1 s:shard2 x:collection1_shard2_replica_n0] o.a.s.u.CommitTracker Soft AutoCommit: disabled
[junit4] 2> 475710 INFO (qtp370504570-1349) [n:127.0.0.1:42338_ c:collection1 s:shard2 x:collection1_shard2_replica_n0] o.a.s.u.RandomMergePolicy RandomMergePolicy wrapping class org.apache.lucene.index.TieredMergePolicy: [TieredMergePolicy: maxMergeAtOnce=34, maxMergeAtOnceExplicit=32, maxMergedSegmentMB=88.3232421875, floorSegmentMB=0.8603515625, forceMergeDeletesPctAllowed=3.2927754839359533, segmentsPerTier=20.0, maxCFSSegmentSizeMB=8.796093022207999E12, noCFSRatio=0.11789839612533255
[junit4] 2> 475710 INFO (qtp370504570-1349) [n:127.0.0.1:42338_ c:collection1 s:shard2 x:collection1_shard2_replica_n0] o.a.s.s.SolrIndexSearcher Opening [Searcher@46d8e9cd[collection1_shard2_replica_n0] main]
[junit4] 2> 475711 INFO (qtp370504570-1349) [n:127.0.0.1:42338_ c:collection1 s:shard2 x:collection1_shard2_replica_n0] o.a.s.r.ManagedResourceStorage Configured ZooKeeperStorageIO with znodeBase: /configs/conf1
[junit4] 2> 475724 INFO (qtp370504570-1349) [n:127.0.0.1:42338_ c:collection1 s:shard2 x:collection1_shard2_replica_n0] o.a.s.r.ManagedResourceStorage Loaded null at path _rest_managed.json using ZooKeeperStorageIO:path=/configs/conf1
[junit4] 2> 475724 INFO (qtp370504570-1349) [n:127.0.0.1:42338_ c:collection1 s:shard2 x:collection1_shard2_replica_n0] o.a.s.h.ReplicationHandler Commits will be reserved for 10000
[junit4] 2> 475725 INFO (qtp370504570-1349) [n:127.0.0.1:42338_ c:collection1 s:shard2 x:collection1_shard2_replica_n0] o.a.s.u.UpdateLog Could not find max version in index or recent updates, using new clock 1578131866073956352
[junit4] 2> 475757 INFO (searcherExecutor-447-thread-1-processing-n:127.0.0.1:42338_ x:collection1_shard2_replica_n0 s:shard2 c:collection1) [n:127.0.0.1:42338_ c:collection1 s:shard2 x:collection1_shard2_replica_n0] o.a.s.c.SolrCore [collection1_shard2_replica_n0] Registered new searcher Searcher@46d8e9cd[collection1_shard2_replica_n0] main{ExitableDirectoryReader(UninvertingDirectoryReader())}
[junit4] 2> 475791 INFO (qtp370504570-1349) [n:127.0.0.1:42338_ c:collection1 s:shard2 x:collection1_shard2_replica_n0] o.a.s.c.ShardLeaderElectionContext Enough replicas found to continue.
[junit4] 2> 475791 INFO (qtp370504570-1349) [n:127.0.0.1:42338_ c:collection1 s:shard2 x:collection1_shard2_replica_n0] o.a.s.c.ShardLeaderElectionContext I may be the new leader - try and sync
[junit4] 2> 475791 INFO (qtp370504570-1349) [n:127.0.0.1:42338_ c:collection1 s:shard2 x:collection1_shard2_replica_n0] o.a.s.c.SyncStrategy Sync replicas to http://127.0.0.1:42338/collection1_shard2_replica_n0/
[junit4] 2> 475791 INFO (qtp370504570-1349) [n:127.0.0.1:42338_ c:collection1 s:shard2 x:collection1_shard2_replica_n0] o.a.s.c.SyncStrategy Sync Success - now sync replicas to me
[junit4] 2> 475791 INFO (qtp370504570-1349) [n:127.0.0.1:42338_ c:collection1 s:shard2 x:collection1_shard2_replica_n0] o.a.s.c.SyncStrategy http://127.0.0.1:42338/collection1_shard2_replica_n0/ has no replicas
[junit4] 2> 475791 INFO (qtp370504570-1349) [n:127.0.0.1:42338_ c:collection1 s:shard2 x:collection1_shard2_replica_n0] o.a.s.c.ShardLeaderElectionContext Found all replicas participating in election, clear LIR
[junit4] 2> 475823 INFO (qtp370504570-1349) [n:127.0.0.1:42338_ c:collection1 s:shard2 x:collection1_shard2_replica_n0] o.a.s.c.ShardLeaderElectionContext I am the new leader: http://127.0.0.1:42338/collection1_shard2_replica_n0/ shard2
[junit4] 2> 475936 INFO (qtp370504570-1349) [n:127.0.0.1:42338_ c:collection1 s:shard2 x:collection1_shard2_replica_n0] o.a.s.c.ZkController I am the leader, no recovery necessary
[junit4] 2> 475937 INFO (qtp370504570-1349) [n:127.0.0.1:42338_ c:collection1 s:shard2 x:collection1_shard2_replica_n0] o.a.s.s.HttpSolrCall [admin] webapp=null path=/admin/cores params={qt=/admin/cores&collection.configName=conf1&name=collection1_shard2_replica_n0&action=CREATE&collection=collection1&shard=shard2&wt=javabin&version=2&replicaType=NRT} status=0 QTime=2674
[junit4] 2> 475971 INFO (qtp370504570-1350) [n:127.0.0.1:42338_ ] o.a.s.s.HttpSolrCall [admin] webapp=null path=/admin/collections params={node=127.0.0.1:42338_&action=ADDREPLICA&collection=collection1&shard=shard2&type=NRT&wt=javabin&version=2} status=0 QTime=2790
[junit4] 2> 476753 INFO (TEST-LeaderFailoverAfterPartitionTest.test-seed#[E90DB851661CA74]) [ ] o.a.s.c.AbstractFullDistribZkTestBase create jetty 2 in directory /home/jenkins/jenkins-slave/workspace/Lucene-Solr-Tests-7.0/solr/build/solr-core/test/J2/temp/solr.cloud.LeaderFailoverAfterPartitionTest_E90DB851661CA74-001/shard-2-001 of type NRT
[junit4] 2> 476772 INFO (TEST-LeaderFailoverAfterPartitionTest.test-seed#[E90DB851661CA74]) [ ] o.e.j.s.Server jetty-9.3.14.v20161028
[junit4] 2> 476787 INFO (TEST-LeaderFailoverAfterPartitionTest.test-seed#[E90DB851661CA74]) [ ] o.e.j.s.h.ContextHandler Started o.e.j.s.ServletContextHandler@736245e3{/,null,AVAILABLE}
[junit4] 2> 476787 INFO (TEST-LeaderFailoverAfterPartitionTest.test-seed#[E90DB851661CA74]) [ ] o.e.j.s.AbstractConnector Started ServerConnector@792f9311{HTTP/1.1,[http/1.1]}{127.0.0.1:44314}
[junit4] 2> 476787 INFO (TEST-LeaderFailoverAfterPartitionTest.test-seed#[E90DB851661CA74]) [ ] o.e.j.s.Server Started @488593ms
[junit4] 2> 476787 INFO (TEST-LeaderFailoverAfterPartitionTest.test-seed#[E90DB851661CA74]) [ ] o.a.s.c.s.e.JettySolrRunner Jetty properties: {solr.data.dir=/home/jenkins/jenkins-slave/workspace/Lucene-Solr-Tests-7.0/solr/build/solr-core/test/J2/temp/solr.cloud.LeaderFailoverAfterPartitionTest_E90DB851661CA74-001/tempDir-001/jetty2, solrconfig=solrconfig.xml, hostContext=/, hostPort=34302, coreRootDirectory=/home/jenkins/jenkins-slave/workspace/Lucene-Solr-Tests-7.0/solr/build/solr-core/test/J2/temp/solr.cloud.LeaderFailoverAfterPartitionTest_E90DB851661CA74-001/shard-2-001/cores}
[junit4] 2> 476788 ERROR (TEST-LeaderFailoverAfterPartitionTest.test-seed#[E90DB851661CA74]) [ ] o.a.s.s.StartupLoggingUtils Missing Java Option solr.log.dir. Logging may be missing or incomplete.
[junit4] 2> 476835 INFO (TEST-LeaderFailoverAfterPartitionTest.test-seed#[E90DB851661CA74]) [ ] o.a.s.s.SolrDispatchFilter ___ _ Welcome to Apache Solr? version 7.0.0
[junit4] 2> 476835 INFO (TEST-LeaderFailoverAfterPartitionTest.test-seed#[E90DB851661CA74]) [ ] o.a.s.s.SolrDispatchFilter / __| ___| |_ _ Starting in cloud mode on port null
[junit4] 2> 476835 INFO (TEST-LeaderFailoverAfterPartitionTest.test-seed#[E90DB851661CA74]) [ ] o.a.s.s.SolrDispatchFilter \__ \/ _ \ | '_| Install dir: null, Default config dir: null
[junit4] 2> 476835 INFO (TEST-LeaderFailoverAfterPartitionTest.test-seed#[E90DB851661CA74]) [ ] o.a.s.s.SolrDispatchFilter |___/\___/_|_| Start time: 2017-09-10T06:10:29.687Z
[junit4] 2> 476916 INFO (TEST-LeaderFailoverAfterPartitionTest.test-seed#[E90DB851661CA74]) [ ] o.a.s.s.SolrDispatchFilter Loading solr.xml from SolrHome (not found in ZooKeeper)
[junit4] 2> 476916 INFO (TEST-LeaderFailoverAfterPartitionTest.test-seed#[E90DB851661CA74]) [ ] o.a.s.c.SolrXmlConfig Loading container configuration from /home/jenkins/jenkins-slave/workspace/Lucene-Solr-Tests-7.0/solr/build/solr-core/test/J2/temp/solr.cloud.LeaderFailoverAfterPartitionTest_E90DB851661CA74-001/shard-2-001/solr.xml
[junit4] 2> 476932 INFO (TEST-LeaderFailoverAfterPartitionTest.test-seed#[E90DB851661CA74]) [ ] o.a.s.c.SolrXmlConfig MBean server found: com.sun.jmx.mbeanserver.JmxMBeanServer@286776a1, but no JMX reporters were configured - adding default JMX reporter.
[junit4] 2> 476953 INFO (TEST-LeaderFailoverAfterPartitionTest.test-seed#[E90DB851661CA74]) [ ] o.a.s.c.ZkContainer Zookeeper client=127.0.0.1:45768/solr
[junit4] 2> 477068 INFO (TEST-LeaderFailoverAfterPartitionTest.test-seed#[E90DB851661CA74]) [n:127.0.0.1:34302_ ] o.a.s.c.c.ZkStateReader Updated live nodes from ZooKeeper... (0) -> (2)
[junit4] 2> 477082 INFO (TEST-LeaderFailoverAfterPartitionTest.test-seed#[E90DB851661CA74]) [n:127.0.0.1:34302_ ] o.a.s.c.Overseer Overseer (id=null) closing
[junit4] 2> 477084 INFO (TEST-LeaderFailoverAfterPartitionTest.test-seed#[E90DB851661CA74]) [n:127.0.0.1:34302_ ] o.a.s.c.ZkController Register node as live in ZooKeeper:/live_nodes/127.0.0.1:34302_
[junit4] 2> 477196 INFO (zkCallback-184-thread-1-processing-n:127.0.0.1:34302_) [n:127.0.0.1:34302_ ] o.a.s.c.c.ZkStateReader Updated live nodes from ZooKeeper... (2) -> (3)
[junit4] 2> 477265 INFO (zkCallback-173-thread-1) [ ] o.a.s.c.c.ZkStateReader Updated live nodes from ZooKeeper... (2) -> (3)
[junit4] 2> 477269 INFO (zkCallback-178-thread-1-processing-n:127.0.0.1:42338_) [n:127.0.0.1:42338_ ] o.a.s.c.c.ZkStateReader Updated live nodes from ZooKeeper... (2) -> (3)
[junit4] 2> 477241 INFO (zkCallback-166-thread-1-processing-n:127.0.0.1:37291_) [n:127.0.0.1:37291_ ] o.a.s.c.c.ZkStateReader Updated live nodes from ZooKeeper... (2) -> (3)
[junit4] 2> 477273 INFO (OverseerCollectionConfigSetProcessor-98633240787550212-127.0.0.1:37291_-n_0000000000) [n:127.0.0.1:37291_ ] o.a.s.c.OverseerTaskQueue Response ZK path: /overseer/collection-queue-work/qnr-0000000004 doesn't exist. Requestor may have disconnected from ZooKeeper
[junit4] 2> 477783 INFO (TEST-LeaderFailoverAfterPartitionTest.test-seed#[E90DB851661CA74]) [n:127.0.0.1:34302_ ] o.a.s.m.r.SolrJmxReporter JMX monitoring for 'solr.node' (registry 'solr.node') enabled at server: com.sun.jmx.mbeanserver.JmxMBeanServer@286776a1
[junit4] 2> 477879 INFO (TEST-LeaderFailoverAfterPartitionTest.test-seed#[E90DB851661CA74]) [n:127.0.0.1:34302_ ] o.a.s.m.r.SolrJmxReporter JMX monitoring for 'solr.jvm' (registry 'solr.jvm') enabled at server: com.sun.jmx.mbeanserver.JmxMBeanServer@286776a1
[junit4] 2> 477880 INFO (TEST-LeaderFailoverAfterPartitionTest.test-seed#[E90DB851661CA74]) [n:127.0.0.1:34302_ ] o.a.s.m.r.SolrJmxReporter JMX monitoring for 'solr.jetty' (registry 'solr.jetty') enabled at server: com.sun.jmx.mbeanserver.JmxMBeanServer@286776a1
[junit4] 2> 477897 INFO (TEST-LeaderFailoverAfterPartitionTest.test-seed#[E90DB851661CA74]) [n:127.0.0.1:34302_ ] o.a.s.c.CorePropertiesLocator Found 0 core definitions underneath /home/jenkins/jenkins-slave/workspace/Lucene-Solr-Tests-7.0/solr/build/solr-core/test/J2/temp/solr.cloud.LeaderFailoverAfterPartitionTest_E90DB851661CA74-001/shard-2-001/cores
[junit4] 2> 478115 INFO (qtp370504570-1352) [n:127.0.0.1:42338_ ] o.a.s.h.a.CollectionsHandler Invoked Collection Action :addreplica with params node=127.0.0.1:34302_&action=ADDREPLICA&collection=collection1&shard=shard1&type=NRT&wt=javabin&version=2 and sendToOCPQueue=true
[junit4] 2> 478170 INFO (OverseerThreadFactory-433-thread-4-processing-n:127.0.0.1:37291_) [n:127.0.0.1:37291_ ] o.a.s.c.AddReplicaCmd Node Identified 127.0.0.1:34302_ for creating new replica
[junit4] 2> 478185 INFO (SocketProxy-Acceptor-34302) [ ] o.a.s.c.SocketProxy accepted Socket[addr=/127.0.0.1,port=36224,localport=34302], receiveBufferSize:531000
[junit4] 2> 478201 INFO (SocketProxy-Acceptor-34302) [ ] o.a.s.c.SocketProxy proxy connection Socket[addr=/127.0.0.1,port=44314,localport=45134], receiveBufferSize=530904
[junit4] 2> 478268 INFO (qtp203611945-1385) [n:127.0.0.1:34302_ ] o.a.s.h.a.CoreAdminOperation core create command qt=/admin/cores&collection.configName=conf1&name=collection1_shard1_replica_n0&action=CREATE&collection=collection1&shard=shard1&wt=javabin&version=2&replicaType=NRT
[junit4] 2> 478268 INFO (qtp203611945-1385) [n:127.0.0.1:34302_ ] o.a.s.c.TransientSolrCoreCacheDefault Allocating transient cache for 4 transient cores
[junit4] 2> 478539 INFO (qtp203611945-1385) [n:127.0.0.1:34302_ c:collection1 s:shard1 x:collection1_shard1_replica_n0] o.a.s.c.SolrConfig Using Lucene MatchVersion: 7.0.0
[junit4] 2> 478637 INFO (qtp203611945-1385) [n:127.0.0.1:34302_ c:collection1 s:shard1 x:collection1_shard1_replica_n0] o.a.s.s.IndexSchema [collection1_shard1_replica_n0] Schema name=test
[junit4] 2> 479258 INFO (qtp203611945-1385) [n:127.0.0.1:34302_ c:collection1 s:shard1 x:collection1_shard1_replica_n0] o.a.s.s.IndexSchema Loaded schema test/1.0 with uniqueid field id
[junit4] 2> 479343 INFO (qtp203611945-1385) [n:127.0.0.1:34302_ c:collection1 s:shard1 x:collection1_shard1_replica_n0] o.a.s.c.CoreContainer Creating SolrCore 'collection1_shard1_replica_n0' using configuration from collection collection1, trusted=true
[junit4] 2> 479343 INFO (qtp203611945-1385) [n:127.0.0.1:34302_ c:collection1 s:shard1 x:collection1_shard1_replica_n0] o.a.s.m.r.SolrJmxReporter JMX monitoring for 'solr.core.collection1.shard1.replica_n0' (registry 'solr.core.collection1.shard1.replica_n0') enabled at server: com.sun.jmx.mbeanserver.JmxMBeanServer@286776a1
[junit4] 2> 479343 INFO (qtp203611945-1385) [n:127.0.0.1:34302_ c:collection1 s:shard1 x:collection1_shard1_replica_n0] o.a.s.c.SolrCore solr.RecoveryStrategy.Builder
[junit4] 2> 479343 INFO (qtp203611945-1385) [n:127.0.0.1:34302_ c:collection1 s:shard1 x:collection1_shard1_replica_n0] o.a.s.c.SolrCore [[collection1_shard1_replica_n0] ] Opening new SolrCore at [/home/jenkins/jenkins-slave/workspace/Lucene-Solr-Tests-7.0/solr/build/solr-core/test/J2/temp/solr.cloud.LeaderFailoverAfterPartitionTest_E90DB851661CA74-001/shard-2-001/cores/collection1_shard1_replica_n0], dataDir=[/home/jenkins/jenkins-slave/workspace/Lucene-Solr-Tests-7.0/solr/build/solr-core/test/J2/temp/solr.cloud.LeaderFailoverAfterPartitionTest_E90DB851661CA74-001/shard-2-001/cores/collection1_shard1_replica_n0/data/]
[junit4] 2> 479374 INFO (qtp203611945-1385) [n:127.0.0.1:34302_ c:collection1 s:shard1 x:collection1_shard1_replica_n0] o.a.s.u.RandomMergePolicy RandomMergePolicy wrapping class org.apache.lucene.index.LogDocMergePolicy: [LogDocMergePolicy: minMergeSize=1000, mergeFactor=48, maxMergeSize=9223372036854775807, maxMergeSizeForForcedMerge=9223372036854775807, calibrateSizeByDeletes=true, maxMergeDocs=2147483647, maxCFSSegmentSizeMB=8.796093022207999E12, noCFSRatio=0.11959486981959443]
[junit4] 2> 479390 WARN (qtp203611945-1385) [n:127.0.0.1:34302_ c:collection1 s:shard1 x:collection1_shard1_replica_n0] o.a.s.c.RequestHandlers INVALID paramSet a in requestHandler {type = requestHandler,name = /dump,class = DumpRequestHandler,attributes = {initParams=a, name=/dump, class=DumpRequestHandler},args = {defaults={a=A,b=B}}}
[junit4] 2> 479682 INFO (qtp203611945-1385) [n:127.0.0.1:34302_ c:collection1 s:shard1 x:collection1_shard1_replica_n0] o.a.s.u.UpdateHandler Using UpdateLog implementation: org.apache.solr.update.UpdateLog
[junit4] 2> 479682 INFO (qtp203611945-1385) [n:127.0.0.1:34302_ c:collection1 s:shard1 x:collection1_shard1_replica_n0] o.a.s.u.UpdateLog Initializing UpdateLog: dataDir= defaultSyncLevel=FLUSH numRecordsToKeep=100 maxNumLogsToKeep=10 numVersionBuckets=65536
[junit4] 2> 479683 INFO (qtp203611945-1385) [n:127.0.0.1:34302_ c:collection1 s:shard1 x:collection1_shard1_replica_n0] o.a.s.u.CommitTracker Hard AutoCommit: disabled
[junit4] 2> 479683 INFO (qtp203611945-1385) [n:127.0.0.1:34302_ c:collection1 s:shard1 x:collection1_shard1_replica_n0] o.a.s.u.CommitTracker Soft AutoCommit: disabled
[junit4] 2> 479684 INFO (qtp203611945-1385) [n:127.0.0.1:34302_ c:collection1 s:shard1 x:collection1_shard1_replica_n0] o.a.s.u.RandomMergePolicy RandomMergePolicy wrapping class org.apache.lucene.index.TieredMergePolicy: [TieredMergePolicy: maxMergeAtOnce=34, maxMergeAtOnceExplicit=32, maxMergedSegmentMB=88.3232421875, floorSegmentMB=0.8603515625, forceMergeDeletesPctAllowed=3.2927754839359533, segmentsPerTier=20.0, maxCFSSegmentSizeMB=8.796093022207999E12, noCFSRatio=0.11789839612533255
[junit4] 2> 479684 INFO (qtp203611945-1385) [n:127.0.0.1:34302_ c:collection1 s:shard1 x:collection1_shard1_replica_n0] o.a.s.s.SolrIndexSearcher Opening [Searcher@6afdae64[collection1_shard1_replica_n0] main]
[junit4] 2> 479685 INFO (qtp203611945-1385) [n:127.0.0.1:34302_ c:collection1 s:shard1 x:collection1_shard1_replica_n0] o.a.s.r.ManagedResourceStorage Configured ZooKeeperStorageIO with znodeBase: /configs/conf1
[junit4] 2> 479685 INFO (qtp203611945-1385) [n:127.0.0.1:34302_ c:collection1 s:shard1 x:collection1_shard1_replica_n0] o.a.s.r.ManagedResourceStorage Loaded null at path _rest_managed.json using ZooKeeperStorageIO:path=/configs/conf1
[junit4] 2> 479698 INFO (qtp203611945-1385) [n:127.0.0.1:34302_ c:collection1 s:shard1 x:collection1_shard1_replica_n0] o.a.s.h.ReplicationHandler Commits will be reserved for 10000
[junit4] 2> 479700 INFO (searcherExecutor-458-thread-1-processing-n:127.0.0.1:34302_ x:collection1_shard1_replica_n0 s:shard1 c:collection1) [n:127.0.0.1:34302_ c:collection1 s:shard1 x:collection1_shard1_replica_n0] o.a.s.c.SolrCore [collection1_shard1_replica_n0] Registered new searcher Searcher@6afdae64[collection1_shard1_replica_n0] main{ExitableDirectoryReader(UninvertingDirectoryReader())}
[junit4] 2> 479700 INFO (qtp203611945-1385) [n:127.0.0.1:34302_ c:collection1 s:shard1 x:collection1_shard1_replica_n0] o.a.s.u.UpdateLog Could not find max version in index or recent updates, using new clock 1578131870242045952
[junit4] 2> 479752 INFO (qtp203611945-1385) [n:127.0.0.1:34302_ c:collection1 s:shard1 x:collection1_shard1_replica_n0] o.a.s.c.ShardLeaderElectionContext Enough replicas found to continue.
[junit4] 2> 479752 INFO (qtp203611945-1385) [n:127.0.0.1:34302_ c:collection1 s:shard1 x:collection1_shard1_replica_n0] o.a.s.c.ShardLeaderElectionContext I may be the new leader - try and sync
[junit4] 2> 479752 INFO (qtp203611945-1385) [n:127.0.0.1:34302_ c:collection1 s:shard1 x:collection1_shard1_replica_n0] o.a.s.c.SyncStrategy Sync replicas to http://127.0.0.1:34302/collection1_shard1_replica_n0/
[junit4] 2> 479752 INFO (qtp203611945-1385) [n:127.0.0.1:34302_ c:collection1 s:shard1 x:collection1_shard1_replica_n0] o.a.s.c.SyncStrategy Sync Success - now sync replicas to me
[junit4] 2> 479752 INFO (qtp203611945-1385) [n:127.0.0.1:34302_ c:collection1 s:shard1 x:collection1_shard1_replica_n0] o.a.s.c.SyncStrategy http://127.0.0.1:34302/collection1_shard1_replica_n0/ has no replicas
[junit4] 2> 479752 INFO (qtp203611945-1385) [n:127.0.0.1:34302_ c:collection1 s:shard1 x:collection1_shard1_replica_n0] o.a.s.c.ShardLeaderElectionContext Found all replicas participating in election, clear LIR
[junit4] 2> 479783 INFO (qtp203611945-1385) [n:127.0.0.1:34302_ c:collection1 s:shard1 x:collection1_shard1_replica_n0] o.a.s.c.ShardLeaderElectionContext I am the new leader: http://127.0.0.1:34302/collection1_shard1_replica_n0/ shard1
[junit4] 2> 479953 INFO (qtp203611945-1385) [n:127.0.0.1:34302_ c:collection1 s:shard1 x:collection1_shard1_replica_n0] o.a.s.c.ZkController I am the leader, no recovery necessary
[junit4] 2> 479955 INFO (qtp203611945-1385) [n:127.0.0.1:34302_ c:collection1 s:shard1 x:collection1_shard1_replica_n0] o.a.s.s.HttpSolrCall [admin] webapp=null path=/admin/cores params={qt=/admin/cores&collection.configName=conf1&name=collection1_shard1_replica_n0&action=CREATE&collection=collection1&shard=shard1&wt=javabin&version=2&replicaType=NRT} status=0 QTime=1687
[junit4] 2> 480007 INFO (qtp370504570-1352) [n:127.0.0.1:42338_ ] o.a.s.s.HttpSolrCall [admin] webapp=null path=/admin/collections params={node=127.0.0.1:34302_&action=ADDREPLICA&collection=collection1&shard=shard1&type=NRT&wt=javabin&version=2} status=0 QTime=1891
[junit4] 2> 480193 INFO (OverseerCollectionConfigSetProcessor-98633240787550212-127.0.0.1:37291_-n_0000000000) [n:127.0.0.1:37291_ ] o.a.s.c.OverseerTaskQueue Response ZK path: /overseer/collection-queue-work/qnr-0000000006 doesn't exist. Requestor may have disconnected from ZooKeeper
[junit4] 2> 480809 INFO (TEST-LeaderFailoverAfterPartitionTest.test-seed#[E90DB851661CA74]) [ ] o.a.s.c.AbstractFullDistribZkTestBase create jetty 3 in directory /home/jenkins/jenkins-slave/workspace/Lucene-Solr-Tests-7.0/solr/build/solr-core/test/J2/temp/solr.cloud.LeaderFailoverAfterPartitionTest_E90DB851661CA74-001/shard-3-001 of type NRT
[junit4] 2> 480854 INFO (TEST-LeaderFailoverAfterPartitionTest.test-seed#[E90DB851661CA74]) [ ] o.e.j.s.Server jetty-9.3.14.v20161028
[junit4] 2> 480921 INFO (TEST-LeaderFailoverAfterPartitionTest.test-seed#[E90DB851661CA74]) [ ] o.e.j.s.h.ContextHandler Started o.e.j.s.ServletContextHandler@6559da52{/,null,AVAILABLE}
[junit4] 2> 480922 INFO (TEST-LeaderFailoverAfterPartitionTest.test-seed#[E90DB851661CA74]) [ ] o.e.j.s.AbstractConnector Started ServerConnector@11727971{HTTP/1.1,[http/1.1]}{127.0.0.1:42279}
[junit4] 2> 480922 INFO (TEST-LeaderFailoverAfterPartitionTest.test-seed#[E90DB851661CA74]) [ ] o.e.j.s.Server Started @492727ms
[junit4] 2> 480922 INFO (TEST-LeaderFailoverAfterPartitionTest.test-seed#[E90DB851661CA74]) [ ] o.a.s.c.s.e.JettySolrRunner Jetty properties: {solr.data.dir=/home/jenkins/jenkins-slave/workspace/Lucene-Solr-Tests-7.0/solr/build/solr-core/test/J2/temp/solr.cloud.LeaderFailoverAfterPartitionTest_E90DB851661CA74-001/tempDir-001/jetty3, replicaType=NRT, solrconfig=solrconfig.xml, hostContext=/, hostPort=46248, coreRootDirectory=/home/jenkins/jenkins-slave/workspace/Lucene-Solr-Tests-7.0/solr/build/solr-core/test/J2/temp/solr.cloud.LeaderFailoverAfterPartitionTest_E90DB851661CA74-001/shard-3-001/cores}
[junit4] 2> 480922 ERROR (TEST-LeaderFailoverAfterPartitionTest.test-seed#[E90DB851661CA74]) [ ] o.a.s.s.StartupLoggingUtils Missing Java Option solr.log.dir. Logging may be missing or incomplete.
[junit4] 2> 480922 INFO (TEST-LeaderFailoverAfterPartitionTest.test-seed#[E90DB851661CA74]) [ ] o.a.s.s.SolrDispatchFilter ___ _ Welcome to Apache Solr? version 7.0.0
[junit4] 2> 480922 INFO (TEST-LeaderFailoverAfterPartitionTest.test-seed#[E90DB851661CA74]) [ ] o.a.s.s.SolrDispatchFilter / __| ___| |_ _ Starting in cloud mode on port null
[junit4] 2> 480923 INFO (TEST-LeaderFailoverAfterPartitionTest.test-seed#[E90DB851661CA74]) [ ] o.a.s.s.SolrDispatchFilter \__ \/ _ \ | '_| Install dir: null, Default config dir: null
[junit4] 2> 480923 INFO (TEST-LeaderFailoverAfterPartitionTest.test-seed#[E90DB851661CA74]) [ ] o.a.s.s.SolrDispatchFilter |___/\___/_|_| Start time: 2017-09-10T06:10:33.775Z
[junit4] 2> 481098 INFO (TEST-LeaderFailoverAfterPartitionTest.test-seed#[E90DB851661CA74]) [ ] o.a.s.s.SolrDispatchFilter Loading solr.xml from SolrHome (not found in ZooKeeper)
[junit4] 2> 481098 INFO (TEST-LeaderFailoverAfterPartitionTest.test-seed#[E90DB851661CA74]) [ ] o.a.s.c.SolrXmlConfig Loading container configuration from /home/jenkins/jenkins-slave/workspace/Lucene-Solr-Tests-7.0/solr/build/solr-core/test/J2/temp/solr.cloud.LeaderFailoverAfterPartitionTest_E90DB851661CA74-001/shard-3-001/solr.xml
[junit4] 2> 481176 INFO (TEST-LeaderFailoverAfterPartitionTest.test-seed#[E90DB851661CA74]) [ ] o.a.s.c.SolrXmlConfig MBean server found: com.sun.jmx.mbeanserver.JmxMBeanServer@286776a1, but no JMX reporters were configured - adding default JMX reporter.
[junit4] 2> 481192 INFO (TEST-LeaderFailoverAfterPartitionTest.test-seed#[E90DB851661CA74]) [ ] o.a.s.c.ZkContainer Zookeeper client=127.0.0.1:45768/solr
[junit4] 2> 481381 INFO (TEST-LeaderFailoverAfterPartitionTest.test-seed#[E90DB851661CA74]) [n:127.0.0.1:46248_ ] o.a.s.c.c.ZkStateReader Updated live nodes from ZooKeeper... (0) -> (3)
[junit4] 2> 481395 INFO (TEST-LeaderFailoverAfterPartitionTest.test-seed#[E90DB851661CA74]) [n:127.0.0.1:46248_ ] o.a.s.c.Overseer Overseer (id=null) closing
[junit4] 2> 481396 INFO (TEST-LeaderFailoverAfterPartitionTest.test-seed#[E90DB851661CA74]) [n:127.0.0.1:46248_ ] o.a.s.c.ZkController Register node as live in ZooKeeper:/live_nodes/127.0.0.1:46248_
[junit4] 2> 481419 INFO (zkCallback-173-thread-1) [ ] o.a.s.c.c.ZkStateReader Updated live nodes from ZooKeeper... (3) -> (4)
[junit4] 2> 481536 INFO (zkCallback-190-thread-1-processing-n:127.0.0.1:46248_) [n:127.0.0.1:46248_ ] o.a.s.c.c.ZkStateReader Updated live nodes from ZooKeeper... (3) -> (4)
[junit4] 2> 481500 INFO (zkCallback-178-thread-1-processing-n:127.0.0.1:42338_) [n:127.0.0.1:42338_ ] o.a.s.c.c.ZkStateReader Updated live nodes from ZooKeeper... (3) -> (4)
[junit4] 2> 481419 INFO (zkCallback-166-thread-2-processing-n:127.0.0.1:37291_) [n:127.0.0.1:37291_ ] o.a.s.c.c.ZkStateReader Updated live nodes from ZooKeeper... (3) -> (4)
[junit4] 2> 481552 INFO (zkCallback-184-thread-1-processing-n:127.0.0.1:34302_) [n:127.0.0.1:34302_ ] o.a.s.c.c.ZkStateReader Updated live nodes from ZooKeeper... (3) -> (4)
[junit4] 2> 482251 INFO (TEST-LeaderFailoverAfterPartitionTest.test-seed#[E90DB851661CA74]) [n:127.0.0.1:46248_ ] o.a.s.m.r.SolrJmxReporter JMX monitoring for 'solr.node' (registry 'solr.node') enabled at server: com.sun.jmx.mbeanserver.JmxMBeanServer@286776a1
[junit4] 2> 482316 INFO (TEST-LeaderFailoverAfterPartitionTest.test-seed#[E90DB851661CA74]) [n:127.0.0.1:46248_ ] o.a.s.m.r.SolrJmxReporter JMX monitoring for 'solr.jvm' (registry 'solr.jvm') enabled at server: com.sun.jmx.mbeanserver.JmxMBeanServer@286776a1
[junit4] 2> 482317 INFO (TEST-LeaderFailoverAfterPartitionTest.test-seed#[E90DB851661CA74]) [n:127.0.0.1:46248_ ] o.a.s.m.r.SolrJmxReporter JMX monitoring for 'solr.jetty' (registry 'solr.jetty') enabled at server: com.sun.jmx.mbeanserver.JmxMBeanServer@286776a1
[junit4] 2> 482318 INFO (TEST-LeaderFailoverAfterPartitionTest.test-seed#[E90DB851661CA74]) [n:127.0.0.1:46248_ ] o.a.s.c.CorePropertiesLocator Found 0 core definitions underneath /home/jenkins/jenkins-slave/workspace/Lucene-Solr-Tests-7.0/solr/build/solr-core/test/J2/temp/solr.cloud.LeaderFailoverAfterPartitionTest_E90DB851661CA74-001/shard-3-001/cores
[junit4] 2> 482739 INFO (qtp370504570-1355) [n:127.0.0.1:42338_ ] o.a.s.h.a.CollectionsHandler Invoked Collection Action :addreplica with params node=127.0.0.1:46248_&action=ADDREPLICA&collection=collection1&shard=shard2&type=NRT&wt=javabin&version=2 and sendToOCPQueue=true
[junit4] 2> 482771 INFO (OverseerThreadFactory-433-thread-5-processing-n:127.0.0.1:37291_) [n:127.0.0.1:37291_ ] o.a.s.c.AddReplicaCmd Node Identified 127.0.0.1:46248_ for creating new replica
[junit4] 2> 482782 INFO (SocketProxy-Acceptor-46248) [ ] o.a.s.c.SocketProxy accepted Socket[addr=/127.0.0.1,port=54902,localport=46248], receiveBufferSize:531000
[junit4] 2> 482785 INFO (SocketProxy-Acceptor-46248) [ ] o.a.s.c.SocketProxy proxy connection Socket[addr=/127.0.0.1,port=42279,localport=41290], receiveBufferSize=530904
[junit4] 2> 482816 INFO (qtp2061232499-1420) [n:127.0.0.1:46248_ ] o.a.s.h.a.CoreAdminOperation core create command qt=/admin/cores&collection.configName=conf1&name=collection1_shard2_replica_n1&action=CREATE&collection=collection1&shard=shard2&wt=javabin&version=2&replicaType=NRT
[junit4] 2> 482817 INFO (qtp2061232499-1420) [n:127.0.0.1:46248_ ] o.a.s.c.TransientSolrCoreCacheDefault Allocating transient cache for 4 transient cores
[junit4] 2> 483989 INFO (qtp2061232499-1420) [n:127.0.0.1:46248_ c:collection1 s:shard2 x:collection1_shard2_replica_n1] o.a.s.c.SolrConfig Using Lucene MatchVersion: 7.0.0
[junit4] 2> 484086 INFO (qtp2061232499-1420) [n:127.0.0.1:46248_ c:collection1 s:shard2 x:collection1_shard2_replica_n1] o.a.s.s.IndexSchema [collection1_shard2_replica_n1] Schema name=test
[junit4] 2> 484557 INFO (qtp2061232499-1420) [n:127.0.0.1:46248_ c:collection1 s:shard2 x:collection1_shard2_replica_n1] o.a.s.s.IndexSchema Loaded schema test/1.0 with uniqueid field id
[junit4] 2> 484616 INFO (qtp2061232499-1420) [n:127.0.0.1:46248_ c:collection1 s:shard2 x:collection1_shard2_replica_n1] o.a.s.c.CoreContainer Creating SolrCore 'collection1_shard2_replica_n1' using configuration from collection collection1, trusted=true
[junit4] 2> 484657 INFO (qtp2061232499-1420) [n:127.0.0.1:46248_ c:collection1 s:shard2 x:collection1_shard2_replica_n1] o.a.s.m.r.SolrJmxReporter JMX monitoring for 'solr.core.collection1.shard2.replica_n1' (registry 'solr.core.collection1.shard2.replica_n1') enabled at server: com.sun.jmx.mbeanserver.JmxMBeanServer@286776a1
[junit4] 2> 484670 INFO (qtp2061232499-1420) [n:127.0.0.1:46248_ c:collection1 s:shard2 x:collection1_shard2_replica_n1] o.a.s.c.SolrCore solr.RecoveryStrategy.Builder
[junit4] 2> 484670 INFO (qtp2061232499-1420) [n:127.0.0.1:46248_ c:collection1 s:shard2 x:collection1_shard2_replica_n1] o.a.s.c.SolrCore [[collection1_shard2_replica_n1] ] Opening new SolrCore at [/home/jenkins/jenkins-slave/workspace/Lucene-Solr-Tests-7.0/solr/build/solr-core/test/J2/temp/solr.cloud.LeaderFailoverAfterPartitionTest_E90DB851661CA74-001/shard-3-001/cores/collection1_shard2_replica_n1], dataDir=[/home/jenkins/jenkins-slave/workspace/Lucene-Solr-Tests-7.0/solr/build/solr-core/test/J2/temp/solr.cloud.LeaderFailoverAfterPartitionTest_E90DB851661CA74-001/shard-3-001/cores/collection1_shard2_replica_n1/data/]
[junit4] 2> 484673 INFO (qtp2061232499-1420) [n:127.0.0.1:46248_ c:collection1 s:shard2 x:collection1_shard2_replica_n1] o.a.s.u.RandomMergePolicy RandomMergePolicy wrapping class org.apache.lucene.index.LogDocMergePolicy: [LogDocMergePolicy: minMergeSize=1000, mergeFactor=48, maxMergeSize=9223372036854775807, maxMergeSizeForForcedMerge=9223372036854775807, calibrateSizeByDeletes=true, maxMergeDocs=2147483647, maxCFSSegmentSizeMB=8.796093022207999E12, noCFSRatio=0.11959486981959443]
[junit4] 2> 484722 WARN (qtp2061232499-1420) [n:127.0.0.1:46248_ c:collection1 s:shard2 x:collection1_shard2_replica_n1] o.a.s.c.RequestHandlers INVALID paramSet a in requestHandler {type = requestHandler,name = /dump,class = DumpRequestHandler,attributes = {initParams=a, name=/dump, class=DumpRequestHandler},args = {defaults={a=A,b=B}}}
[junit4] 2> 485092 INFO (qtp2061232499-1420) [n:127.0.0.1:46248_ c:collection1 s:shard2 x:collection1_shard2_replica_n1] o.a.s.u.UpdateHandler Using UpdateLog implementation: org.apache.solr.update.UpdateLog
[junit4] 2> 485093 INFO (qtp2061232499-1420) [n:127.0.0.1:46248_ c:collection1 s:shard2 x:collection1_shard2_replica_n1] o.a.s.u.UpdateLog Initializing UpdateLog: dataDir= defaultSyncLevel=FLUSH numRecordsToKeep=100 maxNumLogsToKeep=10 numVersionBuckets=65536
[junit4] 2> 485094 INFO (qtp2061232499-1420) [n:127.0.0.1:46248_ c:collection1 s:shard2 x:collection1_shard2_replica_n1] o.a.s.u.CommitTracker Hard AutoCommit: disabled
[junit4] 2> 485094 INFO (qtp2061232499-1420) [n:127.0.0.1:46248_ c:collection1 s:shard2 x:collection1_shard2_replica_n1] o.a.s.u.CommitTracker Soft AutoCommit: disabled
[junit4] 2> 485095 INFO (qtp2061232499-1420) [n:127.0.0.1:46248_ c:collection1 s:shard2 x:collection1_shard2_replica_n1] o.a.s.u.RandomMergePolicy RandomMergePolicy wrapping class org.apache.lucene.index.TieredMergePolicy: [TieredMergePolicy: maxMergeAtOnce=34, maxMergeAtOnceExplicit=32, maxMergedSegmentMB=88.3232421875, floorSegmentMB=0.8603515625, forceMergeDeletesPctAllowed=3.2927754839359533, segmentsPerTier=20.0, maxCFSSegmentSizeMB=8.796093022207999E12, noCFSRatio=0.11789839612533255
[junit4] 2> 485095 INFO (qtp2061232499-1420) [n:127.0.0.1:46248_ c:collection1 s:shard2 x:collection1_shard2_replica_n1] o.a.s.s.SolrIndexSearcher Opening [Searcher@6d3b30d9[collection1_shard2_replica_n1] main]
[junit4] 2> 485109 INFO (qtp2061232499-1420) [n:127.0.0.1:46248_ c:collection1 s:shard2 x:collection1_shard2_replica_n1] o.a.s.r.ManagedResourceStorage Configured ZooKeeperStorageIO with znodeBase: /configs/conf1
[junit4] 2> 485109 INFO (qtp2061232499-1420) [n:127.0.0.1:46248_ c:collection1 s:shard2 x:collection1_shard2_replica_n1] o.a.s.r.ManagedResourceStorage Loaded null at path _rest_managed.json using ZooKeeperStorageIO:path=/configs/conf1
[junit4] 2> 485110 INFO (qtp2061232499-1420) [n:127.0.0.1:46248_ c:collection1 s:shard2 x:collection1_shard2_replica_n1] o.a.s.h.ReplicationHandler Commits will be reserved for 10000
[junit4] 2> 485110 INFO (qtp2061232499-1420) [n:127.0.0.1:46248_ c:collection1 s:shard2 x:collection1_shard2_replica_n1] o.a.s.u.UpdateLog Could not find max version in index or recent updates, using new clock 1578131875914842112
[junit4] 2> 485112 INFO (qtp2061232499-1420) [n:127.0.0.1:46248_ c:collection1 s:shard2 x:collection1_shard2_replica_n1] o.a.s.c.ZkController Core needs to recover:collection1_shard2_replica_n1
[junit4] 2> 485134 INFO (searcherExecutor-469-thread-1-processing-n:127.0.0.1:46248_ x:collection1_shard2_replica_n1 s:shard2 c:collection1) [n:127.0.0.1:46248_ c:collection1 s:shard2 x:collection1_shard2_replica_n1] o.a.s.c.SolrCore [collection1_shard2_replica_n1] Registered new searcher Searcher@6d3b30d9[collection1_shard2_replica_n1] main{ExitableDirectoryReader(UninvertingDirectoryReader())}
[junit4] 2> 485174 INFO (qtp2061232499-1420) [n:127.0.0.1:46248_ c:collection1 s:shard2 x:collection1_shard2_replica_n1] o.a.s.s.HttpSolrCall [admin] webapp=null path=/admin/cores params={qt=/admin/cores&collection.configName=conf1&name=collection1_shard2_replica_n1&action=CREATE&collection=collection1&shard=shard2&wt=javabin&version=2&replicaType=NRT} status=0 QTime=2357
[junit4] 2> 485198 INFO (updateExecutor-187-thread-1-processing-n:127.0.0.1:46248_ x:collection1_shard2_replica_n1 s:shard2 c:collection1) [n:127.0.0.1:46248_ c:collection1 s:shard2 r:core_node3 x:collection1_shard2_replica_n1] o.a.s.u.DefaultSolrCoreState Running recovery
[junit4] 2> 485207 INFO (qtp370504570-1355) [n:127.0.0.1:42338_ ] o.a.s.s.HttpSolrCall [admin] webapp=null path=/admin/collections params={node=127.0.0.1:46248_&action=ADDREPLICA&collection=collection1&shard=shard2&type=NRT&wt=javabin&version=2} status=0 QTime=2468
[junit4] 2> 485214 INFO (recoveryExecutor-188-thread-1-processing-n:127.0.0.1:46248_ x:collection1_shard2_replica_n1 s:shard2 c:collection1 r:core_node3) [n:127.0.0.1:46248_ c:collection1 s:shard2 r:core_node3 x:collection1_shard2_replica_n1] o.a.s.c.RecoveryStrategy Starting recovery process. recoveringAfterStartup=true
[junit4] 2> 485263 INFO (recoveryExecutor-188-thread-1-processing-n:127.0.0.1:46248_ x:collection1_shard2_replica_n1 s:shard2 c:collection1 r:core_node3) [n:127.0.0.1:46248_ c:collection1 s:shard2 r:core_node3 x:collection1_shard2_replica_n1] o.a.s.c.RecoveryStrategy ###### startupVersions=[[]]
[junit4] 2> 485263 INFO (recoveryExecutor-188-thread-1-processing-n:127.0.0.1:46248_ x:collection1_shard2_replica_n1 s:shard2 c:collection1 r:core_node3) [n:127.0.0.1:46248_ c:collection1 s:shard2 r:core_node3 x:collection1_shard2_replica_n1] o.a.s.c.RecoveryStrategy Begin buffering updates. core=[collection1_shard2_replica_n1]
[junit4] 2> 485263 INFO (recoveryExecutor-188-thread-1-processing-n:127.0.0.1:46248_ x:collection1_shard2_replica_n1 s:shard2 c:collection1 r:core_node3) [n:127.0.0.1:46248_ c:collection1 s:shard2 r:core_node3 x:collection1_shard2_replica_n1] o.a.s.u.UpdateLog Starting to buffer updates. FSUpdateLog{state=ACTIVE, tlog=null}
[junit4] 2> 485263 INFO (recoveryExecutor-188-thread-1-processing-n:127.0.0.1:46248_ x:collection1_shard2_replica_n1 s:shard2 c:collection1 r:core_node3) [n:127.0.0.1:46248_ c:collection1 s:shard2 r:core_node3 x:collection1_shard2_replica_n1] o.a.s.c.RecoveryStrategy Publishing state of core [collection1_shard2_replica_n1] as recovering, leader is [http://127.0.0.1:42338/collection1_shard2_replica_n0/] and I am [http://127.0.0.1:46248/collection1_shard2_replica_n1/]
[junit4] 2> 485295 INFO (recoveryExecutor-188-thread-1-processing-n:127.0.0.1:46248_ x:collection1_shard2_replica_n1 s:shard2 c:collection1 r:core_node3) [n:127.0.0.1:46248_ c:collection1 s:shard2 r:core_node3 x:collection1_shard2_replica_n1] o.a.s.c.RecoveryStrategy Sending prep recovery command to [http://127.0.0.1:42338]; [WaitForState: action=PREPRECOVERY&core=collection1_shard2_replica_n0&nodeName=127.0.0.1:46248_&coreNodeName=core_node3&state=recovering&checkLive=true&onlyIfLeader=true&onlyIfLeaderActive=true]
[junit4] 2> 485296 INFO (TEST-LeaderFailoverAfterPartitionTest.test-seed#[E90DB851661CA74]) [ ] o.a.s.SolrTestCaseJ4 ###Starting test
[junit4] 2> 485296 INFO (TEST-LeaderFailoverAfterPartitionTest.test-seed#[E90DB851661CA74]) [ ] o.a.s.c.AbstractFullDistribZkTestBase Wait for recoveries to finish - wait 30000 for each attempt
[junit4] 2> 485296 INFO (TEST-LeaderFailoverAfterPartitionTest.test-seed#[E90DB851661CA74]) [ ] o.a.s.c.AbstractDistribZkTestBase Wait for recoveries to finish - collection: collection1 failOnTimeout:true timeout (sec):30000
[junit4] 2> 485300 INFO (SocketProxy-Acceptor-42338) [ ] o.a.s.c.SocketProxy accepted Socket[addr=/127.0.0.1,port=45270,localport=42338], receiveBufferSize:531000
[junit4] 2> 485328 INFO (SocketProxy-Acceptor-42338) [ ] o.a.s.c.SocketProxy proxy connection Socket[addr=/127.0.0.1,port=33266,localport=48422], receiveBufferSize=530904
[junit4] 2> 485414 INFO (qtp370504570-1354) [n:127.0.0.1:42338_ ] o.a.s.h.a.PrepRecoveryOp Going to wait for coreNodeName: core_node3, state: recovering, checkLive: true, onlyIfLeader: true, onlyIfLeaderActive: true, maxTime: 183 s
[junit4] 2> 485494 INFO (qtp370504570-1354) [n:127.0.0.1:42338_ ] o.a.s.h.a.PrepRecoveryOp In WaitForState(recovering): collection=collection1, shard=shard2, thisCore=collection1_shard2_replica_n0, leaderDoesNotNeedRecovery=false, isLeader? true, live=true, checkLive=true, currentState=recovering, localState=active, nodeName=127.0.0.1:46248_, coreNodeName=core_node3, onlyIfActiveCheckResult=false, nodeProps: core_node3:{"core":"collection1_shard2_replica_n1","base_url":"http://127.0.0.1:46248","node_name":"127.0.0.1:46248_","state":"recovering","type":"NRT"}
[junit4] 2> 485495 INFO (qtp370504570-1354) [n:127.0.0.1:42338_ ] o.a.s.h.a.PrepRecoveryOp Waited coreNodeName: core_node3, state: recovering, checkLive: true, onlyIfLeader: true for: 0 seconds.
[junit4] 2> 485495 INFO (qtp370504570-1354) [n:127.0.0.1:42338_ ] o.a.s.s.HttpSolrCall [admin] webapp=null path=/admin/cores params={nodeName=127.0.0.1:46248_&onlyIfLeaderActive=true&core=collection1_shard2_replica_n0&coreNodeName=core_node3&action=PREPRECOVERY&checkLive=true&state=recovering&onlyIfLeader=true&wt=javabin&version=2} status=0 QTime=81
[junit4] 2> 486042 INFO (recoveryExecutor-188-thread-1-processing-n:127.0.0.1:46248_ x:collection1_shard2_replica_n1 s:shard2 c:collection1 r:core_node3) [n:127.0.0.1:46248_ c:collection1 s:shard2 r:core_node3 x:collection1_shard2_replica_n1] o.a.s.c.RecoveryStrategy Attempting to PeerSync from [http://127.0.0.1:42338/collection1_shard2_replica_n0/] - recoveringAfterStartup=[true]
[junit4] 2> 486043 INFO (recoveryExecutor-188-thread-1-processing-n:127.0.0.1:46248_ x:collection1_shard2_replica_n1 s:shard2 c:collection1 r:core_node3) [n:127.0.0.1:46248_ c:collection1 s:shard2 r:core_node3 x:collection1_shard2_replica_n1] o.a.s.u.PeerSync PeerSync: core=collection1_shard2_replica_n1 url=http://127.0.0.1:46248 START replicas=[http://127.0.0.1:42338/collection1_shard2_replica_n0/] nUpdates=100
[junit4] 2> 486079 INFO (SocketProxy-Acceptor-42338) [ ] o.a.s.c.SocketProxy accepted Socket[addr=/127.0.0.1,port=45274,localport=42338], receiveBufferSize:531000
[junit4] 2> 486091 INFO (SocketProxy-Acceptor-42338) [ ] o.a.s.c.SocketProxy proxy connection Socket[addr=/127.0.0.1,port=33266,localport=48426], receiveBufferSize=530904
[junit4] 2> 486095 INFO (qtp370504570-1352) [n:127.0.0.1:42338_ c:collection1 s:shard2 r:core_node1 x:collection1_shard2_replica_n0] o.a.s.u.IndexFingerprint IndexFingerprint millis:2.0 result:{maxVersionSpecified=9223372036854775807, maxVersionEncountered=0, maxInHash=0, versionsHash=0, numVersions=0, numDocs=0, maxDoc=0}
[junit4] 2> 486124 INFO (qtp370504570-1352) [n:127.0.0.1:42338_ c:collection1 s:shard2 r:core_node1 x:collection1_shard2_replica_n0] o.a.s.c.S.Request [collection1_shard2_replica_n0] webapp= path=/get params={distrib=false&qt=/get&getFingerprint=9223372036854775807&wt=javabin&version=2} status=0 QTime=2
[junit4] 2> 486157 INFO (recoveryExecutor-188-thread-1-processing-n:127.0.0.1:46248_ x:collection1_shard2_replica_n1 s:shard2 c:collection1 r:core_node3) [n:127.0.0.1:46248_ c:collection1 s:shard2 r:core_node3 x:collection1_shard2_replica_n1] o.a.s.u.IndexFingerprint IndexFingerprint millis:29.0 result:{maxVersionSpecified=9223372036854775807, maxVersionEncountered=0, maxInHash=0, versionsHash=0, numVersions=0, numDocs=0, maxDoc=0}
[junit4] 2> 486157 INFO (recoveryExecutor-188-thread-1-processing-n:127.0.0.1:46248_ x:collection1_shard2_replica_n1 s:shard2 c:collection1 r:core_node3) [n:127.0.0.1:46248_ c:collection1 s:shard2 r:core_node3 x:collection1_shard2_replica_n1] o.a.s.u.PeerSync We are already in sync. No need to do a PeerSync
[junit4] 2> 486157 INFO (recoveryExecutor-188-thread-1-processing-n:127.0.0.1:46248_ x:collection1_shard2_replica_n1 s:shard2 c:collection1 r:core_node3) [n:127.0.0.1:46248_ c:collection1 s:shard2 r:core_node3 x:collection1_shard2_replica_n1] o.a.s.u.DirectUpdateHandler2 start commit{,optimize=false,openSearcher=true,waitSearcher=true,expungeDeletes=false,softCommit=false,prepareCommit=false}
[junit4] 2> 486157 INFO (recoveryExecutor-188-thread-1-processing-n:127.0.0.1:46248_ x:collection1_shard2_replica_n1 s:shard2 c:collection1 r:core_node3) [n:127.0.0.1:46248_ c:collection1 s:shard2 r:core_node3 x:collection1_shard2_replica_n1] o.a.s.u.DirectUpdateHandler2 No uncommitted changes. Skipping IW.commit.
[junit4] 2> 486157 INFO (recoveryExecutor-188-thread-1-processing-n:127.0.0.1:46248_ x:collection1_shard2_replica_n1 s:shard2 c:collection1 r:core_node3) [n:127.0.0.1:46248_ c:collection1 s:shard2 r:core_node3 x:collection1_shard2_replica_n1] o.a.s.u.DirectUpdateHandler2 end_commit_flush
[junit4] 2> 486160 INFO (recoveryExecutor-188-thread-1-processing-n:127.0.0.1:46248_ x:collection1_shard2_replica_n1 s:shard2 c:collection1 r:core_node3) [n:127.0.0.1:46248_ c:collection1 s:shard2 r:core_node3 x:collection1_shard2_replica_n1] o.a.s.c.RecoveryStrategy PeerSync stage of recovery was successful.
[junit4] 2> 486160 INFO (recoveryExecutor-188-thread-1-processing-n:127.0.0.1:46248_ x:collection1_shard2_replica_n1 s:shard2 c:collection1 r:core_node3) [n:127.0.0.1:46248_ c:collection1 s:shard2 r:core_node3 x:collection1_shard2_replica_n1] o.a.s.c.RecoveryStrategy Replaying updates buffered during PeerSync.
[junit4] 2> 486160 INFO (recoveryExecutor-188-thread-1-processing-n:127.0.0.1:46248_ x:collection1_shard2_replica_n1 s:shard2 c:collection1 r:core_node3) [n:127.0.0.1:46248_ c:collection1 s:shard2 r:core_node3 x:collection1_shard2_replica_n1] o.a.s.c.RecoveryStrategy No replay needed.
[junit4] 2> 486160 INFO (recoveryExecutor-188-thread-1-processing-n:127.0.0.1:46248_ x:collection1_shard2_replica_n1 s:shard2 c:collection1 r:core_node3) [n:127.0.0.1:46248_ c:collection1 s:shard2 r:core_node3 x:collection1_shard2_replica_n1] o.a.s.c.RecoveryStrategy Registering as Active after recovery.
[junit4] 2> 486306 INFO (TEST-LeaderFailoverAfterPartitionTest.test-seed#[E90DB851661CA74]) [ ] o.a.s.c.AbstractDistribZkTestBase Recoveries finished - collection: collection1
[junit4] 2> 486351 INFO (qtp1530434230-1305) [n:127.0.0.1:37291_ c:control_collection s:shard1 r:core_node1 x:control_collection_shard1_replica_n1] o.a.s.u.DirectUpdateHandler2 start commit{_version_=1578131877216124928,optimize=false,openSearcher=true,waitSearcher=true,expungeDeletes=false,softCommit=false,prepareCommit=false}
[junit4] 2> 486353 INFO (qtp1530434230-1305) [n:127.0.0.1:37291_ c:control_collection s:shard1 r:core_node1 x:control_collection_shard1_replica_n1] o.a.s.u.DirectUpdateHandler2 No uncommitted changes. Skipping IW.commit.
[junit4] 2> 486353 INFO (qtp1530434230-1305) [n:127.0.0.1:37291_ c:control_collection s:shard1 r:core_node1 x:control_collection_shard1_replica_n1] o.a.s.u.DirectUpdateHandler2 end_commit_flush
[junit4] 2> 486501 INFO (qtp1530434230-1305) [n:127.0.0.1:37291_ c:control_collection s:shard1 r:core_node1 x:control_collection_shard1_replica_n1] o.a.s.u.p.LogUpdateProcessorFactory [control_collection_shard1_replica_n1] webapp= path=/update params={waitSearcher=true&commit=true&softCommit=false&wt=javabin&version=2}{commit=} 0 182
[junit4] 2> 486550 INFO (SocketProxy-Acceptor-42338) [ ] o.a.s.c.SocketProxy accepted Socket[addr=/127.0.0.1,port=45282,localport=42338], receiveBufferSize:531000
[junit4] 2> 486554 INFO (SocketProxy-Acceptor-34302) [ ] o.a.s.c.SocketProxy accepted Socket[addr=/127.0.0.1,port=36248,localport=34302], receiveBufferSize:531000
[junit4] 2> 486567 INFO (SocketProxy-Acceptor-46248) [ ] o.a.s.c.SocketProxy accepted Socket[addr=/127.0.0.1,port=54924,localport=46248], receiveBufferSize:531000
[junit4] 2> 486583 INFO (SocketProxy-Acceptor-42338) [ ] o.a.s.c.SocketProxy proxy connection Socket[addr=/127.0.0.1,port=33266,localport=48434], receiveBufferSize=530904
[junit4] 2> 486599 INFO (qtp370504570-1353) [n:127.0.0.1:42338_ c:collection1 s:shard2 r:core_node1 x:collection1_shard2_replica_n0] o.a.s.u.DirectUpdateHandler2 start commit{_version_=1578131877476171776,optimize=false,openSearcher=true,waitSearcher=true,expungeDeletes=false,softCommit=false,prepareCommit=false}
[junit4] 2> 486600 INFO (qtp370504570-1353) [n:127.0.0.1:423
[...truncated too long message...]
xtHandler.java:1112)
[junit4] 2> at org.eclipse.jetty.server.handler.ScopedHandler.handle(ScopedHandler.java:141)
[junit4] 2> at org.eclipse.jetty.server.handler.gzip.GzipHandler.handle(GzipHandler.java:462)
[junit4] 2> at org.eclipse.jetty.server.handler.HandlerWrapper.handle(HandlerWrapper.java:134)
[junit4] 2> at org.eclipse.jetty.server.Server.handle(Server.java:534)
[junit4] 2> at org.eclipse.jetty.server.HttpChannel.handle(HttpChannel.java:320)
[junit4] 2> at org.eclipse.jetty.server.HttpConnection.onFillable(HttpConnection.java:251)
[junit4] 2> at org.eclipse.jetty.io.AbstractConnection$ReadCallback.succeeded(AbstractConnection.java:273)
[junit4] 2> at org.eclipse.jetty.io.FillInterest.fillable(FillInterest.java:95)
[junit4] 2> at org.eclipse.jetty.io.SelectChannelEndPoint$2.run(SelectChannelEndPoint.java:93)
[junit4] 2> at org.eclipse.jetty.util.thread.strategy.ExecuteProduceConsume.executeProduceConsume(ExecuteProduceConsume.java:303)
[junit4] 2> at org.eclipse.jetty.util.thread.strategy.ExecuteProduceConsume.produceConsume(ExecuteProduceConsume.java:148)
[junit4] 2> at org.eclipse.jetty.util.thread.strategy.ExecuteProduceConsume.run(ExecuteProduceConsume.java:136)
[junit4] 2> at org.eclipse.jetty.util.thread.QueuedThreadPool.runJob(QueuedThreadPool.java:671)
[junit4] 2> at org.eclipse.jetty.util.thread.QueuedThreadPool$2.run(QueuedThreadPool.java:589)
[junit4] 2> at java.lang.Thread.run(Thread.java:748)
[junit4] 2>
[junit4] 2> 614570 INFO (qtp2061232499-1420) [n:127.0.0.1:46248_ ] o.a.s.s.HttpSolrCall [admin] webapp=null path=/admin/cores params={nodeName=127.0.0.1:42338_&onlyIfLeaderActive=true&core=c8n_1x3_lf_shard1_replica_n3&coreNodeName=core_node2&action=PREPRECOVERY&checkLive=true&state=recovering&onlyIfLeader=true&wt=javabin&version=2} status=400 QTime=98677
[junit4] 2> 614678 INFO (zkCallback-190-thread-3-processing-n:127.0.0.1:46248_) [n:127.0.0.1:46248_ c:collection1 s:shard2 r:core_node3 x:collection1_shard2_replica_n1] o.a.s.m.SolrMetricManager Closing metric reporters for registry=solr.collection.collection1.shard2.leader, tag=1123290381
[junit4] 2> 614773 INFO (TEST-LeaderFailoverAfterPartitionTest.test-seed#[E90DB851661CA74]) [ ] o.e.j.s.AbstractConnector Stopped ServerConnector@11727971{HTTP/1.1,[http/1.1]}{127.0.0.1:0}
[junit4] 2> 614773 INFO (TEST-LeaderFailoverAfterPartitionTest.test-seed#[E90DB851661CA74]) [ ] o.e.j.s.h.ContextHandler Stopped o.e.j.s.ServletContextHandler@6559da52{/,null,UNAVAILABLE}
[junit4] 2> 614805 ERROR (TEST-LeaderFailoverAfterPartitionTest.test-seed#[E90DB851661CA74]) [ ] o.a.z.s.ZooKeeperServer ZKShutdownHandler is not registered, so ZooKeeper server won't take any action on ERROR or SHUTDOWN server state changes
[junit4] 2> 614806 INFO (TEST-LeaderFailoverAfterPartitionTest.test-seed#[E90DB851661CA74]) [ ] o.a.s.c.ZkTestServer connecting to 127.0.0.1:45768 45768
[junit4] 2> 615020 INFO (Thread-440) [ ] o.a.s.c.ZkTestServer connecting to 127.0.0.1:45768 45768
[junit4] 2> 615021 WARN (Thread-440) [ ] o.a.s.c.ZkTestServer Watch limit violations:
[junit4] 2> Maximum concurrent create/delete watches above limit:
[junit4] 2>
[junit4] 2> 6 /solr/aliases.json
[junit4] 2> 4 /solr/security.json
[junit4] 2> 4 /solr/configs/conf1
[junit4] 2> 3 /solr/collections/c8n_1x3_lf/state.json
[junit4] 2> 3 /solr/collections/collection1/state.json
[junit4] 2>
[junit4] 2> Maximum concurrent data watches above limit:
[junit4] 2>
[junit4] 2> 6 /solr/clusterstate.json
[junit4] 2> 6 /solr/clusterprops.json
[junit4] 2> 2 /solr/overseer_elect/election/98633240787550217-127.0.0.1:42338_-n_0000000001
[junit4] 2>
[junit4] 2> Maximum concurrent children watches above limit:
[junit4] 2>
[junit4] 2> 6 /solr/live_nodes
[junit4] 2> 6 /solr/collections
[junit4] 2> 3 /solr/overseer/queue
[junit4] 2> 3 /solr/overseer/queue-work
[junit4] 2> 3 /solr/overseer/collection-queue-work
[junit4] 2>
[junit4] 2> 615021 WARN (TEST-LeaderFailoverAfterPartitionTest.test-seed#[E90DB851661CA74]) [ ] o.a.s.c.SocketProxy Closing 3 connections to: http://127.0.0.1:37291/, target: http://127.0.0.1:44828/
[junit4] 2> 615021 WARN (TEST-LeaderFailoverAfterPartitionTest.test-seed#[E90DB851661CA74]) [ ] o.a.s.c.SocketProxy Closing 6 connections to: http://127.0.0.1:46248/, target: http://127.0.0.1:42279/
[junit4] 2> 615021 WARN (TEST-LeaderFailoverAfterPartitionTest.test-seed#[E90DB851661CA74]) [ ] o.a.s.c.SocketProxy Closing 1 connections to: http://127.0.0.1:42338/, target: http://127.0.0.1:33266/
[junit4] 2> 615021 WARN (TEST-LeaderFailoverAfterPartitionTest.test-seed#[E90DB851661CA74]) [ ] o.a.s.c.SocketProxy Closing 0 connections to: http://127.0.0.1:34302/, target: http://127.0.0.1:44314/
[junit4] 2> NOTE: reproduce with: ant test -Dtestcase=LeaderFailoverAfterPartitionTest -Dtests.method=test -Dtests.seed=E90DB851661CA74 -Dtests.multiplier=2 -Dtests.slow=true -Dtests.locale=he -Dtests.timezone=Canada/East-Saskatchewan -Dtests.asserts=true -Dtests.file.encoding=ISO-8859-1
[junit4] FAILURE 152s J2 | LeaderFailoverAfterPartitionTest.test <<<
[junit4] > Throwable #1: java.lang.AssertionError: Expected 2 of 3 replicas to be active but only found 1; [core_node3:{"core":"c8n_1x3_lf_shard1_replica_n3","base_url":"http://127.0.0.1:46248","node_name":"127.0.0.1:46248_","state":"active","type":"NRT","leader":"true"}]; clusterState: DocCollection(c8n_1x3_lf//clusterstate.json/30)={
[junit4] > "pullReplicas":"0",
[junit4] > "replicationFactor":"1",
[junit4] > "shards":{"shard1":{
[junit4] > "range":"80000000-7fffffff",
[junit4] > "state":"active",
[junit4] > "replicas":{
[junit4] > "core_node1":{
[junit4] > "core":"c8n_1x3_lf_shard1_replica_n1",
[junit4] > "base_url":"http://127.0.0.1:34302",
[junit4] > "node_name":"127.0.0.1:34302_",
[junit4] > "state":"down",
[junit4] > "type":"NRT"},
[junit4] > "core_node2":{
[junit4] > "state":"down",
[junit4] > "base_url":"http://127.0.0.1:42338",
[junit4] > "core":"c8n_1x3_lf_shard1_replica_n2",
[junit4] > "node_name":"127.0.0.1:42338_",
[junit4] > "type":"NRT"},
[junit4] > "core_node3":{
[junit4] > "core":"c8n_1x3_lf_shard1_replica_n3",
[junit4] > "base_url":"http://127.0.0.1:46248",
[junit4] > "node_name":"127.0.0.1:46248_",
[junit4] > "state":"active",
[junit4] > "type":"NRT",
[junit4] > "leader":"true"}}}},
[junit4] > "router":{"name":"compositeId"},
[junit4] > "maxShardsPerNode":"1",
[junit4] > "autoAddReplicas":"false",
[junit4] > "nrtReplicas":"3",
[junit4] > "tlogReplicas":"0"}
[junit4] > at __randomizedtesting.SeedInfo.seed([E90DB851661CA74:86C4E45FB89DA78C]:0)
[junit4] > at org.apache.solr.cloud.LeaderFailoverAfterPartitionTest.testRf3WithLeaderFailover(LeaderFailoverAfterPartitionTest.java:169)
[junit4] > at org.apache.solr.cloud.LeaderFailoverAfterPartitionTest.test(LeaderFailoverAfterPartitionTest.java:56)
[junit4] > at org.apache.solr.BaseDistributedSearchTestCase$ShardsRepeatRule$ShardsFixedStatement.callStatement(BaseDistributedSearchTestCase.java:993)
[junit4] > at org.apache.solr.BaseDistributedSearchTestCase$ShardsRepeatRule$ShardsStatement.evaluate(BaseDistributedSearchTestCase.java:968)
[junit4] > at java.lang.Thread.run(Thread.java:748)
[junit4] 2> NOTE: leaving temporary files on disk at: /home/jenkins/jenkins-slave/workspace/Lucene-Solr-Tests-7.0/solr/build/solr-core/test/J2/temp/solr.cloud.LeaderFailoverAfterPartitionTest_E90DB851661CA74-001
[junit4] 2> Sep 10, 2017 6:12:47 AM com.carrotsearch.randomizedtesting.ThreadLeakControl checkThreadLeaks
[junit4] 2> WARNING: Will linger awaiting termination of 1 leaked thread(s).
[junit4] 2> NOTE: test params are: codec=Asserting(Lucene70): {multiDefault=TestBloomFilteredLucenePostings(BloomFilteringPostingsFormat(Lucene50(blocksize=128))), a_t=Lucene50(blocksize=128), id=PostingsFormat(name=LuceneVarGapFixedInterval), text=Lucene50(blocksize=128)}, docValues:{range_facet_l_dv=DocValuesFormat(name=Asserting), _version_=DocValuesFormat(name=Memory), intDefault=DocValuesFormat(name=Memory), id_i1=DocValuesFormat(name=Lucene70), range_facet_i_dv=DocValuesFormat(name=Memory), intDvoDefault=DocValuesFormat(name=Direct), range_facet_l=DocValuesFormat(name=Memory), timestamp=DocValuesFormat(name=Memory)}, maxPointsInLeafNode=1672, maxMBSortInHeap=7.861229395664168, sim=RandomSimilarity(queryNorm=true): {}, locale=he, timezone=Canada/East-Saskatchewan
[junit4] 2> NOTE: Linux 4.4.0-83-generic amd64/Oracle Corporation 1.8.0_144 (64-bit)/cpus=4,threads=1,free=196718000,total=445644800
[junit4] 2> NOTE: All tests run in this JVM: [TestConfigSetImmutable, MinimalSchemaTest, PreAnalyzedFieldTest, TestDistribDocBasedVersion, PathHierarchyTokenizerFactoryTest, TestSolrCloudWithKerberosAlt, JvmMetricsTest, TestSolrDeletionPolicy2, DistributedFacetPivotSmallTest, SolrCoreCheckLockOnStartupTest, TestHdfsBackupRestoreCore, TestStressReorder, PreAnalyzedFieldManagedSchemaCloudTest, SolrGangliaReporterTest, BaseCdcrDistributedZkTest, DistributedQueryComponentOptimizationTest, TestAddFieldRealTimeGet, BigEndianAscendingWordDeserializerTest, BlockJoinFacetRandomTest, TestPKIAuthenticationPlugin, LeaderFailoverAfterPartitionTest]
[junit4] Completed [86/729 (1!)] on J2 in 152.94s, 1 test, 1 failure <<< FAILURES!
[...truncated 45521 lines...]