You are viewing a plain text version of this content. The canonical link for it is here.
Posted to builds@beam.apache.org by Apache Jenkins Server <je...@builds.apache.org> on 2022/12/09 08:54:40 UTC
Build failed in Jenkins: beam_LoadTests_Go_Combine_Dataflow_Batch #723
See <https://ci-beam.apache.org/job/beam_LoadTests_Go_Combine_Dataflow_Batch/723/display/redirect?page=changes>
Changes:
[Kenneth Knowles] Exclude IOs already split from Java Precommit job
[Kenneth Knowles] Move expansion services into appropriate precommits
[Kenneth Knowles] Split more IOs out of Java precommit
[Kenneth Knowles] Fix trigger paths for separated IOs
[Kenneth Knowles] Turn rawtype checking back on for core Java SDK
[noreply] [Tour Of Beam] Playground Router GRPC API host (#24542)
[noreply] Bump golang.org/x/net from 0.3.0 to 0.4.0 in /sdks (#24587)
[noreply] Replaced finalize with DoFn Teardown in Neo4jIO (#24571)
[Kenneth Knowles] Simplify bug report templates
[Kenneth Knowles] Fix bugs in issue template yml
[noreply] Fix issue templates (#24597)
[noreply] [#24024] Stop wrapping light weight functions with Contextful as they
[noreply] Sample window size as well (#24388)
[noreply] Implement Kafka Write Schema Transform (#24495)
[Kenneth Knowles] Eliminate null errors from JdbcIO
[noreply] docs(fix): Filter.whereFieldName(s?) ->
[hiandyzhang] ElasticsearchIO: Lower log level in flushBatch to avoid noisy log
------------------------------------------
Started by timer
Running as SYSTEM
[EnvInject] - Loading node environment variables.
Building remotely on apache-beam-jenkins-13 (beam) in workspace <https://ci-beam.apache.org/job/beam_LoadTests_Go_Combine_Dataflow_Batch/ws/>
The recommended git tool is: NONE
No credentials specified
Wiping out workspace first.
Cloning the remote Git repository
Cloning repository https://github.com/apache/beam.git
> git init <https://ci-beam.apache.org/job/beam_LoadTests_Go_Combine_Dataflow_Batch/ws/src> # timeout=10
Fetching upstream changes from https://github.com/apache/beam.git
> git --version # timeout=10
> git --version # 'git version 2.25.1'
> git fetch --tags --force --progress -- https://github.com/apache/beam.git +refs/heads/*:refs/remotes/origin/* # timeout=10
> git config remote.origin.url https://github.com/apache/beam.git # timeout=10
> git config --add remote.origin.fetch +refs/heads/*:refs/remotes/origin/* # timeout=10
> git config remote.origin.url https://github.com/apache/beam.git # timeout=10
Fetching upstream changes from https://github.com/apache/beam.git
> git fetch --tags --force --progress -- https://github.com/apache/beam.git +refs/heads/*:refs/remotes/origin/* +refs/pull/${ghprbPullId}/*:refs/remotes/origin/pr/${ghprbPullId}/* # timeout=10
> git rev-parse origin/master^{commit} # timeout=10
Checking out Revision 58b4d46655d94374f3d3564752dc12eb98b95456 (origin/master)
> git config core.sparsecheckout # timeout=10
> git checkout -f 58b4d46655d94374f3d3564752dc12eb98b95456 # timeout=10
Commit message: "Merge pull request #24574: Turn rawtype checking back on for core Java SDK"
> git rev-list --no-walk 80980b8be48ece9c6d61dc28f429374b8e7a0e4b # timeout=10
No emails were triggered.
[EnvInject] - Executing scripts and injecting environment variables after the SCM step.
[EnvInject] - Injecting as environment variables the properties content
SETUPTOOLS_USE_DISTUTILS=stdlib
SPARK_LOCAL_IP=127.0.0.1
[EnvInject] - Variables injected successfully.
[beam_LoadTests_Go_Combine_Dataflow_Batch] $ /bin/bash -xe /tmp/jenkins7312017152220120599.sh
+ echo '*** Combine Go Load test: 2GB of 10B records ***'
*** Combine Go Load test: 2GB of 10B records ***
[Gradle] - Launching build.
[src] $ <https://ci-beam.apache.org/job/beam_LoadTests_Go_Combine_Dataflow_Batch/ws/src/gradlew> -PloadTest.mainClass=combine -Prunner=DataflowRunner '-PloadTest.args=--job_name=load-tests-go-dataflow-batch-combine-1-1209065341 --project=apache-beam-testing --region=us-central1 --temp_location=gs://temp-storage-for-perf-tests/loadtests --staging_location=gs://temp-storage-for-perf-tests/loadtests --influx_namespace=dataflow --influx_measurement=go_batch_combine_1 --input_options='{"num_records": 200000000,"key_size": 1,"value_size": 9}' --fanout=1 --top_count=20 --num_****s=5 --autoscaling_algorithm=NONE --environment_type=DOCKER --environment_config=gcr.io/apache-beam-testing/beam-sdk/beam_go_sdk:latest --influx_db_name=beam_test_metrics --influx_hostname=http://10.128.0.96:8086 --runner=DataflowRunner' --continue --max-****s=8 -Dorg.gradle.jvmargs=-Xms2g -Dorg.gradle.jvmargs=-Xmx6g -Dorg.gradle.vfs.watch=false -Pdocker-pull-licenses :sdks:go:test:load:run
Starting a Gradle Daemon (subsequent builds will be faster)
Configuration on demand is an incubating feature.
> Task :buildSrc:compileJava NO-SOURCE
> Task :buildSrc:compileGroovy FROM-CACHE
> Task :buildSrc:pluginDescriptors
> Task :buildSrc:processResources
> Task :buildSrc:classes
> Task :buildSrc:jar
> Task :buildSrc:assemble
> Task :buildSrc:spotlessGroovy FROM-CACHE
> Task :buildSrc:spotlessGroovyCheck UP-TO-DATE
> Task :buildSrc:spotlessGroovyGradle FROM-CACHE
> Task :buildSrc:spotlessGroovyGradleCheck UP-TO-DATE
> Task :buildSrc:spotlessCheck UP-TO-DATE
> Task :buildSrc:pluginUnderTestMetadata
> Task :buildSrc:compileTestJava NO-SOURCE
> Task :buildSrc:compileTestGroovy NO-SOURCE
> Task :buildSrc:processTestResources NO-SOURCE
> Task :buildSrc:testClasses UP-TO-DATE
> Task :buildSrc:test NO-SOURCE
> Task :buildSrc:validatePlugins FROM-CACHE
> Task :buildSrc:check UP-TO-DATE
> Task :buildSrc:build
System Go installation: /snap/bin/go is go version go1.16.15 linux/amd64; Preparing to use /home/jenkins/go/bin/go1.19.3
go install golang.org/dl/go1.19.3@latest: no matching versions for query "latest"
FAILURE: Build failed with an exception.
* What went wrong:
Could not determine the dependencies of task ':sdks:go:test:load:goBuild'.
> Could not create task ':sdks:go:test:load:goPrepare'.
> Process 'command 'sh'' finished with non-zero exit value 1
* Try:
> Run with --stacktrace option to get the stack trace.
> Run with --info or --debug option to get more log output.
* Get more help at https://help.gradle.org
BUILD FAILED in 2m 8s
10 actionable tasks: 4 executed, 4 from cache, 2 up-to-date
Publishing build scan...
https://gradle.com/s/nhijt25ozprec
Build step 'Invoke Gradle script' changed build result to FAILURE
Build step 'Invoke Gradle script' marked build as failure
---------------------------------------------------------------------
To unsubscribe, e-mail: builds-unsubscribe@beam.apache.org
For additional commands, e-mail: builds-help@beam.apache.org
Jenkins build is back to normal : beam_LoadTests_Go_Combine_Dataflow_Batch #724
Posted by Apache Jenkins Server <je...@builds.apache.org>.
See <https://ci-beam.apache.org/job/beam_LoadTests_Go_Combine_Dataflow_Batch/724/display/redirect?page=changes>
---------------------------------------------------------------------
To unsubscribe, e-mail: builds-unsubscribe@beam.apache.org
For additional commands, e-mail: builds-help@beam.apache.org