You are viewing a plain text version of this content. The canonical link for it is here.
Posted to dev@kafka.apache.org by Apache Jenkins Server <je...@builds.apache.org> on 2020/06/03 00:57:05 UTC

Build failed in Jenkins: kafka-trunk-jdk8 #4601

See <https://builds.apache.org/job/kafka-trunk-jdk8/4601/display/redirect?page=changes>

Changes:

[github] KAFKA-9320: Enable TLSv1.3 by default (KIP-573) (#8695)


------------------------------------------
[...truncated 3.13 MB...]

org.apache.kafka.streams.TopologyTestDriverTest > shouldPunctuateOnWallClockTimeDeprecated[Eos enabled = false] STARTED

org.apache.kafka.streams.TopologyTestDriverTest > shouldPunctuateOnWallClockTimeDeprecated[Eos enabled = false] PASSED

org.apache.kafka.streams.TopologyTestDriverTest > shouldProcessRecordForTopic[Eos enabled = false] STARTED

org.apache.kafka.streams.TopologyTestDriverTest > shouldProcessRecordForTopic[Eos enabled = false] PASSED

org.apache.kafka.streams.TopologyTestDriverTest > shouldForwardRecordsFromSubtopologyToSubtopology[Eos enabled = false] STARTED

org.apache.kafka.streams.TopologyTestDriverTest > shouldForwardRecordsFromSubtopologyToSubtopology[Eos enabled = false] PASSED

org.apache.kafka.streams.TopologyTestDriverTest > shouldNotUpdateStoreForSmallerValue[Eos enabled = false] STARTED

org.apache.kafka.streams.TopologyTestDriverTest > shouldNotUpdateStoreForSmallerValue[Eos enabled = false] PASSED

org.apache.kafka.streams.TopologyTestDriverTest > shouldCreateStateDirectoryForStatefulTopology[Eos enabled = false] STARTED

org.apache.kafka.streams.TopologyTestDriverTest > shouldCreateStateDirectoryForStatefulTopology[Eos enabled = false] PASSED

org.apache.kafka.streams.TopologyTestDriverTest > shouldPunctuateIfWallClockTimeAdvances[Eos enabled = false] STARTED

org.apache.kafka.streams.TopologyTestDriverTest > shouldPunctuateIfWallClockTimeAdvances[Eos enabled = false] PASSED

org.apache.kafka.streams.MockTimeTest > shouldGetNanosAsMillis STARTED

org.apache.kafka.streams.MockTimeTest > shouldGetNanosAsMillis PASSED

org.apache.kafka.streams.MockTimeTest > shouldSetStartTime STARTED

org.apache.kafka.streams.MockTimeTest > shouldSetStartTime PASSED

org.apache.kafka.streams.MockTimeTest > shouldNotAllowNegativeSleep STARTED

org.apache.kafka.streams.MockTimeTest > shouldNotAllowNegativeSleep PASSED

org.apache.kafka.streams.MockTimeTest > shouldAdvanceTimeOnSleep STARTED

org.apache.kafka.streams.MockTimeTest > shouldAdvanceTimeOnSleep PASSED

org.apache.kafka.streams.internals.WindowStoreFacadeTest > shouldReturnIsOpen STARTED

org.apache.kafka.streams.internals.WindowStoreFacadeTest > shouldReturnIsOpen PASSED

org.apache.kafka.streams.internals.WindowStoreFacadeTest > shouldReturnName STARTED

org.apache.kafka.streams.internals.WindowStoreFacadeTest > shouldReturnName PASSED

org.apache.kafka.streams.internals.WindowStoreFacadeTest > shouldPutWithUnknownTimestamp STARTED

org.apache.kafka.streams.internals.WindowStoreFacadeTest > shouldPutWithUnknownTimestamp PASSED

org.apache.kafka.streams.internals.WindowStoreFacadeTest > shouldPutWindowStartTimestampWithUnknownTimestamp STARTED

org.apache.kafka.streams.internals.WindowStoreFacadeTest > shouldPutWindowStartTimestampWithUnknownTimestamp PASSED

org.apache.kafka.streams.internals.WindowStoreFacadeTest > shouldReturnIsPersistent STARTED

org.apache.kafka.streams.internals.WindowStoreFacadeTest > shouldReturnIsPersistent PASSED

org.apache.kafka.streams.internals.WindowStoreFacadeTest > shouldForwardClose STARTED

org.apache.kafka.streams.internals.WindowStoreFacadeTest > shouldForwardClose PASSED

org.apache.kafka.streams.internals.WindowStoreFacadeTest > shouldForwardFlush STARTED

org.apache.kafka.streams.internals.WindowStoreFacadeTest > shouldForwardFlush PASSED

org.apache.kafka.streams.internals.WindowStoreFacadeTest > shouldForwardInit STARTED

org.apache.kafka.streams.internals.WindowStoreFacadeTest > shouldForwardInit PASSED

org.apache.kafka.streams.test.TestRecordTest > testConsumerRecord STARTED

org.apache.kafka.streams.test.TestRecordTest > testConsumerRecord PASSED

org.apache.kafka.streams.test.TestRecordTest > testToString STARTED

org.apache.kafka.streams.test.TestRecordTest > testToString PASSED

org.apache.kafka.streams.test.TestRecordTest > testInvalidRecords STARTED

org.apache.kafka.streams.test.TestRecordTest > testInvalidRecords PASSED

org.apache.kafka.streams.test.TestRecordTest > testPartialConstructorEquals STARTED

org.apache.kafka.streams.test.TestRecordTest > testPartialConstructorEquals PASSED

org.apache.kafka.streams.test.TestRecordTest > testMultiFieldMatcher STARTED

org.apache.kafka.streams.test.TestRecordTest > testMultiFieldMatcher PASSED

org.apache.kafka.streams.test.TestRecordTest > testFields STARTED

org.apache.kafka.streams.test.TestRecordTest > testFields PASSED

org.apache.kafka.streams.test.TestRecordTest > testProducerRecord STARTED

org.apache.kafka.streams.test.TestRecordTest > testProducerRecord PASSED

org.apache.kafka.streams.test.TestRecordTest > testEqualsAndHashCode STARTED

org.apache.kafka.streams.test.TestRecordTest > testEqualsAndHashCode PASSED

> Task :streams:upgrade-system-tests-0102:spotbugsMain NO-SOURCE
> Task :streams:upgrade-system-tests-0102:test
> Task :streams:upgrade-system-tests-0110:compileJava NO-SOURCE
> Task :streams:upgrade-system-tests-0110:processResources NO-SOURCE
> Task :streams:upgrade-system-tests-0110:classes UP-TO-DATE
> Task :streams:upgrade-system-tests-0110:checkstyleMain NO-SOURCE
> Task :streams:upgrade-system-tests-0110:compileTestJava
> Task :streams:upgrade-system-tests-0110:processTestResources NO-SOURCE
> Task :streams:upgrade-system-tests-0110:testClasses
> Task :streams:upgrade-system-tests-0110:checkstyleTest
> Task :streams:upgrade-system-tests-0110:spotbugsMain NO-SOURCE
> Task :streams:upgrade-system-tests-0110:test
> Task :streams:upgrade-system-tests-10:compileJava NO-SOURCE
> Task :streams:upgrade-system-tests-10:processResources NO-SOURCE
> Task :streams:upgrade-system-tests-10:classes UP-TO-DATE
> Task :streams:upgrade-system-tests-10:checkstyleMain NO-SOURCE
> Task :streams:upgrade-system-tests-10:compileTestJava
> Task :streams:upgrade-system-tests-10:processTestResources NO-SOURCE
> Task :streams:upgrade-system-tests-10:testClasses
> Task :streams:upgrade-system-tests-10:checkstyleTest
> Task :streams:upgrade-system-tests-10:spotbugsMain NO-SOURCE
> Task :streams:upgrade-system-tests-10:test
> Task :streams:upgrade-system-tests-11:compileJava NO-SOURCE
> Task :streams:upgrade-system-tests-11:processResources NO-SOURCE
> Task :streams:upgrade-system-tests-11:classes UP-TO-DATE
> Task :streams:upgrade-system-tests-11:checkstyleMain NO-SOURCE
> Task :streams:upgrade-system-tests-11:compileTestJava
> Task :streams:upgrade-system-tests-11:processTestResources NO-SOURCE
> Task :streams:upgrade-system-tests-11:testClasses
> Task :streams:upgrade-system-tests-11:checkstyleTest
> Task :streams:upgrade-system-tests-11:spotbugsMain NO-SOURCE
> Task :streams:upgrade-system-tests-11:test
> Task :streams:upgrade-system-tests-20:compileJava NO-SOURCE
> Task :streams:upgrade-system-tests-20:processResources NO-SOURCE
> Task :streams:upgrade-system-tests-20:classes UP-TO-DATE
> Task :streams:upgrade-system-tests-20:checkstyleMain NO-SOURCE
> Task :streams:upgrade-system-tests-20:compileTestJava
> Task :streams:upgrade-system-tests-20:processTestResources NO-SOURCE
> Task :streams:upgrade-system-tests-20:testClasses
> Task :streams:upgrade-system-tests-20:checkstyleTest
> Task :streams:upgrade-system-tests-20:spotbugsMain NO-SOURCE
> Task :streams:upgrade-system-tests-20:test
> Task :streams:upgrade-system-tests-21:compileJava NO-SOURCE
> Task :streams:upgrade-system-tests-21:processResources NO-SOURCE
> Task :streams:upgrade-system-tests-21:classes UP-TO-DATE
> Task :streams:upgrade-system-tests-21:checkstyleMain NO-SOURCE
> Task :streams:upgrade-system-tests-21:compileTestJava
> Task :streams:upgrade-system-tests-21:processTestResources NO-SOURCE
> Task :streams:upgrade-system-tests-21:testClasses
> Task :streams:upgrade-system-tests-21:checkstyleTest
> Task :streams:upgrade-system-tests-21:spotbugsMain NO-SOURCE
> Task :streams:upgrade-system-tests-21:test
> Task :streams:upgrade-system-tests-22:compileJava NO-SOURCE
> Task :streams:upgrade-system-tests-22:processResources NO-SOURCE
> Task :streams:upgrade-system-tests-22:classes UP-TO-DATE
> Task :streams:upgrade-system-tests-22:checkstyleMain NO-SOURCE
> Task :streams:upgrade-system-tests-22:compileTestJava
> Task :streams:upgrade-system-tests-22:processTestResources NO-SOURCE
> Task :streams:upgrade-system-tests-22:testClasses
> Task :streams:upgrade-system-tests-22:checkstyleTest
> Task :streams:upgrade-system-tests-22:spotbugsMain NO-SOURCE
> Task :streams:upgrade-system-tests-22:test
> Task :streams:upgrade-system-tests-23:compileJava NO-SOURCE
> Task :streams:upgrade-system-tests-23:processResources NO-SOURCE
> Task :streams:upgrade-system-tests-23:classes UP-TO-DATE
> Task :streams:upgrade-system-tests-23:checkstyleMain NO-SOURCE
> Task :streams:upgrade-system-tests-23:compileTestJava
> Task :streams:upgrade-system-tests-23:processTestResources NO-SOURCE
> Task :streams:upgrade-system-tests-23:testClasses
> Task :streams:upgrade-system-tests-23:checkstyleTest
> Task :streams:upgrade-system-tests-23:spotbugsMain NO-SOURCE
> Task :streams:upgrade-system-tests-23:test
> Task :streams:upgrade-system-tests-24:compileJava NO-SOURCE
> Task :streams:upgrade-system-tests-24:processResources NO-SOURCE
> Task :streams:upgrade-system-tests-24:classes UP-TO-DATE
> Task :streams:upgrade-system-tests-24:checkstyleMain NO-SOURCE
> Task :streams:upgrade-system-tests-24:compileTestJava
> Task :streams:upgrade-system-tests-24:processTestResources NO-SOURCE
> Task :streams:upgrade-system-tests-24:testClasses
> Task :streams:upgrade-system-tests-24:checkstyleTest
> Task :streams:upgrade-system-tests-24:spotbugsMain NO-SOURCE
> Task :streams:upgrade-system-tests-24:test
> Task :streams:upgrade-system-tests-25:compileJava NO-SOURCE
> Task :streams:upgrade-system-tests-25:processResources NO-SOURCE
> Task :streams:upgrade-system-tests-25:classes UP-TO-DATE
> Task :streams:upgrade-system-tests-25:checkstyleMain NO-SOURCE
> Task :streams:upgrade-system-tests-25:compileTestJava
> Task :streams:upgrade-system-tests-25:processTestResources NO-SOURCE
> Task :streams:upgrade-system-tests-25:testClasses
> Task :streams:upgrade-system-tests-25:checkstyleTest
> Task :streams:upgrade-system-tests-25:spotbugsMain NO-SOURCE
> Task :streams:upgrade-system-tests-25:test

FAILURE: Build failed with an exception.

* What went wrong:
Execution failed for task ':clients:test'.
> There were failing tests. See the report at: file://<https://builds.apache.org/job/kafka-trunk-jdk8/ws/clients/build/reports/tests/test/index.html>

* Try:
Run with --stacktrace option to get the stack trace. Run with --info or --debug option to get more log output. Run with --scan to get full insights.

* Get more help at https://help.gradle.org

Deprecated Gradle features were used in this build, making it incompatible with Gradle 7.0.
Use '--warning-mode all' to show the individual deprecation warnings.
See https://docs.gradle.org/6.4.1/userguide/command_line_interface.html#sec:command_line_warnings

BUILD FAILED in 1h 44m 15s
215 actionable tasks: 183 executed, 32 up-to-date
Build step 'Execute shell' marked build as failure
[FINDBUGS] Collecting findbugs analysis files...
Setting GRADLE_4_10_3_HOME=/home/jenkins/tools/gradle/4.10.3
[FINDBUGS] Searching for all files in <https://builds.apache.org/job/kafka-trunk-jdk8/ws/> that match the pattern **/build/reports/*bugs/*.xml
[FINDBUGS] Parsing 19 files in <https://builds.apache.org/job/kafka-trunk-jdk8/ws/>
[FINDBUGS] Successfully parsed file <https://builds.apache.org/job/kafka-trunk-jdk8/ws/clients/build/reports/spotbugs/main.xml> with 0 unique warnings and 0 duplicates.
[FINDBUGS] Successfully parsed file <https://builds.apache.org/job/kafka-trunk-jdk8/ws/connect/api/build/reports/spotbugs/main.xml> with 0 unique warnings and 0 duplicates.
[FINDBUGS] Successfully parsed file <https://builds.apache.org/job/kafka-trunk-jdk8/ws/connect/basic-auth-extension/build/reports/spotbugs/main.xml> with 0 unique warnings and 0 duplicates.
[FINDBUGS] Successfully parsed file <https://builds.apache.org/job/kafka-trunk-jdk8/ws/connect/file/build/reports/spotbugs/main.xml> with 0 unique warnings and 0 duplicates.
[FINDBUGS] Successfully parsed file <https://builds.apache.org/job/kafka-trunk-jdk8/ws/connect/json/build/reports/spotbugs/main.xml> with 0 unique warnings and 0 duplicates.
[FINDBUGS] Successfully parsed file <https://builds.apache.org/job/kafka-trunk-jdk8/ws/connect/mirror-client/build/reports/spotbugs/main.xml> with 0 unique warnings and 0 duplicates.
[FINDBUGS] Successfully parsed file <https://builds.apache.org/job/kafka-trunk-jdk8/ws/connect/mirror/build/reports/spotbugs/main.xml> with 0 unique warnings and 0 duplicates.
[FINDBUGS] Successfully parsed file <https://builds.apache.org/job/kafka-trunk-jdk8/ws/connect/runtime/build/reports/spotbugs/main.xml> with 0 unique warnings and 0 duplicates.
[FINDBUGS] Successfully parsed file <https://builds.apache.org/job/kafka-trunk-jdk8/ws/connect/transforms/build/reports/spotbugs/main.xml> with 0 unique warnings and 0 duplicates.
[FINDBUGS] Successfully parsed file <https://builds.apache.org/job/kafka-trunk-jdk8/ws/core/build/reports/spotbugs/main.xml> with 0 unique warnings and 0 duplicates.
[FINDBUGS] Successfully parsed file <https://builds.apache.org/job/kafka-trunk-jdk8/ws/examples/build/reports/spotbugs/main.xml> with 0 unique warnings and 0 duplicates.
[FINDBUGS] Successfully parsed file <https://builds.apache.org/job/kafka-trunk-jdk8/ws/generator/build/reports/spotbugs/main.xml> with 0 unique warnings and 0 duplicates.
[FINDBUGS] Successfully parsed file <https://builds.apache.org/job/kafka-trunk-jdk8/ws/jmh-benchmarks/build/reports/spotbugs/main.xml> with 0 unique warnings and 0 duplicates.
[FINDBUGS] Successfully parsed file <https://builds.apache.org/job/kafka-trunk-jdk8/ws/log4j-appender/build/reports/spotbugs/main.xml> with 0 unique warnings and 0 duplicates.
[FINDBUGS] Successfully parsed file <https://builds.apache.org/job/kafka-trunk-jdk8/ws/streams/build/reports/spotbugs/main.xml> with 0 unique warnings and 0 duplicates.
[FINDBUGS] Successfully parsed file <https://builds.apache.org/job/kafka-trunk-jdk8/ws/streams/examples/build/reports/spotbugs/main.xml> with 0 unique warnings and 0 duplicates.
[FINDBUGS] Successfully parsed file <https://builds.apache.org/job/kafka-trunk-jdk8/ws/streams/streams-scala/build/reports/spotbugs/main.xml> with 0 unique warnings and 0 duplicates.
[FINDBUGS] Successfully parsed file <https://builds.apache.org/job/kafka-trunk-jdk8/ws/streams/test-utils/build/reports/spotbugs/main.xml> with 0 unique warnings and 0 duplicates.
[FINDBUGS] Successfully parsed file <https://builds.apache.org/job/kafka-trunk-jdk8/ws/tools/build/reports/spotbugs/main.xml> with 0 unique warnings and 0 duplicates.
Setting GRADLE_4_10_3_HOME=/home/jenkins/tools/gradle/4.10.3
No credentials specified
Setting GRADLE_4_10_3_HOME=/home/jenkins/tools/gradle/4.10.3
<Git Blamer> Using GitBlamer to create author and commit information for all warnings.
<Git Blamer> GIT_COMMIT=8b22b8159673bfe22d8ac5dcd4e4312d4f2c863c, workspace=<https://builds.apache.org/job/kafka-trunk-jdk8/ws/>
[FINDBUGS] Computing warning deltas based on reference build #4594
Recording test results
Setting GRADLE_4_10_3_HOME=/home/jenkins/tools/gradle/4.10.3
Setting GRADLE_4_10_3_HOME=/home/jenkins/tools/gradle/4.10.3
Not sending mail to unregistered user noreply@github.com

Build failed in Jenkins: kafka-trunk-jdk8 #4603

Posted by Apache Jenkins Server <je...@builds.apache.org>.
See <https://builds.apache.org/job/kafka-trunk-jdk8/4603/display/redirect?page=changes>

Changes:

[github] KAFKA-10083: fix failed


------------------------------------------
[...truncated 3.13 MB...]

org.apache.kafka.streams.TestTopicsTest > testValue STARTED

org.apache.kafka.streams.TestTopicsTest > testValue PASSED

org.apache.kafka.streams.TestTopicsTest > testTimestampAutoAdvance STARTED

org.apache.kafka.streams.TestTopicsTest > testTimestampAutoAdvance PASSED

org.apache.kafka.streams.TestTopicsTest > testOutputWrongSerde STARTED

org.apache.kafka.streams.TestTopicsTest > testOutputWrongSerde PASSED

org.apache.kafka.streams.TestTopicsTest > shouldNotAllowToCreateOutputTopicWithNullTopicName STARTED

org.apache.kafka.streams.TestTopicsTest > shouldNotAllowToCreateOutputTopicWithNullTopicName PASSED

org.apache.kafka.streams.TestTopicsTest > testWrongSerde STARTED

org.apache.kafka.streams.TestTopicsTest > testWrongSerde PASSED

org.apache.kafka.streams.TestTopicsTest > testKeyValuesToMapWithNull STARTED

org.apache.kafka.streams.TestTopicsTest > testKeyValuesToMapWithNull PASSED

org.apache.kafka.streams.TestTopicsTest > testNonExistingOutputTopic STARTED

org.apache.kafka.streams.TestTopicsTest > testNonExistingOutputTopic PASSED

org.apache.kafka.streams.TestTopicsTest > testMultipleTopics STARTED

org.apache.kafka.streams.TestTopicsTest > testMultipleTopics PASSED

org.apache.kafka.streams.TestTopicsTest > testKeyValueList STARTED

org.apache.kafka.streams.TestTopicsTest > testKeyValueList PASSED

org.apache.kafka.streams.TestTopicsTest > shouldNotAllowToCreateOutputWithNullDriver STARTED

org.apache.kafka.streams.TestTopicsTest > shouldNotAllowToCreateOutputWithNullDriver PASSED

org.apache.kafka.streams.TestTopicsTest > testValueList STARTED

org.apache.kafka.streams.TestTopicsTest > testValueList PASSED

org.apache.kafka.streams.TestTopicsTest > testRecordList STARTED

org.apache.kafka.streams.TestTopicsTest > testRecordList PASSED

org.apache.kafka.streams.TestTopicsTest > testNonExistingInputTopic STARTED

org.apache.kafka.streams.TestTopicsTest > testNonExistingInputTopic PASSED

org.apache.kafka.streams.TestTopicsTest > testKeyValuesToMap STARTED

org.apache.kafka.streams.TestTopicsTest > testKeyValuesToMap PASSED

org.apache.kafka.streams.TestTopicsTest > testRecordsToList STARTED

org.apache.kafka.streams.TestTopicsTest > testRecordsToList PASSED

org.apache.kafka.streams.TestTopicsTest > testKeyValueListDuration STARTED

org.apache.kafka.streams.TestTopicsTest > testKeyValueListDuration PASSED

org.apache.kafka.streams.TestTopicsTest > testInputToString STARTED

org.apache.kafka.streams.TestTopicsTest > testInputToString PASSED

org.apache.kafka.streams.TestTopicsTest > testTimestamp STARTED

org.apache.kafka.streams.TestTopicsTest > testTimestamp PASSED

org.apache.kafka.streams.TestTopicsTest > testWithHeaders STARTED

org.apache.kafka.streams.TestTopicsTest > testWithHeaders PASSED

org.apache.kafka.streams.TestTopicsTest > testKeyValue STARTED

org.apache.kafka.streams.TestTopicsTest > testKeyValue PASSED

org.apache.kafka.streams.TestTopicsTest > shouldNotAllowToCreateTopicWithNullTopicName STARTED

org.apache.kafka.streams.TestTopicsTest > shouldNotAllowToCreateTopicWithNullTopicName PASSED

> Task :streams:upgrade-system-tests-0100:spotbugsMain NO-SOURCE
> Task :streams:upgrade-system-tests-0100:test
> Task :streams:upgrade-system-tests-0101:compileJava NO-SOURCE
> Task :streams:upgrade-system-tests-0101:processResources NO-SOURCE
> Task :streams:upgrade-system-tests-0101:classes UP-TO-DATE
> Task :streams:upgrade-system-tests-0101:checkstyleMain NO-SOURCE
> Task :streams:upgrade-system-tests-0101:compileTestJava
> Task :streams:upgrade-system-tests-0101:processTestResources NO-SOURCE
> Task :streams:upgrade-system-tests-0101:testClasses
> Task :streams:upgrade-system-tests-0101:checkstyleTest
> Task :streams:upgrade-system-tests-0101:spotbugsMain NO-SOURCE
> Task :streams:upgrade-system-tests-0101:test
> Task :streams:upgrade-system-tests-0102:compileJava NO-SOURCE
> Task :streams:upgrade-system-tests-0102:processResources NO-SOURCE
> Task :streams:upgrade-system-tests-0102:classes UP-TO-DATE
> Task :streams:upgrade-system-tests-0102:checkstyleMain NO-SOURCE
> Task :streams:upgrade-system-tests-0102:compileTestJava
> Task :streams:upgrade-system-tests-0102:processTestResources NO-SOURCE
> Task :streams:upgrade-system-tests-0102:testClasses
> Task :streams:upgrade-system-tests-0102:checkstyleTest
> Task :streams:upgrade-system-tests-0102:spotbugsMain NO-SOURCE
> Task :streams:upgrade-system-tests-0102:test
> Task :streams:upgrade-system-tests-0110:compileJava NO-SOURCE
> Task :streams:upgrade-system-tests-0110:processResources NO-SOURCE
> Task :streams:upgrade-system-tests-0110:classes UP-TO-DATE
> Task :streams:upgrade-system-tests-0110:checkstyleMain NO-SOURCE
> Task :streams:upgrade-system-tests-0110:compileTestJava
> Task :streams:upgrade-system-tests-0110:processTestResources NO-SOURCE
> Task :streams:upgrade-system-tests-0110:testClasses
> Task :streams:upgrade-system-tests-0110:checkstyleTest
> Task :streams:upgrade-system-tests-0110:spotbugsMain NO-SOURCE
> Task :streams:upgrade-system-tests-0110:test
> Task :streams:upgrade-system-tests-10:compileJava NO-SOURCE
> Task :streams:upgrade-system-tests-10:processResources NO-SOURCE
> Task :streams:upgrade-system-tests-10:classes UP-TO-DATE
> Task :streams:upgrade-system-tests-10:checkstyleMain NO-SOURCE
> Task :streams:upgrade-system-tests-10:compileTestJava
> Task :streams:upgrade-system-tests-10:processTestResources NO-SOURCE
> Task :streams:upgrade-system-tests-10:testClasses
> Task :streams:upgrade-system-tests-10:checkstyleTest
> Task :streams:upgrade-system-tests-10:spotbugsMain NO-SOURCE
> Task :streams:upgrade-system-tests-10:test
> Task :streams:upgrade-system-tests-11:compileJava NO-SOURCE
> Task :streams:upgrade-system-tests-11:processResources NO-SOURCE
> Task :streams:upgrade-system-tests-11:classes UP-TO-DATE
> Task :streams:upgrade-system-tests-11:checkstyleMain NO-SOURCE
> Task :streams:upgrade-system-tests-11:compileTestJava
> Task :streams:upgrade-system-tests-11:processTestResources NO-SOURCE
> Task :streams:upgrade-system-tests-11:testClasses
> Task :streams:upgrade-system-tests-11:checkstyleTest
> Task :streams:upgrade-system-tests-11:spotbugsMain NO-SOURCE
> Task :streams:upgrade-system-tests-11:test
> Task :streams:upgrade-system-tests-20:compileJava NO-SOURCE
> Task :streams:upgrade-system-tests-20:processResources NO-SOURCE
> Task :streams:upgrade-system-tests-20:classes UP-TO-DATE
> Task :streams:upgrade-system-tests-20:checkstyleMain NO-SOURCE
> Task :streams:upgrade-system-tests-20:compileTestJava
> Task :streams:upgrade-system-tests-20:processTestResources NO-SOURCE
> Task :streams:upgrade-system-tests-20:testClasses
> Task :streams:upgrade-system-tests-20:checkstyleTest
> Task :streams:upgrade-system-tests-20:spotbugsMain NO-SOURCE
> Task :streams:upgrade-system-tests-20:test
> Task :streams:upgrade-system-tests-21:compileJava NO-SOURCE
> Task :streams:upgrade-system-tests-21:processResources NO-SOURCE
> Task :streams:upgrade-system-tests-21:classes UP-TO-DATE
> Task :streams:upgrade-system-tests-21:checkstyleMain NO-SOURCE
> Task :streams:upgrade-system-tests-21:compileTestJava
> Task :streams:upgrade-system-tests-21:processTestResources NO-SOURCE
> Task :streams:upgrade-system-tests-21:testClasses
> Task :streams:upgrade-system-tests-21:checkstyleTest
> Task :streams:upgrade-system-tests-21:spotbugsMain NO-SOURCE
> Task :streams:upgrade-system-tests-21:test
> Task :streams:upgrade-system-tests-22:compileJava NO-SOURCE
> Task :streams:upgrade-system-tests-22:processResources NO-SOURCE
> Task :streams:upgrade-system-tests-22:classes UP-TO-DATE
> Task :streams:upgrade-system-tests-22:checkstyleMain NO-SOURCE
> Task :streams:upgrade-system-tests-22:compileTestJava
> Task :streams:upgrade-system-tests-22:processTestResources NO-SOURCE
> Task :streams:upgrade-system-tests-22:testClasses
> Task :streams:upgrade-system-tests-22:checkstyleTest
> Task :streams:upgrade-system-tests-22:spotbugsMain NO-SOURCE
> Task :streams:upgrade-system-tests-22:test
> Task :streams:upgrade-system-tests-23:compileJava NO-SOURCE
> Task :streams:upgrade-system-tests-23:processResources NO-SOURCE
> Task :streams:upgrade-system-tests-23:classes UP-TO-DATE
> Task :streams:upgrade-system-tests-23:checkstyleMain NO-SOURCE
> Task :streams:upgrade-system-tests-23:compileTestJava
> Task :streams:upgrade-system-tests-23:processTestResources NO-SOURCE
> Task :streams:upgrade-system-tests-23:testClasses
> Task :streams:upgrade-system-tests-23:checkstyleTest
> Task :streams:upgrade-system-tests-23:spotbugsMain NO-SOURCE
> Task :streams:upgrade-system-tests-23:test
> Task :streams:upgrade-system-tests-24:compileJava NO-SOURCE
> Task :streams:upgrade-system-tests-24:processResources NO-SOURCE
> Task :streams:upgrade-system-tests-24:classes UP-TO-DATE
> Task :streams:upgrade-system-tests-24:checkstyleMain NO-SOURCE
> Task :streams:upgrade-system-tests-24:compileTestJava
> Task :streams:upgrade-system-tests-24:processTestResources NO-SOURCE
> Task :streams:upgrade-system-tests-24:testClasses
> Task :streams:upgrade-system-tests-24:checkstyleTest
> Task :streams:upgrade-system-tests-24:spotbugsMain NO-SOURCE
> Task :streams:upgrade-system-tests-24:test
> Task :streams:upgrade-system-tests-25:compileJava NO-SOURCE
> Task :streams:upgrade-system-tests-25:processResources NO-SOURCE
> Task :streams:upgrade-system-tests-25:classes UP-TO-DATE
> Task :streams:upgrade-system-tests-25:checkstyleMain NO-SOURCE
> Task :streams:upgrade-system-tests-25:compileTestJava
> Task :streams:upgrade-system-tests-25:processTestResources NO-SOURCE
> Task :streams:upgrade-system-tests-25:testClasses
> Task :streams:upgrade-system-tests-25:checkstyleTest
> Task :streams:upgrade-system-tests-25:spotbugsMain NO-SOURCE
> Task :streams:upgrade-system-tests-25:test

FAILURE: Build failed with an exception.

* What went wrong:
Execution failed for task ':connect:mirror:test'.
> There were failing tests. See the report at: file://<https://builds.apache.org/job/kafka-trunk-jdk8/ws/connect/mirror/build/reports/tests/test/index.html>

* Try:
Run with --stacktrace option to get the stack trace. Run with --info or --debug option to get more log output. Run with --scan to get full insights.

* Get more help at https://help.gradle.org

Deprecated Gradle features were used in this build, making it incompatible with Gradle 7.0.
Use '--warning-mode all' to show the individual deprecation warnings.
See https://docs.gradle.org/6.4.1/userguide/command_line_interface.html#sec:command_line_warnings

BUILD FAILED in 1h 44m 48s
215 actionable tasks: 183 executed, 32 up-to-date
Build step 'Execute shell' marked build as failure
[FINDBUGS] Collecting findbugs analysis files...
Setting GRADLE_4_10_3_HOME=/home/jenkins/tools/gradle/4.10.3
[FINDBUGS] Searching for all files in <https://builds.apache.org/job/kafka-trunk-jdk8/ws/> that match the pattern **/build/reports/*bugs/*.xml
[FINDBUGS] Parsing 19 files in <https://builds.apache.org/job/kafka-trunk-jdk8/ws/>
[FINDBUGS] Successfully parsed file <https://builds.apache.org/job/kafka-trunk-jdk8/ws/clients/build/reports/spotbugs/main.xml> with 0 unique warnings and 0 duplicates.
[FINDBUGS] Successfully parsed file <https://builds.apache.org/job/kafka-trunk-jdk8/ws/connect/api/build/reports/spotbugs/main.xml> with 0 unique warnings and 0 duplicates.
[FINDBUGS] Successfully parsed file <https://builds.apache.org/job/kafka-trunk-jdk8/ws/connect/basic-auth-extension/build/reports/spotbugs/main.xml> with 0 unique warnings and 0 duplicates.
[FINDBUGS] Successfully parsed file <https://builds.apache.org/job/kafka-trunk-jdk8/ws/connect/file/build/reports/spotbugs/main.xml> with 0 unique warnings and 0 duplicates.
[FINDBUGS] Successfully parsed file <https://builds.apache.org/job/kafka-trunk-jdk8/ws/connect/json/build/reports/spotbugs/main.xml> with 0 unique warnings and 0 duplicates.
[FINDBUGS] Successfully parsed file <https://builds.apache.org/job/kafka-trunk-jdk8/ws/connect/mirror-client/build/reports/spotbugs/main.xml> with 0 unique warnings and 0 duplicates.
[FINDBUGS] Successfully parsed file <https://builds.apache.org/job/kafka-trunk-jdk8/ws/connect/mirror/build/reports/spotbugs/main.xml> with 0 unique warnings and 0 duplicates.
[FINDBUGS] Successfully parsed file <https://builds.apache.org/job/kafka-trunk-jdk8/ws/connect/runtime/build/reports/spotbugs/main.xml> with 0 unique warnings and 0 duplicates.
[FINDBUGS] Successfully parsed file <https://builds.apache.org/job/kafka-trunk-jdk8/ws/connect/transforms/build/reports/spotbugs/main.xml> with 0 unique warnings and 0 duplicates.
[FINDBUGS] Successfully parsed file <https://builds.apache.org/job/kafka-trunk-jdk8/ws/core/build/reports/spotbugs/main.xml> with 0 unique warnings and 0 duplicates.
[FINDBUGS] Successfully parsed file <https://builds.apache.org/job/kafka-trunk-jdk8/ws/examples/build/reports/spotbugs/main.xml> with 0 unique warnings and 0 duplicates.
[FINDBUGS] Successfully parsed file <https://builds.apache.org/job/kafka-trunk-jdk8/ws/generator/build/reports/spotbugs/main.xml> with 0 unique warnings and 0 duplicates.
[FINDBUGS] Successfully parsed file <https://builds.apache.org/job/kafka-trunk-jdk8/ws/jmh-benchmarks/build/reports/spotbugs/main.xml> with 0 unique warnings and 0 duplicates.
[FINDBUGS] Successfully parsed file <https://builds.apache.org/job/kafka-trunk-jdk8/ws/log4j-appender/build/reports/spotbugs/main.xml> with 0 unique warnings and 0 duplicates.
[FINDBUGS] Successfully parsed file <https://builds.apache.org/job/kafka-trunk-jdk8/ws/streams/build/reports/spotbugs/main.xml> with 0 unique warnings and 0 duplicates.
[FINDBUGS] Successfully parsed file <https://builds.apache.org/job/kafka-trunk-jdk8/ws/streams/examples/build/reports/spotbugs/main.xml> with 0 unique warnings and 0 duplicates.
[FINDBUGS] Successfully parsed file <https://builds.apache.org/job/kafka-trunk-jdk8/ws/streams/streams-scala/build/reports/spotbugs/main.xml> with 0 unique warnings and 0 duplicates.
[FINDBUGS] Successfully parsed file <https://builds.apache.org/job/kafka-trunk-jdk8/ws/streams/test-utils/build/reports/spotbugs/main.xml> with 0 unique warnings and 0 duplicates.
[FINDBUGS] Successfully parsed file <https://builds.apache.org/job/kafka-trunk-jdk8/ws/tools/build/reports/spotbugs/main.xml> with 0 unique warnings and 0 duplicates.
Setting GRADLE_4_10_3_HOME=/home/jenkins/tools/gradle/4.10.3
No credentials specified
Setting GRADLE_4_10_3_HOME=/home/jenkins/tools/gradle/4.10.3
<Git Blamer> Using GitBlamer to create author and commit information for all warnings.
<Git Blamer> GIT_COMMIT=35a0692ce1ac456ce8155afc1f0838f4895140ab, workspace=<https://builds.apache.org/job/kafka-trunk-jdk8/ws/>
[FINDBUGS] Computing warning deltas based on reference build #4594
Recording test results
Setting GRADLE_4_10_3_HOME=/home/jenkins/tools/gradle/4.10.3
Setting GRADLE_4_10_3_HOME=/home/jenkins/tools/gradle/4.10.3
Not sending mail to unregistered user noreply@github.com

Build failed in Jenkins: kafka-trunk-jdk8 #4602

Posted by Apache Jenkins Server <je...@builds.apache.org>.
See <https://builds.apache.org/job/kafka-trunk-jdk8/4602/display/redirect?page=changes>

Changes:

[github] KAFKA-9945: TopicCommand should support --if-exists and --if-not-exists


------------------------------------------
[...truncated 3.13 MB...]

org.apache.kafka.streams.test.ConsumerRecordFactoryTest > shouldCreateConsumerRecordsFromKeyValuePairs PASSED

org.apache.kafka.streams.test.ConsumerRecordFactoryTest > shouldNotAllowToCreateTopicWithNullTopicNameWithNullKeyAndDefaultTimestamp STARTED

org.apache.kafka.streams.test.ConsumerRecordFactoryTest > shouldNotAllowToCreateTopicWithNullTopicNameWithNullKeyAndDefaultTimestamp PASSED

org.apache.kafka.streams.test.ConsumerRecordFactoryTest > shouldRequireCustomTopicNameIfNotDefaultFactoryTopicNameWithDefaultTimestamp STARTED

org.apache.kafka.streams.test.ConsumerRecordFactoryTest > shouldRequireCustomTopicNameIfNotDefaultFactoryTopicNameWithDefaultTimestamp PASSED

org.apache.kafka.streams.test.ConsumerRecordFactoryTest > shouldNotAllowToCreateTopicWithNullTopicNameWithNullKey STARTED

org.apache.kafka.streams.test.ConsumerRecordFactoryTest > shouldNotAllowToCreateTopicWithNullTopicNameWithNullKey PASSED

org.apache.kafka.streams.test.ConsumerRecordFactoryTest > shouldCreateNullKeyConsumerRecordWithOtherTopicNameAndTimestampWithTimetamp STARTED

org.apache.kafka.streams.test.ConsumerRecordFactoryTest > shouldCreateNullKeyConsumerRecordWithOtherTopicNameAndTimestampWithTimetamp PASSED

org.apache.kafka.streams.test.ConsumerRecordFactoryTest > shouldCreateConsumerRecordWithTimestamp STARTED

org.apache.kafka.streams.test.ConsumerRecordFactoryTest > shouldCreateConsumerRecordWithTimestamp PASSED

org.apache.kafka.streams.test.ConsumerRecordFactoryTest > shouldNotAllowToCreateTopicWithNullHeaders STARTED

org.apache.kafka.streams.test.ConsumerRecordFactoryTest > shouldNotAllowToCreateTopicWithNullHeaders PASSED

org.apache.kafka.streams.test.ConsumerRecordFactoryTest > shouldNotAllowToCreateTopicWithNullTopicNameWithDefaultTimestamp STARTED

org.apache.kafka.streams.test.ConsumerRecordFactoryTest > shouldNotAllowToCreateTopicWithNullTopicNameWithDefaultTimestamp PASSED

org.apache.kafka.streams.test.ConsumerRecordFactoryTest > shouldRequireCustomTopicNameIfNotDefaultFactoryTopicName STARTED

org.apache.kafka.streams.test.ConsumerRecordFactoryTest > shouldRequireCustomTopicNameIfNotDefaultFactoryTopicName PASSED

org.apache.kafka.streams.test.ConsumerRecordFactoryTest > shouldRequireCustomTopicNameIfNotDefaultFactoryTopicNameWithNullKey STARTED

org.apache.kafka.streams.test.ConsumerRecordFactoryTest > shouldRequireCustomTopicNameIfNotDefaultFactoryTopicNameWithNullKey PASSED

org.apache.kafka.streams.test.ConsumerRecordFactoryTest > shouldCreateConsumerRecord STARTED

org.apache.kafka.streams.test.ConsumerRecordFactoryTest > shouldCreateConsumerRecord PASSED

org.apache.kafka.streams.test.ConsumerRecordFactoryTest > shouldCreateNullKeyConsumerRecord STARTED

org.apache.kafka.streams.test.ConsumerRecordFactoryTest > shouldCreateNullKeyConsumerRecord PASSED

org.apache.kafka.streams.test.ConsumerRecordFactoryTest > shouldCreateConsumerRecordWithOtherTopicName STARTED

org.apache.kafka.streams.test.ConsumerRecordFactoryTest > shouldCreateConsumerRecordWithOtherTopicName PASSED

org.apache.kafka.streams.test.ConsumerRecordFactoryTest > shouldAdvanceTime STARTED

org.apache.kafka.streams.test.ConsumerRecordFactoryTest > shouldAdvanceTime PASSED

org.apache.kafka.streams.test.ConsumerRecordFactoryTest > shouldNotAllowToCreateTopicWithNullTopicNameWithKeyValuePairs STARTED

org.apache.kafka.streams.test.ConsumerRecordFactoryTest > shouldNotAllowToCreateTopicWithNullTopicNameWithKeyValuePairs PASSED

org.apache.kafka.streams.test.ConsumerRecordFactoryTest > shouldRequireCustomTopicNameIfNotDefaultFactoryTopicNameWithKeyValuePairsAndCustomTimestamps STARTED

org.apache.kafka.streams.test.ConsumerRecordFactoryTest > shouldRequireCustomTopicNameIfNotDefaultFactoryTopicNameWithKeyValuePairsAndCustomTimestamps PASSED

org.apache.kafka.streams.test.ConsumerRecordFactoryTest > shouldRequireCustomTopicNameIfNotDefaultFactoryTopicNameWithKeyValuePairs STARTED

org.apache.kafka.streams.test.ConsumerRecordFactoryTest > shouldRequireCustomTopicNameIfNotDefaultFactoryTopicNameWithKeyValuePairs PASSED

org.apache.kafka.streams.test.ConsumerRecordFactoryTest > shouldCreateConsumerRecordWithOtherTopicNameAndTimestamp STARTED

org.apache.kafka.streams.test.ConsumerRecordFactoryTest > shouldCreateConsumerRecordWithOtherTopicNameAndTimestamp PASSED

org.apache.kafka.streams.test.ConsumerRecordFactoryTest > shouldNotAllowToCreateTopicWithNullTopicNameWithKeyValuePairsAndCustomTimestamps STARTED

org.apache.kafka.streams.test.ConsumerRecordFactoryTest > shouldNotAllowToCreateTopicWithNullTopicNameWithKeyValuePairsAndCustomTimestamps PASSED

org.apache.kafka.streams.test.ConsumerRecordFactoryTest > shouldNotAllowToCreateTopicWithNullTopicName STARTED

org.apache.kafka.streams.test.ConsumerRecordFactoryTest > shouldNotAllowToCreateTopicWithNullTopicName PASSED

org.apache.kafka.streams.test.ConsumerRecordFactoryTest > shouldCreateConsumerRecordsFromKeyValuePairsWithCustomTimestampAndIncrementsAndNotAdvanceTime STARTED

org.apache.kafka.streams.test.ConsumerRecordFactoryTest > shouldCreateConsumerRecordsFromKeyValuePairsWithCustomTimestampAndIncrementsAndNotAdvanceTime PASSED

org.apache.kafka.streams.test.ConsumerRecordFactoryTest > shouldCreateNullKeyConsumerRecordWithTimestampWithTimestamp STARTED

org.apache.kafka.streams.test.ConsumerRecordFactoryTest > shouldCreateNullKeyConsumerRecordWithTimestampWithTimestamp PASSED

org.apache.kafka.streams.test.ConsumerRecordFactoryTest > shouldRequireCustomTopicNameIfNotDefaultFactoryTopicNameWithNullKeyAndDefaultTimestamp STARTED

org.apache.kafka.streams.test.ConsumerRecordFactoryTest > shouldRequireCustomTopicNameIfNotDefaultFactoryTopicNameWithNullKeyAndDefaultTimestamp PASSED

org.apache.kafka.streams.test.ConsumerRecordFactoryTest > shouldCreateConsumerRecordsFromKeyValuePairsWithTimestampAndIncrements STARTED

org.apache.kafka.streams.test.ConsumerRecordFactoryTest > shouldCreateConsumerRecordsFromKeyValuePairsWithTimestampAndIncrements PASSED

org.apache.kafka.streams.internals.WindowStoreFacadeTest > shouldReturnIsOpen STARTED

org.apache.kafka.streams.internals.WindowStoreFacadeTest > shouldReturnIsOpen PASSED

org.apache.kafka.streams.internals.WindowStoreFacadeTest > shouldReturnName STARTED

org.apache.kafka.streams.internals.WindowStoreFacadeTest > shouldReturnName PASSED

org.apache.kafka.streams.internals.WindowStoreFacadeTest > shouldPutWithUnknownTimestamp STARTED

org.apache.kafka.streams.internals.WindowStoreFacadeTest > shouldPutWithUnknownTimestamp PASSED

org.apache.kafka.streams.internals.WindowStoreFacadeTest > shouldPutWindowStartTimestampWithUnknownTimestamp STARTED

org.apache.kafka.streams.internals.WindowStoreFacadeTest > shouldPutWindowStartTimestampWithUnknownTimestamp PASSED

org.apache.kafka.streams.internals.WindowStoreFacadeTest > shouldReturnIsPersistent STARTED

org.apache.kafka.streams.internals.WindowStoreFacadeTest > shouldReturnIsPersistent PASSED

org.apache.kafka.streams.internals.WindowStoreFacadeTest > shouldForwardClose STARTED

org.apache.kafka.streams.internals.WindowStoreFacadeTest > shouldForwardClose PASSED

org.apache.kafka.streams.internals.WindowStoreFacadeTest > shouldForwardFlush STARTED

org.apache.kafka.streams.internals.WindowStoreFacadeTest > shouldForwardFlush PASSED

org.apache.kafka.streams.internals.WindowStoreFacadeTest > shouldForwardInit STARTED

org.apache.kafka.streams.internals.WindowStoreFacadeTest > shouldForwardInit PASSED

> Task :streams:upgrade-system-tests-11:compileJava NO-SOURCE
> Task :streams:upgrade-system-tests-11:processResources NO-SOURCE
> Task :streams:upgrade-system-tests-11:classes UP-TO-DATE
> Task :streams:upgrade-system-tests-11:checkstyleMain NO-SOURCE
> Task :streams:upgrade-system-tests-11:compileTestJava
> Task :streams:upgrade-system-tests-11:processTestResources NO-SOURCE
> Task :streams:upgrade-system-tests-11:testClasses
> Task :streams:upgrade-system-tests-11:checkstyleTest
> Task :streams:upgrade-system-tests-11:spotbugsMain NO-SOURCE
> Task :streams:upgrade-system-tests-11:test
> Task :streams:upgrade-system-tests-20:compileJava NO-SOURCE
> Task :streams:upgrade-system-tests-20:processResources NO-SOURCE
> Task :streams:upgrade-system-tests-20:classes UP-TO-DATE
> Task :streams:upgrade-system-tests-20:checkstyleMain NO-SOURCE
> Task :streams:upgrade-system-tests-20:compileTestJava
> Task :streams:upgrade-system-tests-20:processTestResources NO-SOURCE
> Task :streams:upgrade-system-tests-20:testClasses
> Task :streams:upgrade-system-tests-20:checkstyleTest
> Task :streams:upgrade-system-tests-20:spotbugsMain NO-SOURCE
> Task :streams:upgrade-system-tests-20:test
> Task :streams:upgrade-system-tests-21:compileJava NO-SOURCE
> Task :streams:upgrade-system-tests-21:processResources NO-SOURCE
> Task :streams:upgrade-system-tests-21:classes UP-TO-DATE
> Task :streams:upgrade-system-tests-21:checkstyleMain NO-SOURCE
> Task :streams:upgrade-system-tests-21:compileTestJava
> Task :streams:upgrade-system-tests-21:processTestResources NO-SOURCE
> Task :streams:upgrade-system-tests-21:testClasses
> Task :streams:upgrade-system-tests-21:checkstyleTest
> Task :streams:upgrade-system-tests-21:spotbugsMain NO-SOURCE
> Task :streams:upgrade-system-tests-21:test
> Task :streams:upgrade-system-tests-22:compileJava NO-SOURCE
> Task :streams:upgrade-system-tests-22:processResources NO-SOURCE
> Task :streams:upgrade-system-tests-22:classes UP-TO-DATE
> Task :streams:upgrade-system-tests-22:checkstyleMain NO-SOURCE
> Task :streams:upgrade-system-tests-22:compileTestJava
> Task :streams:upgrade-system-tests-22:processTestResources NO-SOURCE
> Task :streams:upgrade-system-tests-22:testClasses
> Task :streams:upgrade-system-tests-22:checkstyleTest
> Task :streams:upgrade-system-tests-22:spotbugsMain NO-SOURCE
> Task :streams:upgrade-system-tests-22:test
> Task :streams:upgrade-system-tests-23:compileJava NO-SOURCE
> Task :streams:upgrade-system-tests-23:processResources NO-SOURCE
> Task :streams:upgrade-system-tests-23:classes UP-TO-DATE
> Task :streams:upgrade-system-tests-23:checkstyleMain NO-SOURCE
> Task :streams:upgrade-system-tests-23:compileTestJava
> Task :streams:upgrade-system-tests-23:processTestResources NO-SOURCE
> Task :streams:upgrade-system-tests-23:testClasses
> Task :streams:upgrade-system-tests-23:checkstyleTest
> Task :streams:upgrade-system-tests-23:spotbugsMain NO-SOURCE
> Task :streams:upgrade-system-tests-23:test
> Task :streams:upgrade-system-tests-24:compileJava NO-SOURCE
> Task :streams:upgrade-system-tests-24:processResources NO-SOURCE
> Task :streams:upgrade-system-tests-24:classes UP-TO-DATE
> Task :streams:upgrade-system-tests-24:checkstyleMain NO-SOURCE
> Task :streams:upgrade-system-tests-24:compileTestJava
> Task :streams:upgrade-system-tests-24:processTestResources NO-SOURCE
> Task :streams:upgrade-system-tests-24:testClasses
> Task :streams:upgrade-system-tests-24:checkstyleTest
> Task :streams:upgrade-system-tests-24:spotbugsMain NO-SOURCE
> Task :streams:upgrade-system-tests-24:test
> Task :streams:upgrade-system-tests-25:compileJava NO-SOURCE
> Task :streams:upgrade-system-tests-25:processResources NO-SOURCE
> Task :streams:upgrade-system-tests-25:classes UP-TO-DATE
> Task :streams:upgrade-system-tests-25:checkstyleMain NO-SOURCE
> Task :streams:upgrade-system-tests-25:compileTestJava
> Task :streams:upgrade-system-tests-25:processTestResources NO-SOURCE
> Task :streams:upgrade-system-tests-25:testClasses
> Task :streams:upgrade-system-tests-25:checkstyleTest
> Task :streams:upgrade-system-tests-25:spotbugsMain NO-SOURCE
> Task :streams:upgrade-system-tests-25:test

FAILURE: Build failed with an exception.

* What went wrong:
Execution failed for task ':clients:test'.
> There were failing tests. See the report at: file://<https://builds.apache.org/job/kafka-trunk-jdk8/ws/clients/build/reports/tests/test/index.html>

* Try:
Run with --stacktrace option to get the stack trace. Run with --info or --debug option to get more log output. Run with --scan to get full insights.

* Get more help at https://help.gradle.org

Deprecated Gradle features were used in this build, making it incompatible with Gradle 7.0.
Use '--warning-mode all' to show the individual deprecation warnings.
See https://docs.gradle.org/6.4.1/userguide/command_line_interface.html#sec:command_line_warnings

BUILD FAILED in 1h 50m 43s
215 actionable tasks: 183 executed, 32 up-to-date
Build step 'Execute shell' marked build as failure
[FINDBUGS] Collecting findbugs analysis files...
Setting GRADLE_4_10_3_HOME=/home/jenkins/tools/gradle/4.10.3
[FINDBUGS] Searching for all files in <https://builds.apache.org/job/kafka-trunk-jdk8/ws/> that match the pattern **/build/reports/*bugs/*.xml
[FINDBUGS] Parsing 19 files in <https://builds.apache.org/job/kafka-trunk-jdk8/ws/>
[FINDBUGS] Successfully parsed file <https://builds.apache.org/job/kafka-trunk-jdk8/ws/clients/build/reports/spotbugs/main.xml> with 0 unique warnings and 0 duplicates.
[FINDBUGS] Successfully parsed file <https://builds.apache.org/job/kafka-trunk-jdk8/ws/connect/api/build/reports/spotbugs/main.xml> with 0 unique warnings and 0 duplicates.
[FINDBUGS] Successfully parsed file <https://builds.apache.org/job/kafka-trunk-jdk8/ws/connect/basic-auth-extension/build/reports/spotbugs/main.xml> with 0 unique warnings and 0 duplicates.
[FINDBUGS] Successfully parsed file <https://builds.apache.org/job/kafka-trunk-jdk8/ws/connect/file/build/reports/spotbugs/main.xml> with 0 unique warnings and 0 duplicates.
[FINDBUGS] Successfully parsed file <https://builds.apache.org/job/kafka-trunk-jdk8/ws/connect/json/build/reports/spotbugs/main.xml> with 0 unique warnings and 0 duplicates.
[FINDBUGS] Successfully parsed file <https://builds.apache.org/job/kafka-trunk-jdk8/ws/connect/mirror-client/build/reports/spotbugs/main.xml> with 0 unique warnings and 0 duplicates.
[FINDBUGS] Successfully parsed file <https://builds.apache.org/job/kafka-trunk-jdk8/ws/connect/mirror/build/reports/spotbugs/main.xml> with 0 unique warnings and 0 duplicates.
[FINDBUGS] Successfully parsed file <https://builds.apache.org/job/kafka-trunk-jdk8/ws/connect/runtime/build/reports/spotbugs/main.xml> with 0 unique warnings and 0 duplicates.
[FINDBUGS] Successfully parsed file <https://builds.apache.org/job/kafka-trunk-jdk8/ws/connect/transforms/build/reports/spotbugs/main.xml> with 0 unique warnings and 0 duplicates.
[FINDBUGS] Successfully parsed file <https://builds.apache.org/job/kafka-trunk-jdk8/ws/core/build/reports/spotbugs/main.xml> with 0 unique warnings and 0 duplicates.
[FINDBUGS] Successfully parsed file <https://builds.apache.org/job/kafka-trunk-jdk8/ws/examples/build/reports/spotbugs/main.xml> with 0 unique warnings and 0 duplicates.
[FINDBUGS] Successfully parsed file <https://builds.apache.org/job/kafka-trunk-jdk8/ws/generator/build/reports/spotbugs/main.xml> with 0 unique warnings and 0 duplicates.
[FINDBUGS] Successfully parsed file <https://builds.apache.org/job/kafka-trunk-jdk8/ws/jmh-benchmarks/build/reports/spotbugs/main.xml> with 0 unique warnings and 0 duplicates.
[FINDBUGS] Successfully parsed file <https://builds.apache.org/job/kafka-trunk-jdk8/ws/log4j-appender/build/reports/spotbugs/main.xml> with 0 unique warnings and 0 duplicates.
[FINDBUGS] Successfully parsed file <https://builds.apache.org/job/kafka-trunk-jdk8/ws/streams/build/reports/spotbugs/main.xml> with 0 unique warnings and 0 duplicates.
[FINDBUGS] Successfully parsed file <https://builds.apache.org/job/kafka-trunk-jdk8/ws/streams/examples/build/reports/spotbugs/main.xml> with 0 unique warnings and 0 duplicates.
[FINDBUGS] Successfully parsed file <https://builds.apache.org/job/kafka-trunk-jdk8/ws/streams/streams-scala/build/reports/spotbugs/main.xml> with 0 unique warnings and 0 duplicates.
[FINDBUGS] Successfully parsed file <https://builds.apache.org/job/kafka-trunk-jdk8/ws/streams/test-utils/build/reports/spotbugs/main.xml> with 0 unique warnings and 0 duplicates.
[FINDBUGS] Successfully parsed file <https://builds.apache.org/job/kafka-trunk-jdk8/ws/tools/build/reports/spotbugs/main.xml> with 0 unique warnings and 0 duplicates.
Setting GRADLE_4_10_3_HOME=/home/jenkins/tools/gradle/4.10.3
No credentials specified
Setting GRADLE_4_10_3_HOME=/home/jenkins/tools/gradle/4.10.3
<Git Blamer> Using GitBlamer to create author and commit information for all warnings.
<Git Blamer> GIT_COMMIT=ea6d373a93205bad41b42ad9a2b2bec717c11c93, workspace=<https://builds.apache.org/job/kafka-trunk-jdk8/ws/>
[FINDBUGS] Computing warning deltas based on reference build #4594
Recording test results
Setting GRADLE_4_10_3_HOME=/home/jenkins/tools/gradle/4.10.3
Setting GRADLE_4_10_3_HOME=/home/jenkins/tools/gradle/4.10.3
Not sending mail to unregistered user noreply@github.com