You are viewing a plain text version of this content. The canonical link for it is here.
Posted to notifications@maven.apache.org by Apache Jenkins Server <je...@builds.apache.org> on 2018/05/03 00:10:40 UTC

Build unstable in Jenkins: Maven TLP » maven » MNG-6386 #3

See https://builds.apache.org/job/maven-box/job/maven/job/MNG-6386/3/

No changes.

2 tests failed.
FAILED:  org.apache.maven.it.MavenITmng6386BaseUriPropertyTest.testitMNG6386UnicodeChars

Error Message:
Resource not found: /mng-6386-это по-русский

Stack Trace:
java.lang.IllegalArgumentException: Resource not found: /mng-6386-это по-русский
	at org.apache.maven.it.MavenITmng6386BaseUriPropertyTest.testitMNG6386UnicodeChars(MavenITmng6386BaseUriPropertyTest.java:64)


FAILED:  org.apache.maven.it.MavenITmng6386BaseUriPropertyTest.testitMNG6386UnicodeChars

Error Message:
Resource not found: /mng-6386-это по-русский

Stack Trace:
java.lang.IllegalArgumentException: Resource not found: /mng-6386-это по-русский
	at org.apache.maven.it.MavenITmng6386BaseUriPropertyTest.testitMNG6386UnicodeChars(MavenITmng6386BaseUriPropertyTest.java:64)




Build log:
[...truncated 6.50 MB...]
[linuxJava8] None of the test reports contained any result
[linuxJava8] [withMaven] junitPublisher - Archive test results for Maven artifact org.apache.maven.its.plugins:maven-it-plugin-extension-consumer:2.1-SNAPSHOT generated by maven-surefire-plugin:test (default-test): core-it-support/core-it-plugins/maven-it-plugin-extension-consumer/target/surefire-reports/*.xml
[linuxJava8] Recording test results
[linuxJava8] None of the test reports contained any result
[linuxJava8] [withMaven] junitPublisher - Archive test results for Maven artifact org.apache.maven.its.plugins:maven-it-plugin-extension-provider:2.1-SNAPSHOT generated by maven-surefire-plugin:test (default-test): core-it-support/core-it-plugins/maven-it-plugin-extension-provider/target/surefire-reports/*.xml
[linuxJava8] Recording test results
[linuxJava8] None of the test reports contained any result
[linuxJava8] [withMaven] junitPublisher - Archive test results for Maven artifact org.apache.maven.its.plugins:maven-it-plugin-fork:2.1-SNAPSHOT generated by maven-surefire-plugin:test (default-test): core-it-support/core-it-plugins/maven-it-plugin-fork/target/surefire-reports/*.xml
[linuxJava8] Recording test results
[linuxJava8] None of the test reports contained any result
[linuxJava8] [withMaven] junitPublisher - Archive test results for Maven artifact org.apache.maven.its.plugins:maven-it-plugin-invalid-descriptor:2.1-SNAPSHOT generated by maven-surefire-plugin:test (default-test): core-it-support/core-it-plugins/maven-it-plugin-invalid-descriptor/target/surefire-reports/*.xml
[linuxJava8] Recording test results
[linuxJava8] None of the test reports contained any result
[linuxJava8] [withMaven] junitPublisher - Archive test results for Maven artifact org.apache.maven.its.plugins:maven-it-plugin-log-file:2.1-SNAPSHOT generated by maven-surefire-plugin:test (default-test): core-it-support/core-it-plugins/maven-it-plugin-log-file/target/surefire-reports/*.xml
[linuxJava8] Recording test results
[linuxJava8] None of the test reports contained any result
[linuxJava8] [withMaven] junitPublisher - Archive test results for Maven artifact org.apache.maven.its:maven-it-helper:2.1-SNAPSHOT generated by maven-surefire-plugin:test (default-test): core-it-support/maven-it-helper/target/surefire-reports/*.xml
[linuxJava8] Recording test results
[linuxJava8] FATAL: Failed to save the JUnit test result
[linuxJava8] java.io.IOException: com.thoughtworks.xstream.io.StreamException:  : null
[linuxJava8] 	at hudson.XmlFile.write(XmlFile.java:188)
[linuxJava8] 	at hudson.tasks.junit.TestResultAction.setResult(TestResultAction.java:117)
[linuxJava8] 	at hudson.tasks.junit.TestResultAction.mergeResult(TestResultAction.java:270)
[linuxJava8] 	at hudson.tasks.junit.JUnitResultArchiver.parseAndAttach(JUnitResultArchiver.java:178)
[linuxJava8] 	at hudson.tasks.junit.JUnitResultArchiver.perform(JUnitResultArchiver.java:153)
[linuxJava8] 	at org.jenkinsci.plugins.pipeline.maven.publishers.JunitTestsPublisher.executeReporter(JunitTestsPublisher.java:270)
[linuxJava8] 	at org.jenkinsci.plugins.pipeline.maven.publishers.JunitTestsPublisher.process(JunitTestsPublisher.java:182)
[linuxJava8] 	at org.jenkinsci.plugins.pipeline.maven.MavenSpyLogProcessor.processMavenSpyLogs(MavenSpyLogProcessor.java:114)
[linuxJava8] 	at org.jenkinsci.plugins.pipeline.maven.WithMavenStepExecution$WorkspaceCleanupCallback.finished(WithMavenStepExecution.java:1015)
[linuxJava8] 	at org.jenkinsci.plugins.workflow.steps.BodyExecutionCallback$TailCall.onSuccess(BodyExecutionCallback.java:114)
[linuxJava8] 	at org.jenkinsci.plugins.workflow.cps.CpsBodyExecution$SuccessAdapter.receive(CpsBodyExecution.java:368)
[linuxJava8] 	at com.cloudbees.groovy.cps.Outcome.resumeFrom(Outcome.java:73)
[linuxJava8] 	at com.cloudbees.groovy.cps.Continuable$1.call(Continuable.java:166)
[linuxJava8] 	at com.cloudbees.groovy.cps.Continuable$1.call(Continuable.java:163)
[linuxJava8] 	at org.codehaus.groovy.runtime.GroovyCategorySupport$ThreadCategoryInfo.use(GroovyCategorySupport.java:122)
[linuxJava8] 	at org.codehaus.groovy.runtime.GroovyCategorySupport.use(GroovyCategorySupport.java:261)
[linuxJava8] 	at com.cloudbees.groovy.cps.Continuable.run0(Continuable.java:163)
[linuxJava8] 	at org.jenkinsci.plugins.workflow.cps.SandboxContinuable.access$001(SandboxContinuable.java:19)
[linuxJava8] 	at org.jenkinsci.plugins.workflow.cps.SandboxContinuable$1.call(SandboxContinuable.java:35)
[linuxJava8] 	at org.jenkinsci.plugins.workflow.cps.SandboxContinuable$1.call(SandboxContinuable.java:32)
[linuxJava8] 	at org.jenkinsci.plugins.scriptsecurity.sandbox.groovy.GroovySandbox.runInSandbox(GroovySandbox.java:108)
[linuxJava8] 	at org.jenkinsci.plugins.workflow.cps.SandboxContinuable.run0(SandboxContinuable.java:32)
[linuxJava8] 	at org.jenkinsci.plugins.workflow.cps.CpsThread.runNextChunk(CpsThread.java:174)
[linuxJava8] 	at org.jenkinsci.plugins.workflow.cps.CpsThreadGroup.run(CpsThreadGroup.java:331)
[linuxJava8] 	at org.jenkinsci.plugins.workflow.cps.CpsThreadGroup.access$200(CpsThreadGroup.java:82)
[linuxJava8] 	at org.jenkinsci.plugins.workflow.cps.CpsThreadGroup$2.call(CpsThreadGroup.java:243)
[linuxJava8] 	at org.jenkinsci.plugins.workflow.cps.CpsThreadGroup$2.call(CpsThreadGroup.java:231)
[linuxJava8] 	at org.jenkinsci.plugins.workflow.cps.CpsVmExecutorService$2.call(CpsVmExecutorService.java:64)
[linuxJava8] 	at java.util.concurrent.FutureTask.run(FutureTask.java:266)
[linuxJava8] 	at hudson.remoting.SingleLaneExecutorService$1.run(SingleLaneExecutorService.java:112)
[linuxJava8] 	at jenkins.util.ContextResettingExecutorService$1.run(ContextResettingExecutorService.java:28)
[linuxJava8] 	at java.util.concurrent.Executors$RunnableAdapter.call(Executors.java:511)
[linuxJava8] 	at java.util.concurrent.FutureTask.run(FutureTask.java:266)
[linuxJava8] 	at java.util.concurrent.ThreadPoolExecutor.runWorker(ThreadPoolExecutor.java:1149)
[linuxJava8] 	at java.util.concurrent.ThreadPoolExecutor$Worker.run(ThreadPoolExecutor.java:624)
[linuxJava8] 	at java.lang.Thread.run(Thread.java:748)
[linuxJava8] Caused by: com.thoughtworks.xstream.io.StreamException:  : null
[linuxJava8] 	at com.thoughtworks.xstream.core.util.QuickWriter.flush(QuickWriter.java:77)
[linuxJava8] 	at com.thoughtworks.xstream.io.xml.PrettyPrintWriter.endNode(PrettyPrintWriter.java:322)
[linuxJava8] 	at com.thoughtworks.xstream.io.WriterWrapper.endNode(WriterWrapper.java:37)
[linuxJava8] 	at com.thoughtworks.xstream.io.path.PathTrackingWriter.endNode(PathTrackingWriter.java:48)
[linuxJava8] 	at com.thoughtworks.xstream.core.TreeMarshaller.start(TreeMarshaller.java:83)
[linuxJava8] 	at com.thoughtworks.xstream.core.AbstractTreeMarshallingStrategy.marshal(AbstractTreeMarshallingStrategy.java:37)
[linuxJava8] 	at com.thoughtworks.xstream.XStream.marshal(XStream.java:1026)
[linuxJava8] 	at com.thoughtworks.xstream.XStream.marshal(XStream.java:1015)
[linuxJava8] 	at com.thoughtworks.xstream.XStream.toXML(XStream.java:988)
[linuxJava8] 	at hudson.XmlFile.write(XmlFile.java:181)
[linuxJava8] 	... 35 more
[linuxJava8] Caused by: java.nio.channels.ClosedByInterruptException
[linuxJava8] 	at java.nio.channels.spi.AbstractInterruptibleChannel.end(AbstractInterruptibleChannel.java:202)
[linuxJava8] 	at sun.nio.ch.FileChannelImpl.write(FileChannelImpl.java:216)
[linuxJava8] 	at java.nio.channels.Channels.writeFullyImpl(Channels.java:78)
[linuxJava8] 	at java.nio.channels.Channels.writeFully(Channels.java:101)
[linuxJava8] 	at java.nio.channels.Channels.access$000(Channels.java:61)
[linuxJava8] 	at java.nio.channels.Channels$1.write(Channels.java:174)
[linuxJava8] 	at sun.nio.cs.StreamEncoder.writeBytes(StreamEncoder.java:221)
[linuxJava8] 	at sun.nio.cs.StreamEncoder.implFlushBuffer(StreamEncoder.java:291)
[linuxJava8] 	at sun.nio.cs.StreamEncoder.implFlush(StreamEncoder.java:295)
[linuxJava8] 	at sun.nio.cs.StreamEncoder.flush(StreamEncoder.java:141)
[linuxJava8] 	at java.io.OutputStreamWriter.flush(OutputStreamWriter.java:229)
[linuxJava8] 	at java.io.BufferedWriter.flush(BufferedWriter.java:254)
[linuxJava8] 	at hudson.util.AtomicFileWriter.flush(AtomicFileWriter.java:97)
[linuxJava8] 	at com.thoughtworks.xstream.core.util.QuickWriter.flush(QuickWriter.java:75)
[linuxJava8] 	... 44 more
[linuxJava8] ERROR: [withMaven] junitPublisher - Silently ignore exception archiving JUnit results for Maven artifact MavenArtifact{org.apache.maven.its:maven-it-helper::2.1-SNAPSHOT(version: 2.1-SNAPSHOT, snapshot:false) } generated by PluginInvocation{org.apache.maven.plugins:maven-surefire-plugin:2.20.1@test  default-test}: java.lang.InterruptedException
[linuxJava8] [withMaven] junitPublisher - Archive test results for Maven artifact org.apache.maven.its.plugins:maven-it-plugin-model-interpolation:2.1-SNAPSHOT generated by maven-surefire-plugin:test (default-test): core-it-support/core-it-plugins/maven-it-plugin-model-interpolation/target/surefire-reports/*.xml
[linuxJava8] Recording test results
[linuxJava8] ERROR: [withMaven] junitPublisher - Silently ignore exception archiving JUnit results for Maven artifact MavenArtifact{org.apache.maven.its.plugins:maven-it-plugin-model-interpolation::2.1-SNAPSHOT(version: 2.1-SNAPSHOT, snapshot:false) } generated by PluginInvocation{org.apache.maven.plugins:maven-surefire-plugin:2.20.1@test  default-test}: java.lang.RuntimeException: Failed to serialize hudson.tasks.junit.TestResult#suites for class hudson.tasks.junit.TestResult
[linuxJava8] [withMaven] junitPublisher - Archive test results for Maven artifact org.apache.maven.its.plugins:maven-it-plugin-no-default-comp:2.1-SNAPSHOT generated by maven-surefire-plugin:test (default-test): core-it-support/core-it-plugins/maven-it-plugin-no-default-comp/target/surefire-reports/*.xml
[linuxJava8] Recording test results
[linuxJava8] None of the test reports contained any result
[linuxJava8] [withMaven] junitPublisher - Archive test results for Maven artifact org.apache.maven.its.plugins:maven-it-plugin-no-project:2.1-SNAPSHOT generated by maven-surefire-plugin:test (default-test): core-it-support/core-it-plugins/maven-it-plugin-no-project/target/surefire-reports/*.xml
[linuxJava8] Recording test results
[linuxJava8] ERROR: [withMaven] junitPublisher - Silently ignore exception archiving JUnit results for Maven artifact MavenArtifact{org.apache.maven.its.plugins:maven-it-plugin-no-project::2.1-SNAPSHOT(version: 2.1-SNAPSHOT, snapshot:false) } generated by PluginInvocation{org.apache.maven.plugins:maven-surefire-plugin:2.20.1@test  default-test}: java.lang.InterruptedException
[linuxJava8] [withMaven] junitPublisher - Archive test results for Maven artifact org.apache.maven.its.plugins:maven-it-plugin-online:2.1-SNAPSHOT generated by maven-surefire-plugin:test (default-test): core-it-support/core-it-plugins/maven-it-plugin-online/target/surefire-reports/*.xml
[linuxJava8] Recording test results
[linuxJava8] None of the test reports contained any result
[linuxJava8] [withMaven] junitPublisher - Archive test results for Maven artifact org.apache.maven.its.plugins:maven-it-plugin-optional-mojos:2.1-SNAPSHOT generated by maven-surefire-plugin:test (default-test): core-it-support/core-it-plugins/maven-it-plugin-optional-mojos/target/surefire-reports/*.xml
[linuxJava8] Recording test results
[linuxJava8] ERROR: [withMaven] junitPublisher - Silently ignore exception archiving JUnit results for Maven artifact MavenArtifact{org.apache.maven.its.plugins:maven-it-plugin-optional-mojos::2.1-SNAPSHOT(version: 2.1-SNAPSHOT, snapshot:false) } generated by PluginInvocation{org.apache.maven.plugins:maven-surefire-plugin:2.20.1@test  default-test}: java.lang.RuntimeException: Failed to serialize hudson.tasks.junit.TestResult#suites for class hudson.tasks.junit.TestResult
[linuxJava8] [withMaven] junitPublisher - Archive test results for Maven artifact org.apache.maven.its.plugins:maven-it-plugin-packaging:2.1-SNAPSHOT generated by maven-surefire-plugin:test (default-test): core-it-support/core-it-plugins/maven-it-plugin-packaging/target/surefire-reports/*.xml
[linuxJava8] Recording test results
[linuxJava8] None of the test reports contained any result
[linuxJava8] [withMaven] junitPublisher - Archive test results for Maven artifact org.apache.maven.its.plugins:maven-it-plugin-parameter-implementation:2.1-SNAPSHOT generated by maven-surefire-plugin:test (default-test): core-it-support/core-it-plugins/maven-it-plugin-parameter-implementation/target/surefire-reports/*.xml
[linuxJava8] Recording test results
[linuxJava8] ERROR: [withMaven] junitPublisher - Silently ignore exception archiving JUnit results for Maven artifact MavenArtifact{org.apache.maven.its.plugins:maven-it-plugin-parameter-implementation::2.1-SNAPSHOT(version: 2.1-SNAPSHOT, snapshot:false) } generated by PluginInvocation{org.apache.maven.plugins:maven-surefire-plugin:2.20.1@test  default-test}: java.lang.RuntimeException: Failed to serialize hudson.tasks.junit.TestResult#suites for class hudson.tasks.junit.TestResult
[linuxJava8] [withMaven] junitPublisher - Archive test results for Maven artifact org.apache.maven.its.plugins:maven-it-plugin-plugin-dependency:2.1-SNAPSHOT generated by maven-surefire-plugin:test (default-test): core-it-support/core-it-plugins/maven-it-plugin-plugin-dependency/target/surefire-reports/*.xml
[linuxJava8] Recording test results
[linuxJava8] None of the test reports contained any result
[linuxJava8] [withMaven] junitPublisher - Archive test results for Maven artifact org.apache.maven.its.plugins:maven-it-plugin-project:2.1-SNAPSHOT generated by maven-surefire-plugin:test (default-test): core-it-support/core-it-plugins/maven-it-plugin-project/target/surefire-reports/*.xml
[linuxJava8] Recording test results
[linuxJava8] ERROR: [withMaven] junitPublisher - Silently ignore exception archiving JUnit results for Maven artifact MavenArtifact{org.apache.maven.its.plugins:maven-it-plugin-project::2.1-SNAPSHOT(version: 2.1-SNAPSHOT, snapshot:false) } generated by PluginInvocation{org.apache.maven.plugins:maven-surefire-plugin:2.20.1@test  default-test}: java.lang.RuntimeException: Failed to serialize hudson.tasks.junit.TestResult#suites for class hudson.tasks.junit.TestResult
[linuxJava8] [withMaven] junitPublisher - Archive test results for Maven artifact org.apache.maven.its.plugins:maven-it-plugin-project-interpolation:2.1-SNAPSHOT generated by maven-surefire-plugin:test (default-test): core-it-support/core-it-plugins/maven-it-plugin-project-interpolation/target/surefire-reports/*.xml
[linuxJava8] Recording test results
[linuxJava8] None of the test reports contained any result
[linuxJava8] [withMaven] junitPublisher - Archive test results for Maven artifact org.apache.maven.its.plugins:maven-it-plugin-setter:2.1-SNAPSHOT generated by maven-surefire-plugin:test (default-test): core-it-support/core-it-plugins/maven-it-plugin-setter/target/surefire-reports/*.xml
[linuxJava8] Recording test results
[linuxJava8] ERROR: [withMaven] junitPublisher - Silently ignore exception archiving JUnit results for Maven artifact MavenArtifact{org.apache.maven.its.plugins:maven-it-plugin-setter::2.1-SNAPSHOT(version: 2.1-SNAPSHOT, snapshot:false) } generated by PluginInvocation{org.apache.maven.plugins:maven-surefire-plugin:2.20.1@test  default-test}: java.lang.RuntimeException: Failed to serialize hudson.tasks.junit.TestResult#suites for class hudson.tasks.junit.TestResult
[linuxJava8] [withMaven] junitPublisher - Archive test results for Maven artifact org.apache.maven.its.plugins:maven-it-plugin-singleton-component:2.1-SNAPSHOT generated by maven-surefire-plugin:test (default-test): core-it-support/core-it-plugins/maven-it-plugin-singleton-component/target/surefire-reports/*.xml
[linuxJava8] Recording test results
[linuxJava8] None of the test reports contained any result
[linuxJava8] [withMaven] junitPublisher - Archive test results for Maven artifact org.apache.maven.its.plugins:maven-it-plugin-site:2.1-SNAPSHOT generated by maven-surefire-plugin:test (default-test): core-it-support/core-it-plugins/maven-it-plugin-site/target/surefire-reports/*.xml
[linuxJava8] Recording test results
[linuxJava8] ERROR: [withMaven] junitPublisher - Silently ignore exception archiving JUnit results for Maven artifact MavenArtifact{org.apache.maven.its.plugins:maven-it-plugin-site::2.1-SNAPSHOT(version: 2.1-SNAPSHOT, snapshot:false) } generated by PluginInvocation{org.apache.maven.plugins:maven-surefire-plugin:2.20.1@test  default-test}: java.lang.RuntimeException: Failed to serialize hudson.tasks.junit.TestResult#suites for class hudson.tasks.junit.TestResult
[linuxJava8] [withMaven] junitPublisher - Archive test results for Maven artifact org.apache.maven.its.plugins:maven-it-plugin-toolchain:2.1-SNAPSHOT generated by maven-surefire-plugin:test (default-test): core-it-support/core-it-plugins/maven-it-plugin-toolchain/target/surefire-reports/*.xml
[linuxJava8] Recording test results
[linuxJava8] None of the test reports contained any result
[linuxJava8] [withMaven] junitPublisher - Archive test results for Maven artifact org.apache.maven.its.plugins:maven-it-plugin-touch:2.1-SNAPSHOT generated by maven-surefire-plugin:test (default-test): core-it-support/core-it-plugins/maven-it-plugin-touch/target/surefire-reports/*.xml
[linuxJava8] Recording test results
[linuxJava8] ERROR: [withMaven] junitPublisher - Silently ignore exception archiving JUnit results for Maven artifact MavenArtifact{org.apache.maven.its.plugins:maven-it-plugin-touch::2.1-SNAPSHOT(version: 2.1-SNAPSHOT, snapshot:false) } generated by PluginInvocation{org.apache.maven.plugins:maven-surefire-plugin:2.20.1@test  default-test}: java.lang.RuntimeException: Failed to serialize hudson.tasks.junit.TestResult#suites for class hudson.tasks.junit.TestResult
[linuxJava8] [withMaven] junitPublisher - Archive test results for Maven artifact org.apache.maven.its.plugins:maven-it-plugin-uses-properties:2.1-SNAPSHOT generated by maven-surefire-plugin:test (default-test): core-it-support/core-it-plugins/maven-it-plugin-uses-properties/target/surefire-reports/*.xml
[linuxJava8] Recording test results
[linuxJava8] None of the test reports contained any result
[linuxJava8] [withMaven] junitPublisher - Archive test results for Maven artifact org.apache.maven.its.plugins:maven-it-plugin-uses-wagon:2.1-SNAPSHOT generated by maven-surefire-plugin:test (default-test): core-it-support/core-it-plugins/maven-it-plugin-uses-wagon/target/surefire-reports/*.xml
[linuxJava8] Recording test results
[linuxJava8] ERROR: [withMaven] junitPublisher - Silently ignore exception archiving JUnit results for Maven artifact MavenArtifact{org.apache.maven.its.plugins:maven-it-plugin-uses-wagon::2.1-SNAPSHOT(version: 2.1-SNAPSHOT, snapshot:false) } generated by PluginInvocation{org.apache.maven.plugins:maven-surefire-plugin:2.20.1@test  default-test}: java.lang.RuntimeException: Failed to serialize hudson.tasks.junit.TestResult#suites for class hudson.tasks.junit.TestResult
[linuxJava8] [withMaven] junitPublisher - Archive test results for Maven artifact org.apache.maven.its.plugins:maven-it-plugin-all:2.1-SNAPSHOT generated by maven-surefire-plugin:test (default-test): core-it-support/core-it-plugins/maven-it-plugin-all/target/surefire-reports/*.xml
[linuxJava8] Recording test results
[linuxJava8] None of the test reports contained any result
[linuxJava8] [withMaven] junitPublisher - Archive test results for Maven artifact org.apache.maven.its.plugins:maven-it-plugin-plexus-utils-11:2.1-SNAPSHOT generated by maven-surefire-plugin:test (default-test): core-it-support/core-it-plugins/maven-it-plugin-plexus-utils-11/target/surefire-reports/*.xml
[linuxJava8] Recording test results
[linuxJava8] ERROR: [withMaven] junitPublisher - Silently ignore exception archiving JUnit results for Maven artifact MavenArtifact{org.apache.maven.its.plugins:maven-it-plugin-plexus-utils-11::2.1-SNAPSHOT(version: 2.1-SNAPSHOT, snapshot:false) } generated by PluginInvocation{org.apache.maven.plugins:maven-surefire-plugin:2.20.1@test  default-test}: java.lang.RuntimeException: Failed to serialize hudson.tasks.junit.TestResult#suites for class hudson.tasks.junit.TestResult
[linuxJava8] [withMaven] junitPublisher - Archive test results for Maven artifact org.apache.maven.its.plugins:maven-it-plugin-plexus-utils-new:2.1-SNAPSHOT generated by maven-surefire-plugin:test (default-test): core-it-support/core-it-plugins/maven-it-plugin-plexus-utils-new/target/surefire-reports/*.xml
[linuxJava8] Recording test results
[linuxJava8] None of the test reports contained any result
[linuxJava8] [withMaven] junitPublisher - Archive test results for Maven artifact org.apache.maven.its.plugins:maven-it-plugin-plexus-component-api:2.1-SNAPSHOT generated by maven-surefire-plugin:test (default-test): core-it-support/core-it-plugins/maven-it-plugin-plexus-component-api/target/surefire-reports/*.xml
[linuxJava8] Recording test results
[linuxJava8] None of the test reports contained any result
[linuxJava8] [withMaven] junitPublisher - Archive test results for Maven artifact org.apache.maven.its.plugins:maven-it-plugin-log4j:2.1-SNAPSHOT generated by maven-surefire-plugin:test (default-test): core-it-support/core-it-plugins/maven-it-plugin-log4j/target/surefire-reports/*.xml
[linuxJava8] Recording test results
[linuxJava8] ERROR: [withMaven] junitPublisher - Silently ignore exception archiving JUnit results for Maven artifact MavenArtifact{org.apache.maven.its.plugins:maven-it-plugin-log4j::2.1-SNAPSHOT(version: 2.1-SNAPSHOT, snapshot:false) } generated by PluginInvocation{org.apache.maven.plugins:maven-surefire-plugin:2.20.1@test  default-test}: java.lang.RuntimeException: Failed to serialize hudson.tasks.junit.TestResult#suites for class hudson.tasks.junit.TestResult
[linuxJava8] [withMaven] junitPublisher - Archive test results for Maven artifact org.apache.maven.its.plugins:maven-it-plugin-extension1:2.1-SNAPSHOT generated by maven-surefire-plugin:test (default-test): core-it-support/core-it-plugins/maven-it-plugin-extension1/target/surefire-reports/*.xml
[linuxJava8] Recording test results
[linuxJava8] None of the test reports contained any result
[linuxJava8] [withMaven] junitPublisher - Archive test results for Maven artifact org.apache.maven.its.plugins:maven-it-plugin-extension2:2.1-SNAPSHOT generated by maven-surefire-plugin:test (default-test): core-it-support/core-it-plugins/maven-it-plugin-extension2/target/surefire-reports/*.xml
[linuxJava8] Recording test results
[linuxJava8] None of the test reports contained any result
[linuxJava8] [withMaven] junitPublisher - Archive test results for Maven artifact org.apache.maven.its.plugins:maven-it-plugin-plexus-lifecycle:2.1-SNAPSHOT generated by maven-surefire-plugin:test (default-test): core-it-support/core-it-plugins/maven-it-plugin-plexus-lifecycle/target/surefire-reports/*.xml
[linuxJava8] Recording test results
[linuxJava8] ERROR: [withMaven] junitPublisher - Silently ignore exception archiving JUnit results for Maven artifact MavenArtifact{org.apache.maven.its.plugins:maven-it-plugin-plexus-lifecycle::2.1-SNAPSHOT(version: 2.1-SNAPSHOT, snapshot:false) } generated by PluginInvocation{org.apache.maven.plugins:maven-surefire-plugin:2.20.1@test  default-test}: java.lang.RuntimeException: Failed to serialize hudson.tasks.junit.TestResult#suites for class hudson.tasks.junit.TestResult
[linuxJava8] [withMaven] junitPublisher - Archive test results for Maven artifact org.apache.maven.its.plugins:maven-it-plugin-settings:2.1-SNAPSHOT generated by maven-surefire-plugin:test (default-test): core-it-support/core-it-plugins/maven-it-plugin-settings/target/surefire-reports/*.xml
[linuxJava8] Recording test results
[linuxJava8] None of the test reports contained any result
[linuxJava8] [withMaven] junitPublisher - Archive test results for Maven artifact org.apache.maven.its.plugins:mng-5805-pkg-type-mojo-configuration-extension:2.1-SNAPSHOT generated by maven-surefire-plugin:test (default-test): core-it-support/core-it-plugins/mng5805-extension/target/surefire-reports/*.xml
[linuxJava8] Recording test results
[linuxJava8] ERROR: [withMaven] junitPublisher - Silently ignore exception archiving JUnit results for Maven artifact MavenArtifact{org.apache.maven.its.plugins:mng-5805-pkg-type-mojo-configuration-extension::2.1-SNAPSHOT(version: 2.1-SNAPSHOT, snapshot:false) } generated by PluginInvocation{org.apache.maven.plugins:maven-surefire-plugin:2.20.1@test  default-test}: java.lang.RuntimeException: Failed to serialize hudson.tasks.junit.TestResult#suites for class hudson.tasks.junit.TestResult
[linuxJava8] [withMaven] junitPublisher - Archive test results for Maven artifact org.apache.maven.its.plugins:mng-5805-pkg-type-mojo-configuration-extension2:2.1-SNAPSHOT generated by maven-surefire-plugin:test (default-test): core-it-support/core-it-plugins/mng5805-extension2/target/surefire-reports/*.xml
[linuxJava8] Recording test results
[linuxJava8] ERROR: [withMaven] junitPublisher - Silently ignore exception archiving JUnit results for Maven artifact MavenArtifact{org.apache.maven.its.plugins:mng-5805-pkg-type-mojo-configuration-extension2::2.1-SNAPSHOT(version: 2.1-SNAPSHOT, snapshot:false) } generated by PluginInvocation{org.apache.maven.plugins:maven-surefire-plugin:2.20.1@test  default-test}: java.lang.RuntimeException: Failed to serialize hudson.tasks.junit.TestResult#suites for class hudson.tasks.junit.TestResult
[linuxJava8] [withMaven] junitPublisher - Archive test results for Maven artifact org.apache.maven.its.plugins:mng-5805-pkg-type-mojo-configuration-plugin:2.1-SNAPSHOT generated by maven-surefire-plugin:test (default-test): core-it-support/core-it-plugins/mng5805-plugin/target/surefire-reports/*.xml
[linuxJava8] Recording test results
[linuxJava8] ERROR: [withMaven] junitPublisher - Silently ignore exception archiving JUnit results for Maven artifact MavenArtifact{org.apache.maven.its.plugins:mng-5805-pkg-type-mojo-configuration-plugin::2.1-SNAPSHOT(version: 2.1-SNAPSHOT, snapshot:false) } generated by PluginInvocation{org.apache.maven.plugins:maven-surefire-plugin:2.20.1@test  default-test}: java.lang.RuntimeException: Failed to serialize hudson.tasks.junit.TestResult#suites for class hudson.tasks.junit.TestResult
[linuxJava8] [withMaven] junitPublisher - Archive test results for Maven artifact org.apache.maven.its.plugins:mng-5805-pkg-type-mojo-configuration-plugin-dep:2.1-SNAPSHOT generated by maven-surefire-plugin:test (default-test): core-it-support/core-it-plugins/mng5805-plugin-dep/target/surefire-reports/*.xml
[linuxJava8] Recording test results
[linuxJava8] ERROR: [withMaven] junitPublisher - Silently ignore exception archiving JUnit results for Maven artifact MavenArtifact{org.apache.maven.its.plugins:mng-5805-pkg-type-mojo-configuration-plugin-dep::2.1-SNAPSHOT(version: 2.1-SNAPSHOT, snapshot:false) } generated by PluginInvocation{org.apache.maven.plugins:maven-surefire-plugin:2.20.1@test  default-test}: java.lang.RuntimeException: Failed to serialize hudson.tasks.junit.TestResult#suites for class hudson.tasks.junit.TestResult
[linuxJava8] [withMaven] junitPublisher - Archive test results for Maven artifact org.apache.maven.its.plugins:mng-5958-pkg-type-extension:2.1-SNAPSHOT generated by maven-surefire-plugin:test (default-test): core-it-support/core-it-plugins/mng5958-extension/target/surefire-reports/*.xml
[linuxJava8] Recording test results
[linuxJava8] None of the test reports contained any result
[linuxJava8] [withMaven] junitPublisher - Archive test results for Maven artifact org.apache.maven.its:core-it-toolchain:2.1-SNAPSHOT generated by maven-surefire-plugin:test (default-test): core-it-support/core-it-toolchain/target/surefire-reports/*.xml
[linuxJava8] Recording test results
[linuxJava8] ERROR: [withMaven] junitPublisher - Silently ignore exception archiving JUnit results for Maven artifact MavenArtifact{org.apache.maven.its:core-it-toolchain::2.1-SNAPSHOT(version: 2.1-SNAPSHOT, snapshot:false) } generated by PluginInvocation{org.apache.maven.plugins:maven-surefire-plugin:2.20.1@test  default-test}: java.lang.RuntimeException: Failed to serialize hudson.tasks.junit.TestResult#suites for class hudson.tasks.junit.TestResult
[linuxJava8] [withMaven] junitPublisher - Archive test results for Maven artifact org.apache.maven.its:core-it-wagon:2.1-SNAPSHOT generated by maven-surefire-plugin:test (default-test): core-it-support/core-it-wagon/target/surefire-reports/*.xml
[linuxJava8] Recording test results
[linuxJava8] ERROR: [withMaven] junitPublisher - Silently ignore exception archiving JUnit results for Maven artifact MavenArtifact{org.apache.maven.its:core-it-wagon::2.1-SNAPSHOT(version: 2.1-SNAPSHOT, snapshot:false) } generated by PluginInvocation{org.apache.maven.plugins:maven-surefire-plugin:2.20.1@test  default-test}: java.lang.RuntimeException: Failed to serialize hudson.tasks.junit.TestResult#suites for class hudson.tasks.junit.TestResult
[linuxJava8] [withMaven] junitPublisher - Archive test results for Maven artifact org.apache.maven.its:core-it-extension:2.1-SNAPSHOT generated by maven-surefire-plugin:test (default-test): core-it-support/core-it-extension/target/surefire-reports/*.xml
[linuxJava8] Recording test results
[linuxJava8] None of the test reports contained any result
[linuxJava8] [withMaven] junitPublisher - Archive test results for Maven artifact org.apache.maven.its:core-it-suite:2.1-SNAPSHOT generated by maven-surefire-plugin:test (default-test): core-it-suite/target/surefire-reports/*.xml
[linuxJava8] Recording test results
[linuxJava8] ERROR: [withMaven] junitPublisher - Silently ignore exception archiving JUnit results for Maven artifact MavenArtifact{org.apache.maven.its:core-it-suite::2.1-SNAPSHOT(version: 2.1-SNAPSHOT, snapshot:false) } generated by PluginInvocation{org.apache.maven.plugins:maven-surefire-plugin:2.20.1@test  default-test}: java.lang.RuntimeException: Failed to serialize hudson.tasks.junit.TestResult#suites for class hudson.tasks.junit.TestResult
[linuxJava8] ERROR: [withMaven] WARNING Exception processing the logs generated by the Jenkins Maven Event Spy /home/jenkins/jenkins-slave/workspace/maven-box_maven_MNG-6386-LLX2LHIUAZ6VGRI3GUJ4WEAJPQUEJ2QQDYWXUIGOMQPZI7AFSMBA/test@tmp/withMaven817df848/maven-spy-20180502-235229-442003103205436463192.log, ignore file.  Please report a bug associated for the component 'pipeline-maven-plugin' at https://issues.jenkins-ci.org 
[linuxJava8] java.lang.InterruptedException
[linuxJava8] 	at java.lang.Object.wait(Native Method)
[linuxJava8] 	at hudson.remoting.Request.call(Request.java:167)
[linuxJava8] 	at hudson.remoting.Channel.call(Channel.java:907)
[linuxJava8] 	at hudson.FilePath.act(FilePath.java:986)
[linuxJava8] 	at hudson.FilePath.act(FilePath.java:975)
[linuxJava8] 	at hudson.FilePath.exists(FilePath.java:1440)
[linuxJava8] 	at org.jenkinsci.plugins.pipeline.maven.MavenSpyLogProcessor.processMavenSpyLogs(MavenSpyLogProcessor.java:105)
[linuxJava8] 	at org.jenkinsci.plugins.pipeline.maven.WithMavenStepExecution$WorkspaceCleanupCallback.finished(WithMavenStepExecution.java:1015)
[linuxJava8] 	at org.jenkinsci.plugins.workflow.steps.BodyExecutionCallback$TailCall.onSuccess(BodyExecutionCallback.java:114)
[linuxJava8] 	at org.jenkinsci.plugins.workflow.cps.CpsBodyExecution$SuccessAdapter.receive(CpsBodyExecution.java:368)
[linuxJava8] 	at com.cloudbees.groovy.cps.Outcome.resumeFrom(Outcome.java:73)
[linuxJava8] 	at com.cloudbees.groovy.cps.Continuable$1.call(Continuable.java:166)
[linuxJava8] 	at com.cloudbees.groovy.cps.Continuable$1.call(Continuable.java:163)
[linuxJava8] 	at org.codehaus.groovy.runtime.GroovyCategorySupport$ThreadCategoryInfo.use(GroovyCategorySupport.java:122)
[linuxJava8] 	at org.codehaus.groovy.runtime.GroovyCategorySupport.use(GroovyCategorySupport.java:261)
[linuxJava8] 	at com.cloudbees.groovy.cps.Continuable.run0(Continuable.java:163)
[linuxJava8] 	at org.jenkinsci.plugins.workflow.cps.SandboxContinuable.access$001(SandboxContinuable.java:19)
[linuxJava8] 	at org.jenkinsci.plugins.workflow.cps.SandboxContinuable$1.call(SandboxContinuable.java:35)
[linuxJava8] 	at org.jenkinsci.plugins.workflow.cps.SandboxContinuable$1.call(SandboxContinuable.java:32)
[linuxJava8] 	at org.jenkinsci.plugins.scriptsecurity.sandbox.groovy.GroovySandbox.runInSandbox(GroovySandbox.java:108)
[linuxJava8] 	at org.jenkinsci.plugins.workflow.cps.SandboxContinuable.run0(SandboxContinuable.java:32)
[linuxJava8] 	at org.jenkinsci.plugins.workflow.cps.CpsThread.runNextChunk(CpsThread.java:174)
[linuxJava8] 	at org.jenkinsci.plugins.workflow.cps.CpsThreadGroup.run(CpsThreadGroup.java:331)
[linuxJava8] 	at org.jenkinsci.plugins.workflow.cps.CpsThreadGroup.access$200(CpsThreadGroup.java:82)
[linuxJava8] 	at org.jenkinsci.plugins.workflow.cps.CpsThreadGroup$2.call(CpsThreadGroup.java:243)
[linuxJava8] 	at org.jenkinsci.plugins.workflow.cps.CpsThreadGroup$2.call(CpsThreadGroup.java:231)
[linuxJava8] 	at org.jenkinsci.plugins.workflow.cps.CpsVmExecutorService$2.call(CpsVmExecutorService.java:64)
[linuxJava8] 	at java.util.concurrent.FutureTask.run(FutureTask.java:266)
[linuxJava8] 	at hudson.remoting.SingleLaneExecutorService$1.run(SingleLaneExecutorService.java:112)
[linuxJava8] 	at jenkins.util.ContextResettingExecutorService$1.run(ContextResettingExecutorService.java:28)
[linuxJava8] 	at java.util.concurrent.Executors$RunnableAdapter.call(Executors.java:511)
[linuxJava8] 	at java.util.concurrent.FutureTask.run(FutureTask.java:266)
[linuxJava8] 	at java.util.concurrent.ThreadPoolExecutor.runWorker(ThreadPoolExecutor.java:1149)
[linuxJava8] 	at java.util.concurrent.ThreadPoolExecutor$Worker.run(ThreadPoolExecutor.java:624)
[linuxJava8] 	at java.lang.Thread.run(Thread.java:748)
[Pipeline] [linuxJava8] // withMaven
[Pipeline] [linuxJava7] }
[Pipeline] [linuxJava8] deleteDir
[Pipeline] [linuxJava7] // dir
[Pipeline] [linuxJava7] }
[Pipeline] [linuxJava7] // stage
[Pipeline] [linuxJava7] }
[Pipeline] [linuxJava8] }
[Pipeline] [linuxJava7] // node
[Pipeline] [linuxJava8] // dir
[Pipeline] [linuxJava7] }
[Pipeline] [linuxJava8] }
[Pipeline] [linuxJava8] // stage
[Pipeline] [linuxJava8] }
[Pipeline] [linuxJava8] // node
[Pipeline] [linuxJava8] }
[Pipeline] // parallel
[Pipeline] stage
[Pipeline] { (Notifications)
[Pipeline] echo
Build result: UNSTABLE
[Pipeline] jiraIssueSelector

Build succeeded in Jenkins: Maven TLP » maven » MNG-6386 #8

Posted by Apache Jenkins Server <je...@builds.apache.org>.
See https://builds.apache.org/job/maven-box/job/maven/job/MNG-6386/8/

No changes.

All tests passed

Build aborted in Jenkins: Maven TLP » maven » MNG-6386 #7

Posted by Apache Jenkins Server <je...@builds.apache.org>.
See https://builds.apache.org/job/maven-box/job/maven/job/MNG-6386/7/

No changes.

No tests ran.

Build log:
[...truncated 377.75 KB...]
[INFO] Downloaded from central: https://repo.maven.apache.org/maven2/org/antlr/antlr-master/3.4/antlr-master-3.4.pom (9.4 kB at 854 kB/s)
[INFO] Downloading from central: https://repo.maven.apache.org/maven2/net/java/dev/jna/platform/3.5.2/platform-3.5.2.pom
[INFO] Downloaded from central: https://repo.maven.apache.org/maven2/net/java/dev/jna/platform/3.5.2/platform-3.5.2.pom (1.4 kB at 125 kB/s)
[INFO] Downloading from central: https://repo.maven.apache.org/maven2/com/jcraft/jsch.agentproxy.connector-factory/0.0.7/jsch.agentproxy.connector-factory-0.0.7.pom
[INFO] Downloaded from central: https://repo.maven.apache.org/maven2/com/jcraft/jsch.agentproxy.connector-factory/0.0.7/jsch.agentproxy.connector-factory-0.0.7.pom (1.7 kB at 139 kB/s)
[INFO] Downloading from central: https://repo.maven.apache.org/maven2/com/jcraft/jsch.agentproxy.usocket-jna/0.0.7/jsch.agentproxy.usocket-jna-0.0.7.pom
[INFO] Downloaded from central: https://repo.maven.apache.org/maven2/com/jcraft/jsch.agentproxy.usocket-jna/0.0.7/jsch.agentproxy.usocket-jna-0.0.7.pom (1.3 kB at 118 kB/s)
[INFO] Downloading from central: https://repo.maven.apache.org/maven2/net/java/dev/jna/jna/3.4.0/jna-3.4.0.pom
[INFO] Downloaded from central: https://repo.maven.apache.org/maven2/net/java/dev/jna/jna/3.4.0/jna-3.4.0.pom (2.2 kB at 197 kB/s)
[INFO] Downloading from central: https://repo.maven.apache.org/maven2/net/java/dev/jna/platform/3.4.0/platform-3.4.0.pom
[INFO] Downloaded from central: https://repo.maven.apache.org/maven2/net/java/dev/jna/platform/3.4.0/platform-3.4.0.pom (2.4 kB at 222 kB/s)
[INFO] Downloading from central: https://repo.maven.apache.org/maven2/com/jcraft/jsch.agentproxy.usocket-nc/0.0.7/jsch.agentproxy.usocket-nc-0.0.7.pom
[INFO] Downloaded from central: https://repo.maven.apache.org/maven2/com/jcraft/jsch.agentproxy.usocket-nc/0.0.7/jsch.agentproxy.usocket-nc-0.0.7.pom (996 B at 91 kB/s)
[INFO] Downloading from central: https://repo.maven.apache.org/maven2/com/jcraft/jsch.agentproxy.sshagent/0.0.7/jsch.agentproxy.sshagent-0.0.7.pom
[INFO] Downloaded from central: https://repo.maven.apache.org/maven2/com/jcraft/jsch.agentproxy.sshagent/0.0.7/jsch.agentproxy.sshagent-0.0.7.pom (971 B at 88 kB/s)
[INFO] Downloading from central: https://repo.maven.apache.org/maven2/com/jcraft/jsch.agentproxy.pageant/0.0.7/jsch.agentproxy.pageant-0.0.7.pom
[INFO] Downloaded from central: https://repo.maven.apache.org/maven2/com/jcraft/jsch.agentproxy.pageant/0.0.7/jsch.agentproxy.pageant-0.0.7.pom (1.3 kB at 117 kB/s)
[INFO] Downloading from central: https://repo.maven.apache.org/maven2/de/regnis/q/sequence/sequence-library/1.0.2/sequence-library-1.0.2.pom
[INFO] Downloaded from central: https://repo.maven.apache.org/maven2/de/regnis/q/sequence/sequence-library/1.0.2/sequence-library-1.0.2.pom (1.3 kB at 55 kB/s)
[INFO] Downloading from central: https://repo.maven.apache.org/maven2/org/apache/maven/scm/maven-scm-api/1.9.4/maven-scm-api-1.9.4.jar
[INFO] Downloading from central: https://repo.maven.apache.org/maven2/org/apache/maven/scm/maven-scm-manager-plexus/1.9.4/maven-scm-manager-plexus-1.9.4.jar
[INFO] Downloading from central: https://repo.maven.apache.org/maven2/org/apache/maven/scm/maven-scm-provider-gitexe/1.9.4/maven-scm-provider-gitexe-1.9.4.jar
[INFO] Downloading from central: https://repo.maven.apache.org/maven2/org/apache/maven/scm/maven-scm-provider-svnexe/1.9.4/maven-scm-provider-svnexe-1.9.4.jar
[INFO] Downloading from central: https://repo.maven.apache.org/maven2/org/apache/maven/scm/maven-scm-provider-bazaar/1.9.4/maven-scm-provider-bazaar-1.9.4.jar
[INFO] Downloaded from central: https://repo.maven.apache.org/maven2/org/apache/maven/scm/maven-scm-manager-plexus/1.9.4/maven-scm-manager-plexus-1.9.4.jar (11 kB at 775 kB/s)
[INFO] Downloading from central: https://repo.maven.apache.org/maven2/org/apache/maven/scm/maven-scm-provider-git-commons/1.9.4/maven-scm-provider-git-commons-1.9.4.jar
[INFO] Downloaded from central: https://repo.maven.apache.org/maven2/org/apache/maven/scm/maven-scm-api/1.9.4/maven-scm-api-1.9.4.jar (107 kB at 6.3 MB/s)
[INFO] Downloading from central: https://repo.maven.apache.org/maven2/org/apache/maven/scm/maven-scm-provider-svn-commons/1.9.4/maven-scm-provider-svn-commons-1.9.4.jar
[INFO] Downloaded from central: https://repo.maven.apache.org/maven2/org/apache/maven/scm/maven-scm-provider-gitexe/1.9.4/maven-scm-provider-gitexe-1.9.4.jar (66 kB at 3.7 MB/s)
[INFO] Downloading from central: https://repo.maven.apache.org/maven2/org/apache/maven/scm/maven-scm-provider-cvsexe/1.9.4/maven-scm-provider-cvsexe-1.9.4.jar
[INFO] Downloaded from central: https://repo.maven.apache.org/maven2/org/apache/maven/scm/maven-scm-provider-svnexe/1.9.4/maven-scm-provider-svnexe-1.9.4.jar (78 kB at 3.9 MB/s)
[INFO] Downloading from central: https://repo.maven.apache.org/maven2/org/apache/maven/scm/maven-scm-provider-cvs-commons/1.9.4/maven-scm-provider-cvs-commons-1.9.4.jar
[INFO] Downloaded from central: https://repo.maven.apache.org/maven2/org/apache/maven/scm/maven-scm-provider-bazaar/1.9.4/maven-scm-provider-bazaar-1.9.4.jar (56 kB at 2.7 MB/s)
[INFO] Downloading from central: https://repo.maven.apache.org/maven2/org/apache/maven/scm/maven-scm-provider-starteam/1.9.4/maven-scm-provider-starteam-1.9.4.jar
[INFO] Downloaded from central: https://repo.maven.apache.org/maven2/org/apache/maven/scm/maven-scm-provider-git-commons/1.9.4/maven-scm-provider-git-commons-1.9.4.jar (34 kB at 1.3 MB/s)
[INFO] Downloading from central: https://repo.maven.apache.org/maven2/org/apache/maven/scm/maven-scm-provider-clearcase/1.9.4/maven-scm-provider-clearcase-1.9.4.jar
[INFO] Downloaded from central: https://repo.maven.apache.org/maven2/org/apache/maven/scm/maven-scm-provider-svn-commons/1.9.4/maven-scm-provider-svn-commons-1.9.4.jar (37 kB at 1.4 MB/s)
[INFO] Downloading from central: https://repo.maven.apache.org/maven2/org/apache/maven/scm/maven-scm-provider-perforce/1.9.4/maven-scm-provider-perforce-1.9.4.jar
[INFO] Downloaded from central: https://repo.maven.apache.org/maven2/org/apache/maven/scm/maven-scm-provider-cvsexe/1.9.4/maven-scm-provider-cvsexe-1.9.4.jar (30 kB at 1.0 MB/s)
[INFO] Downloading from central: https://repo.maven.apache.org/maven2/org/apache/maven/scm/maven-scm-provider-hg/1.9.4/maven-scm-provider-hg-1.9.4.jar
[INFO] Downloaded from central: https://repo.maven.apache.org/maven2/org/apache/maven/scm/maven-scm-provider-cvs-commons/1.9.4/maven-scm-provider-cvs-commons-1.9.4.jar (76 kB at 2.4 MB/s)
[INFO] Downloading from central: https://repo.maven.apache.org/maven2/com/google/code/maven-scm-provider-svnjava/maven-scm-provider-svnjava/2.1.1/maven-scm-provider-svnjava-2.1.1.jar
[INFO] Downloaded from central: https://repo.maven.apache.org/maven2/org/apache/maven/scm/maven-scm-provider-starteam/1.9.4/maven-scm-provider-starteam-1.9.4.jar (71 kB at 2.1 MB/s)
[INFO] Downloading from central: https://repo.maven.apache.org/maven2/net/java/dev/jna/jna/3.5.2/jna-3.5.2.jar
[INFO] Downloaded from central: https://repo.maven.apache.org/maven2/org/apache/maven/scm/maven-scm-provider-clearcase/1.9.4/maven-scm-provider-clearcase-1.9.4.jar (68 kB at 1.7 MB/s)
[INFO] Downloaded from central: https://repo.maven.apache.org/maven2/org/apache/maven/scm/maven-scm-provider-perforce/1.9.4/maven-scm-provider-perforce-1.9.4.jar (83 kB at 2.1 MB/s)
[INFO] Downloading from central: https://repo.maven.apache.org/maven2/org/tmatesoft/svnkit/svnkit/1.8.5/svnkit-1.8.5.jar
[INFO] Downloading from central: https://repo.maven.apache.org/maven2/com/jcraft/jsch.agentproxy.svnkit-trilead-ssh2/0.0.7/jsch.agentproxy.svnkit-trilead-ssh2-0.0.7.jar
[INFO] Downloaded from central: https://repo.maven.apache.org/maven2/com/google/code/maven-scm-provider-svnjava/maven-scm-provider-svnjava/2.1.1/maven-scm-provider-svnjava-2.1.1.jar (62 kB at 1.4 MB/s)
[INFO] Downloading from central: https://repo.maven.apache.org/maven2/com/jcraft/jsch.agentproxy.core/0.0.7/jsch.agentproxy.core-0.0.7.jar
[INFO] Downloaded from central: https://repo.maven.apache.org/maven2/org/apache/maven/scm/maven-scm-provider-hg/1.9.4/maven-scm-provider-hg-1.9.4.jar (66 kB at 1.4 MB/s)
[INFO] Downloading from central: https://repo.maven.apache.org/maven2/org/tmatesoft/sqljet/sqljet/1.1.10/sqljet-1.1.10.jar
[INFO] Downloaded from central: https://repo.maven.apache.org/maven2/com/jcraft/jsch.agentproxy.core/0.0.7/jsch.agentproxy.core-0.0.7.jar (9.6 kB at 168 kB/s)
[INFO] Downloading from central: https://repo.maven.apache.org/maven2/org/antlr/antlr-runtime/3.4/antlr-runtime-3.4.jar
[INFO] Downloaded from central: https://repo.maven.apache.org/maven2/net/java/dev/jna/jna/3.5.2/jna-3.5.2.jar (692 kB at 11 MB/s)
[INFO] Downloading from central: https://repo.maven.apache.org/maven2/net/java/dev/jna/platform/3.5.2/platform-3.5.2.jar
[INFO] Downloaded from central: https://repo.maven.apache.org/maven2/com/jcraft/jsch.agentproxy.svnkit-trilead-ssh2/0.0.7/jsch.agentproxy.svnkit-trilead-ssh2-0.0.7.jar (3.8 kB at 57 kB/s)
[INFO] Downloading from central: https://repo.maven.apache.org/maven2/com/jcraft/jsch.agentproxy.connector-factory/0.0.7/jsch.agentproxy.connector-factory-0.0.7.jar
[INFO] Downloaded from central: https://repo.maven.apache.org/maven2/org/antlr/antlr-runtime/3.4/antlr-runtime-3.4.jar (164 kB at 2.3 MB/s)
[INFO] Downloading from central: https://repo.maven.apache.org/maven2/com/jcraft/jsch.agentproxy.usocket-jna/0.0.7/jsch.agentproxy.usocket-jna-0.0.7.jar
[INFO] Downloaded from central: https://repo.maven.apache.org/maven2/com/jcraft/jsch.agentproxy.connector-factory/0.0.7/jsch.agentproxy.connector-factory-0.0.7.jar (12 kB at 155 kB/s)
[INFO] Downloading from central: https://repo.maven.apache.org/maven2/com/jcraft/jsch.agentproxy.usocket-nc/0.0.7/jsch.agentproxy.usocket-nc-0.0.7.jar
[INFO] Downloaded from central: https://repo.maven.apache.org/maven2/com/jcraft/jsch.agentproxy.usocket-nc/0.0.7/jsch.agentproxy.usocket-nc-0.0.7.jar (5.3 kB at 59 kB/s)
[INFO] Downloading from central: https://repo.maven.apache.org/maven2/com/jcraft/jsch.agentproxy.sshagent/0.0.7/jsch.agentproxy.sshagent-0.0.7.jar
[INFO] Downloaded from central: https://repo.maven.apache.org/maven2/org/tmatesoft/sqljet/sqljet/1.1.10/sqljet-1.1.10.jar (762 kB at 7.5 MB/s)
[INFO] Downloading from central: https://repo.maven.apache.org/maven2/com/jcraft/jsch.agentproxy.pageant/0.0.7/jsch.agentproxy.pageant-0.0.7.jar
[INFO] Downloaded from central: https://repo.maven.apache.org/maven2/com/jcraft/jsch.agentproxy.sshagent/0.0.7/jsch.agentproxy.sshagent-0.0.7.jar (4.2 kB at 40 kB/s)
[INFO] Downloading from central: https://repo.maven.apache.org/maven2/de/regnis/q/sequence/sequence-library/1.0.2/sequence-library-1.0.2.jar
[INFO] Downloaded from central: https://repo.maven.apache.org/maven2/com/jcraft/jsch.agentproxy.usocket-jna/0.0.7/jsch.agentproxy.usocket-jna-0.0.7.jar (6.6 kB at 64 kB/s)
[INFO] Downloading from central: https://repo.maven.apache.org/maven2/com/trilead/trilead-ssh2/1.0.0-build217/trilead-ssh2-1.0.0-build217.jar
[INFO] Downloaded from central: https://repo.maven.apache.org/maven2/com/jcraft/jsch.agentproxy.pageant/0.0.7/jsch.agentproxy.pageant-0.0.7.jar (7.8 kB at 69 kB/s)
[INFO] Downloaded from central: https://repo.maven.apache.org/maven2/de/regnis/q/sequence/sequence-library/1.0.2/sequence-library-1.0.2.jar (71 kB at 604 kB/s)
[INFO] Downloaded from central: https://repo.maven.apache.org/maven2/net/java/dev/jna/platform/3.5.2/platform-3.5.2.jar (1.2 MB at 9.0 MB/s)
[INFO] Downloaded from central: https://repo.maven.apache.org/maven2/com/trilead/trilead-ssh2/1.0.0-build217/trilead-ssh2-1.0.0-build217.jar (250 kB at 1.9 MB/s)
[INFO] Downloaded from central: https://repo.maven.apache.org/maven2/org/tmatesoft/svnkit/svnkit/1.8.5/svnkit-1.8.5.jar (3.8 MB at 17 MB/s)
[INFO] 
[INFO] --- buildnumber-maven-plugin:1.4:create (create-buildnumber) @ maven-core ---
[INFO] Executing: /bin/sh -c cd '/home/jenkins/jenkins-slave/workspace/maven-box_maven_MNG-6386-LLX2LHIUAZ6VGRI3GUJ4WEAJPQUEJ2QQDYWXUIGOMQPZI7AFSMBA/build/maven-core' && 'git' 'rev-parse' '--verify' 'HEAD'
[INFO] Working directory: /home/jenkins/jenkins-slave/workspace/maven-box_maven_MNG-6386-LLX2LHIUAZ6VGRI3GUJ4WEAJPQUEJ2QQDYWXUIGOMQPZI7AFSMBA/build/maven-core
[INFO] Storing buildNumber: acab7abb34bfa296effa0c74f3671286dc54c7f5 at timestamp: 1525631764033
[WARNING] Cannot get the branch information from the git repository: 
Detecting the current branch failed: fatal: ref HEAD is not a symbolic ref

[INFO] Executing: /bin/sh -c cd '/home/jenkins/jenkins-slave/workspace/maven-box_maven_MNG-6386-LLX2LHIUAZ6VGRI3GUJ4WEAJPQUEJ2QQDYWXUIGOMQPZI7AFSMBA/build/maven-core' && 'git' 'rev-parse' '--verify' 'HEAD'
[INFO] Working directory: /home/jenkins/jenkins-slave/workspace/maven-box_maven_MNG-6386-LLX2LHIUAZ6VGRI3GUJ4WEAJPQUEJ2QQDYWXUIGOMQPZI7AFSMBA/build/maven-core
[INFO] Storing buildScmBranch: UNKNOWN
[INFO] 
[INFO] --- modello-maven-plugin:1.9.1:java (modello) @ maven-core ---
[INFO] outputDirectory: /home/jenkins/jenkins-slave/workspace/maven-box_maven_MNG-6386-LLX2LHIUAZ6VGRI3GUJ4WEAJPQUEJ2QQDYWXUIGOMQPZI7AFSMBA/build/maven-core/target/generated-sources/modello
[INFO] Working on model: src/main/mdo/toolchains.mdo
[INFO] Generating current version: 1.1.0
[INFO] 
[INFO] --- modello-maven-plugin:1.9.1:xpp3-reader (modello) @ maven-core ---
[INFO] outputDirectory: /home/jenkins/jenkins-slave/workspace/maven-box_maven_MNG-6386-LLX2LHIUAZ6VGRI3GUJ4WEAJPQUEJ2QQDYWXUIGOMQPZI7AFSMBA/build/maven-core/target/generated-sources/modello
[INFO] Working on model: src/main/mdo/toolchains.mdo
[INFO] Generating current version: 1.1.0
[INFO] 
[INFO] --- modello-maven-plugin:1.9.1:xpp3-writer (modello) @ maven-core ---
[INFO] outputDirectory: /home/jenkins/jenkins-slave/workspace/maven-box_maven_MNG-6386-LLX2LHIUAZ6VGRI3GUJ4WEAJPQUEJ2QQDYWXUIGOMQPZI7AFSMBA/build/maven-core/target/generated-sources/modello
[INFO] Working on model: src/main/mdo/toolchains.mdo
[INFO] Generating current version: 1.1.0
[INFO] 
[INFO] --- maven-remote-resources-plugin:1.5:process (process-resource-bundles) @ maven-core ---
[INFO] 
[INFO] --- maven-resources-plugin:3.0.2:resources (default-resources) @ maven-core ---
[INFO] Using 'UTF-8' encoding to copy filtered resources.
[INFO] Copying 6 resources
[INFO] Copying 3 resources
[INFO] 
[INFO] --- maven-compiler-plugin:3.7.0:compile (default-compile) @ maven-core ---
[INFO] Changes detected - recompiling the module!
[INFO] Compiling 339 source files to /home/jenkins/jenkins-slave/workspace/maven-box_maven_MNG-6386-LLX2LHIUAZ6VGRI3GUJ4WEAJPQUEJ2QQDYWXUIGOMQPZI7AFSMBA/build/maven-core/target/classes
[INFO] /home/jenkins/jenkins-slave/workspace/maven-box_maven_MNG-6386-LLX2LHIUAZ6VGRI3GUJ4WEAJPQUEJ2QQDYWXUIGOMQPZI7AFSMBA/build/maven-core/src/main/java/org/apache/maven/artifact/repository/MavenArtifactRepository.java: Some input files use or override a deprecated API.
[INFO] /home/jenkins/jenkins-slave/workspace/maven-box_maven_MNG-6386-LLX2LHIUAZ6VGRI3GUJ4WEAJPQUEJ2QQDYWXUIGOMQPZI7AFSMBA/build/maven-core/src/main/java/org/apache/maven/artifact/repository/MavenArtifactRepository.java: Recompile with -Xlint:deprecation for details.
[INFO] /home/jenkins/jenkins-slave/workspace/maven-box_maven_MNG-6386-LLX2LHIUAZ6VGRI3GUJ4WEAJPQUEJ2QQDYWXUIGOMQPZI7AFSMBA/build/maven-core/target/generated-sources/modello/org/apache/maven/toolchain/model/io/xpp3/MavenToolchainsXpp3Reader.java: /home/jenkins/jenkins-slave/workspace/maven-box_maven_MNG-6386-LLX2LHIUAZ6VGRI3GUJ4WEAJPQUEJ2QQDYWXUIGOMQPZI7AFSMBA/build/maven-core/target/generated-sources/modello/org/apache/maven/toolchain/model/io/xpp3/MavenToolchainsXpp3Reader.java uses unchecked or unsafe operations.
[INFO] /home/jenkins/jenkins-slave/workspace/maven-box_maven_MNG-6386-LLX2LHIUAZ6VGRI3GUJ4WEAJPQUEJ2QQDYWXUIGOMQPZI7AFSMBA/build/maven-core/target/generated-sources/modello/org/apache/maven/toolchain/model/io/xpp3/MavenToolchainsXpp3Reader.java: Recompile with -Xlint:unchecked for details.
[INFO] 
[INFO] --- animal-sniffer-maven-plugin:1.15:check (check-java-compat) @ maven-core ---
[INFO] Checking unresolved references to org.codehaus.mojo.signature:java17:1.0
[INFO] 
[INFO] --- plexus-component-metadata:1.7.1:generate-metadata (default) @ maven-core ---
[INFO] Discovered 58 component descriptors(s)
[INFO] 
[INFO] --- sisu-maven-plugin:0.3.3:main-index (default) @ maven-core ---
[INFO] 
[INFO] --- maven-resources-plugin:3.0.2:testResources (default-testResources) @ maven-core ---
[INFO] Using 'UTF-8' encoding to copy filtered resources.
[INFO] Copying 231 resources
[INFO] Copying 3 resources
[INFO] 
[INFO] --- maven-compiler-plugin:3.7.0:testCompile (default-testCompile) @ maven-core ---
[INFO] Changes detected - recompiling the module!
[INFO] Compiling 85 source files to /home/jenkins/jenkins-slave/workspace/maven-box_maven_MNG-6386-LLX2LHIUAZ6VGRI3GUJ4WEAJPQUEJ2QQDYWXUIGOMQPZI7AFSMBA/build/maven-core/target/test-classes
[INFO] /home/jenkins/jenkins-slave/workspace/maven-box_maven_MNG-6386-LLX2LHIUAZ6VGRI3GUJ4WEAJPQUEJ2QQDYWXUIGOMQPZI7AFSMBA/build/maven-core/src/test/java/org/apache/maven/project/artifact/DefaultMavenMetadataCacheTest.java: Some input files use or override a deprecated API.
[INFO] /home/jenkins/jenkins-slave/workspace/maven-box_maven_MNG-6386-LLX2LHIUAZ6VGRI3GUJ4WEAJPQUEJ2QQDYWXUIGOMQPZI7AFSMBA/build/maven-core/src/test/java/org/apache/maven/project/artifact/DefaultMavenMetadataCacheTest.java: Recompile with -Xlint:deprecation for details.
[INFO] 
[INFO] --- plexus-component-metadata:1.7.1:generate-test-metadata (default) @ maven-core ---
[INFO] Discovered 4 component descriptors(s)
[INFO] 
[INFO] --- sisu-maven-plugin:0.3.3:test-index (default) @ maven-core ---
[INFO] 
[INFO] --- maven-surefire-plugin:2.20.1:test (default-test) @ maven-core ---
[INFO] Surefire report directory: /home/jenkins/jenkins-slave/workspace/maven-box_maven_MNG-6386-LLX2LHIUAZ6VGRI3GUJ4WEAJPQUEJ2QQDYWXUIGOMQPZI7AFSMBA/build/maven-core/target/surefire-reports
[INFO] 
[INFO] -------------------------------------------------------
[INFO]  T E S T S
[INFO] -------------------------------------------------------
[INFO] Running org.apache.maven.ProjectDependenciesResolverTest
[INFO] Tests run: 2, Failures: 0, Errors: 0, Skipped: 0, Time elapsed: 2.212 s - in org.apache.maven.ProjectDependenciesResolverTest
[INFO] Running org.apache.maven.settings.PomConstructionWithSettingsTest
[INFO] Tests run: 3, Failures: 0, Errors: 0, Skipped: 0, Time elapsed: 1.079 s - in org.apache.maven.settings.PomConstructionWithSettingsTest
[INFO] Running org.apache.maven.settings.SettingsUtilsTest
[INFO] Tests run: 2, Failures: 0, Errors: 0, Skipped: 0, Time elapsed: 0.002 s - in org.apache.maven.settings.SettingsUtilsTest
[INFO] Running org.apache.maven.execution.DefaultMavenExecutionRequestPopulatorTest
[INFO] Tests run: 1, Failures: 0, Errors: 0, Skipped: 0, Time elapsed: 1.603 s - in org.apache.maven.execution.DefaultMavenExecutionRequestPopulatorTest
[INFO] Running org.apache.maven.execution.DefaultMavenExecutionTest
[INFO] Tests run: 2, Failures: 0, Errors: 0, Skipped: 0, Time elapsed: 0 s - in org.apache.maven.execution.DefaultMavenExecutionTest
[INFO] Running org.apache.maven.execution.scope.internal.MojoExecutionScopeTest
[INFO] Tests run: 2, Failures: 0, Errors: 0, Skipped: 0, Time elapsed: 0.002 s - in org.apache.maven.execution.scope.internal.MojoExecutionScopeTest
[INFO] Running org.apache.maven.MavenTest
[INFO] Tests run: 1, Failures: 0, Errors: 0, Skipped: 0, Time elapsed: 0.309 s - in org.apache.maven.MavenTest
[INFO] Running org.apache.maven.project.DefaultMavenProjectBuilderTest
[INFO] Tests run: 11, Failures: 0, Errors: 0, Skipped: 0, Time elapsed: 2.125 s - in org.apache.maven.project.DefaultMavenProjectBuilderTest
[INFO] Running org.apache.maven.project.ProjectSorterTest
[INFO] Tests run: 12, Failures: 0, Errors: 0, Skipped: 0, Time elapsed: 0.01 s - in org.apache.maven.project.ProjectSorterTest
[INFO] Running org.apache.maven.project.MavenProjectTest
[INFO] Tests run: 9, Failures: 0, Errors: 0, Skipped: 0, Time elapsed: 1.027 s - in org.apache.maven.project.MavenProjectTest
[INFO] Running org.apache.maven.project.artifact.MavenMetadataSourceTest
[INFO] Tests run: 1, Failures: 0, Errors: 0, Skipped: 0, Time elapsed: 0.041 s - in org.apache.maven.project.artifact.MavenMetadataSourceTest
[INFO] Running org.apache.maven.project.artifact.DefaultMavenMetadataCacheTest
[INFO] Tests run: 1, Failures: 0, Errors: 0, Skipped: 0, Time elapsed: 0.032 s - in org.apache.maven.project.artifact.DefaultMavenMetadataCacheTest
[INFO] Running org.apache.maven.project.PomConstructionTest
Aborted by michaelo
Sending interrupt signal to process
[INFO] 
[INFO] Results:
[INFO] 
[INFO] Tests run: 47, Failures: 0, Errors: 0, Skipped: 0
[INFO] 
[ERROR] There are test failures.

Please refer to /home/jenkins/jenkins-slave/workspace/maven-box_maven_MNG-6386-LLX2LHIUAZ6VGRI3GUJ4WEAJPQUEJ2QQDYWXUIGOMQPZI7AFSMBA/build/maven-core/target/surefire-reports for the individual test results.
Please refer to dump files (if any exist) [date]-jvmRun[N].dump, [date].dumpstream and [date]-jvmRun[N].dumpstream.
The forked VM terminated without properly saying goodbye. VM crash or System.exit called?
Command was /bin/sh -c cd /home/jenkins/jenkins-slave/workspace/maven-box_maven_MNG-6386-LLX2LHIUAZ6VGRI3GUJ4WEAJPQUEJ2QQDYWXUIGOMQPZI7AFSMBA/build/maven-core && /usr/local/asfpackages/java/jdk1.7.0_80/jre/bin/java -Xmx256m -jar /home/jenkins/jenkins-slave/workspace/maven-box_maven_MNG-6386-LLX2LHIUAZ6VGRI3GUJ4WEAJPQUEJ2QQDYWXUIGOMQPZI7AFSMBA/build/maven-core/target/surefire/surefirebooter5932281993363733664.jar /home/jenkins/jenkins-slave/workspace/maven-box_maven_MNG-6386-LLX2LHIUAZ6VGRI3GUJ4WEAJPQUEJ2QQDYWXUIGOMQPZI7AFSMBA/build/maven-core/target/surefire 2018-05-06T18-35-25_862-jvmRun1 surefire7894086473211242983tmp surefire_71420109560622823540tmp
Error occurred in starting fork, check output in log
Process Exit Code: 143
Crashed tests:
org.apache.maven.project.PomConstructionTest
org.apache.maven.surefire.booter.SurefireBooterForkException: The forked VM terminated without properly saying goodbye. VM crash or System.exit called?
Command was /bin/sh -c cd /home/jenkins/jenkins-slave/workspace/maven-box_maven_MNG-6386-LLX2LHIUAZ6VGRI3GUJ4WEAJPQUEJ2QQDYWXUIGOMQPZI7AFSMBA/build/maven-core && /usr/local/asfpackages/java/jdk1.7.0_80/jre/bin/java -Xmx256m -jar /home/jenkins/jenkins-slave/workspace/maven-box_maven_MNG-6386-LLX2LHIUAZ6VGRI3GUJ4WEAJPQUEJ2QQDYWXUIGOMQPZI7AFSMBA/build/maven-core/target/surefire/surefirebooter5932281993363733664.jar /home/jenkins/jenkins-slave/workspace/maven-box_maven_MNG-6386-LLX2LHIUAZ6VGRI3GUJ4WEAJPQUEJ2QQDYWXUIGOMQPZI7AFSMBA/build/maven-core/target/surefire 2018-05-06T18-35-25_862-jvmRun1 surefire7894086473211242983tmp surefire_71420109560622823540tmp
Error occurred in starting fork, check output in log
Process Exit Code: 143
Crashed tests:
org.apache.maven.project.PomConstructionTest
	at org.apache.maven.plugin.surefire.booterclient.ForkStarter.fork(ForkStarter.java:686)
	at org.apache.maven.plugin.surefire.booterclient.ForkStarter.fork(ForkStarter.java:535)
	at org.apache.maven.plugin.surefire.booterclient.ForkStarter.run(ForkStarter.java:280)
	at org.apache.maven.plugin.surefire.booterclient.ForkStarter.run(ForkStarter.java:245)
	at org.apache.maven.plugin.surefire.AbstractSurefireMojo.executeProvider(AbstractSurefireMojo.java:1124)
	at org.apache.maven.plugin.surefire.AbstractSurefireMojo.executeAfterPreconditionsChecked(AbstractSurefireMojo.java:954)
	at org.apache.maven.plugin.surefire.AbstractSurefireMojo.execute(AbstractSurefireMojo.java:832)
	at org.apache.maven.plugin.DefaultBuildPluginManager.executeMojo(DefaultBuildPluginManager.java:134)
	at org.apache.maven.lifecycle.internal.MojoExecutor.execute(MojoExecutor.java:208)
	at org.apache.maven.lifecycle.internal.MojoExecutor.execute(MojoExecutor.java:154)
	at org.apache.maven.lifecycle.internal.MojoExecutor.execute(MojoExecutor.java:146)
	at org.apache.maven.lifecycle.internal.LifecycleModuleBuilder.buildProject(LifecycleModuleBuilder.java:117)
	at org.apache.maven.lifecycle.internal.LifecycleModuleBuilder.buildProject(LifecycleModuleBuilder.java:81)
	at org.apache.maven.lifecycle.internal.builder.singlethreaded.SingleThreadedBuilder.build(SingleThreadedBuilder.java:51)
	at org.apache.maven.lifecycle.internal.LifecycleStarter.execute(LifecycleStarter.java:128)
	at org.apache.maven.DefaultMaven.doExecute(DefaultMaven.java:309)
	at org.apache.maven.DefaultMaven.doExecute(DefaultMaven.java:194)
	at org.apache.maven.DefaultMaven.execute(DefaultMaven.java:107)
	at org.apache.maven.cli.MavenCli.execute(MavenCli.java:955)
	at org.apache.maven.cli.MavenCli.doMain(MavenCli.java:290)
	at org.apache.maven.cli.MavenCli.main(MavenCli.java:194)
	at sun.reflect.NativeMethodAccessorImpl.invoke0(Native Method)
	at sun.reflect.NativeMethodAccessorImpl.invoke(NativeMethodAccessorImpl.java:57)
	at sun.reflect.DelegatingMethodAccessorImpl.invoke(DelegatingMethodAccessorImpl.java:43)
	at java.lang.reflect.Method.invoke(Method.java:606)
	at org.codehaus.plexus.classworlds.launcher.Launcher.launchEnhanced(Launcher.java:289)
	at org.codehaus.plexus.classworlds.launcher.Launcher.launch(Launcher.java:229)
	at org.codehaus.plexus.classworlds.launcher.Launcher.mainWithExitCode(Launcher.java:415)
	at org.codehaus.plexus.classworlds.launcher.Launcher.main(Launcher.java:356)

[INFO] 
[INFO] --- maven-jar-plugin:3.0.2:jar (default-jar) @ maven-core ---
[INFO] Building jar: /home/jenkins/jenkins-slave/workspace/maven-box_maven_MNG-6386-LLX2LHIUAZ6VGRI3GUJ4WEAJPQUEJ2QQDYWXUIGOMQPZI7AFSMBA/build/maven-core/target/maven-core-3.5.4-SNAPSHOT.jar
[INFO] 
[INFO] --- maven-site-plugin:3.7:attach-descriptor (attach-descriptor) @ maven-core ---
[INFO] Skipping because packaging 'jar' is not pom.
[INFO] 
[INFO] --- maven-checkstyle-plugin:3.0.0:check (checkstyle-check) @ maven-core ---
Terminated
[Pipeline] }
[withMaven] One or multiple Maven executions have been ignored by the Jenkins Pipeline Maven Plugin because they have been interrupted before completion (1). See Pipeline Maven Plugin FAQ for more details.
[Pipeline] // withMaven
[Pipeline] }
[Pipeline] // stage
[Pipeline] }
[Pipeline] // dir
[Pipeline] }
[Pipeline] // node
[Pipeline] stage
[Pipeline] { (Notifications)
[Pipeline] echo
Build result: ABORTED
[Pipeline] jiraIssueSelector
[Pipeline] emailext

Build unstable in Jenkins: Maven TLP » maven » MNG-6386 #6

Posted by Apache Jenkins Server <je...@builds.apache.org>.
See https://builds.apache.org/job/maven-box/job/maven/job/MNG-6386/6/

Changes:

* Add .factorypath from m2e to .gitignore
* updated model version to latest 1.1.0
* [MNG-6386] ${project.baseUri} is not a valid URI (according to RFC 3986)

2 tests failed.
FAILED:  org.apache.maven.it.MavenITmng6386BaseUriPropertyTest.testitMNG6386UnicodeChars

Error Message:
got: <false>, expected: is <true>

Stack Trace:
org.junit.AssumptionViolatedException: got: <false>, expected: is <true>
	at org.apache.maven.it.MavenITmng6386BaseUriPropertyTest.testitMNG6386UnicodeChars(MavenITmng6386BaseUriPropertyTest.java:65)


FAILED:  org.apache.maven.it.MavenITmng6386BaseUriPropertyTest.testitMNG6386UnicodeChars

Error Message:
got: <false>, expected: is <true>

Stack Trace:
org.junit.AssumptionViolatedException: got: <false>, expected: is <true>
	at org.apache.maven.it.MavenITmng6386BaseUriPropertyTest.testitMNG6386UnicodeChars(MavenITmng6386BaseUriPropertyTest.java:65)




Build log:
[...truncated 6.25 MB...]
[winJava7] 	at org.jenkinsci.plugins.workflow.cps.CpsVmExecutorService$2.call(CpsVmExecutorService.java:64)
[winJava7] 	at java.util.concurrent.FutureTask.run(FutureTask.java:266)
[winJava7] 	at hudson.remoting.SingleLaneExecutorService$1.run(SingleLaneExecutorService.java:112)
[winJava7] 	at jenkins.util.ContextResettingExecutorService$1.run(ContextResettingExecutorService.java:28)
[winJava7] 	at java.util.concurrent.Executors$RunnableAdapter.call(Executors.java:511)
[winJava7] 	at java.util.concurrent.FutureTask.run(FutureTask.java:266)
[winJava7] 	at java.util.concurrent.ThreadPoolExecutor.runWorker(ThreadPoolExecutor.java:1149)
[winJava7] 	at java.util.concurrent.ThreadPoolExecutor$Worker.run(ThreadPoolExecutor.java:624)
[winJava7] 	at java.lang.Thread.run(Thread.java:748)
[winJava7] ERROR: [withMaven] artifactsPublisher - WARNING: Exception archiving and fingerprinting MavenArtifact{org.apache.maven.its.plugins:maven-it-plugins:xml:site:2.1-SNAPSHOT(version: 2.1-SNAPSHOT, snapshot:true)  C:\mvn-it-1.tmp\core-it-support\core-it-plugins\target\maven-it-plugins-2.1-SNAPSHOT-site.xml}, skip archiving of the artifacts
[winJava7] java.lang.IllegalArgumentException: Cannot relativize 'C:\mvn-it-1.tmp\core-it-support\core-it-plugins\target\maven-it-plugins-2.1-SNAPSHOT-site.xml' relatively to '/mvn-it-1.tmp'
[winJava7] 	at org.jenkinsci.plugins.pipeline.maven.util.XmlUtils.getPathInWorkspace(XmlUtils.java:396)
[winJava7] 	at org.jenkinsci.plugins.pipeline.maven.publishers.GeneratedArtifactsPublisher.process(GeneratedArtifactsPublisher.java:95)
[winJava7] 	at org.jenkinsci.plugins.pipeline.maven.MavenSpyLogProcessor.processMavenSpyLogs(MavenSpyLogProcessor.java:114)
[winJava7] 	at org.jenkinsci.plugins.pipeline.maven.WithMavenStepExecution$WorkspaceCleanupCallback.finished(WithMavenStepExecution.java:1015)
[winJava7] 	at org.jenkinsci.plugins.workflow.steps.BodyExecutionCallback$TailCall.onSuccess(BodyExecutionCallback.java:114)
[winJava7] 	at org.jenkinsci.plugins.workflow.cps.CpsBodyExecution$SuccessAdapter.receive(CpsBodyExecution.java:368)
[winJava7] 	at com.cloudbees.groovy.cps.Outcome.resumeFrom(Outcome.java:73)
[winJava7] 	at com.cloudbees.groovy.cps.Continuable$1.call(Continuable.java:166)
[winJava7] 	at com.cloudbees.groovy.cps.Continuable$1.call(Continuable.java:163)
[winJava7] 	at org.codehaus.groovy.runtime.GroovyCategorySupport$ThreadCategoryInfo.use(GroovyCategorySupport.java:122)
[winJava7] 	at org.codehaus.groovy.runtime.GroovyCategorySupport.use(GroovyCategorySupport.java:261)
[winJava7] 	at com.cloudbees.groovy.cps.Continuable.run0(Continuable.java:163)
[winJava7] 	at org.jenkinsci.plugins.workflow.cps.SandboxContinuable.access$001(SandboxContinuable.java:19)
[winJava7] 	at org.jenkinsci.plugins.workflow.cps.SandboxContinuable$1.call(SandboxContinuable.java:35)
[winJava7] 	at org.jenkinsci.plugins.workflow.cps.SandboxContinuable$1.call(SandboxContinuable.java:32)
[winJava7] 	at org.jenkinsci.plugins.scriptsecurity.sandbox.groovy.GroovySandbox.runInSandbox(GroovySandbox.java:108)
[winJava7] 	at org.jenkinsci.plugins.workflow.cps.SandboxContinuable.run0(SandboxContinuable.java:32)
[winJava7] 	at org.jenkinsci.plugins.workflow.cps.CpsThread.runNextChunk(CpsThread.java:174)
[winJava7] 	at org.jenkinsci.plugins.workflow.cps.CpsThreadGroup.run(CpsThreadGroup.java:331)
[winJava7] 	at org.jenkinsci.plugins.workflow.cps.CpsThreadGroup.access$200(CpsThreadGroup.java:82)
[winJava7] 	at org.jenkinsci.plugins.workflow.cps.CpsThreadGroup$2.call(CpsThreadGroup.java:243)
[winJava7] 	at org.jenkinsci.plugins.workflow.cps.CpsThreadGroup$2.call(CpsThreadGroup.java:231)
[winJava7] 	at org.jenkinsci.plugins.workflow.cps.CpsVmExecutorService$2.call(CpsVmExecutorService.java:64)
[winJava7] 	at java.util.concurrent.FutureTask.run(FutureTask.java:266)
[winJava7] 	at hudson.remoting.SingleLaneExecutorService$1.run(SingleLaneExecutorService.java:112)
[winJava7] 	at jenkins.util.ContextResettingExecutorService$1.run(ContextResettingExecutorService.java:28)
[winJava7] 	at java.util.concurrent.Executors$RunnableAdapter.call(Executors.java:511)
[winJava7] 	at java.util.concurrent.FutureTask.run(FutureTask.java:266)
[winJava7] 	at java.util.concurrent.ThreadPoolExecutor.runWorker(ThreadPoolExecutor.java:1149)
[winJava7] 	at java.util.concurrent.ThreadPoolExecutor$Worker.run(ThreadPoolExecutor.java:624)
[winJava7] 	at java.lang.Thread.run(Thread.java:748)
[winJava7] ERROR: [withMaven] artifactsPublisher - WARNING: Exception archiving and fingerprinting MavenArtifact{org.apache.maven.its.plugins:maven-it-plugin-core-stubs:xml:site:2.1-SNAPSHOT(version: 2.1-SNAPSHOT, snapshot:true)  C:\mvn-it-1.tmp\core-it-support\core-it-plugins\maven-it-plugin-core-stubs\target\maven-it-plugin-core-stubs-2.1-SNAPSHOT-site.xml}, skip archiving of the artifacts
[winJava7] java.lang.IllegalArgumentException: Cannot relativize 'C:\mvn-it-1.tmp\core-it-support\core-it-plugins\maven-it-plugin-core-stubs\target\maven-it-plugin-core-stubs-2.1-SNAPSHOT-site.xml' relatively to '/mvn-it-1.tmp'
[winJava7] 	at org.jenkinsci.plugins.pipeline.maven.util.XmlUtils.getPathInWorkspace(XmlUtils.java:396)
[winJava7] 	at org.jenkinsci.plugins.pipeline.maven.publishers.GeneratedArtifactsPublisher.process(GeneratedArtifactsPublisher.java:95)
[winJava7] 	at org.jenkinsci.plugins.pipeline.maven.MavenSpyLogProcessor.processMavenSpyLogs(MavenSpyLogProcessor.java:114)
[winJava7] 	at org.jenkinsci.plugins.pipeline.maven.WithMavenStepExecution$WorkspaceCleanupCallback.finished(WithMavenStepExecution.java:1015)
[winJava7] 	at org.jenkinsci.plugins.workflow.steps.BodyExecutionCallback$TailCall.onSuccess(BodyExecutionCallback.java:114)
[winJava7] 	at org.jenkinsci.plugins.workflow.cps.CpsBodyExecution$SuccessAdapter.receive(CpsBodyExecution.java:368)
[winJava7] 	at com.cloudbees.groovy.cps.Outcome.resumeFrom(Outcome.java:73)
[winJava7] 	at com.cloudbees.groovy.cps.Continuable$1.call(Continuable.java:166)
[winJava7] 	at com.cloudbees.groovy.cps.Continuable$1.call(Continuable.java:163)
[winJava7] 	at org.codehaus.groovy.runtime.GroovyCategorySupport$ThreadCategoryInfo.use(GroovyCategorySupport.java:122)
[winJava7] 	at org.codehaus.groovy.runtime.GroovyCategorySupport.use(GroovyCategorySupport.java:261)
[winJava7] 	at com.cloudbees.groovy.cps.Continuable.run0(Continuable.java:163)
[winJava7] 	at org.jenkinsci.plugins.workflow.cps.SandboxContinuable.access$001(SandboxContinuable.java:19)
[winJava7] 	at org.jenkinsci.plugins.workflow.cps.SandboxContinuable$1.call(SandboxContinuable.java:35)
[winJava7] 	at org.jenkinsci.plugins.workflow.cps.SandboxContinuable$1.call(SandboxContinuable.java:32)
[winJava7] 	at org.jenkinsci.plugins.scriptsecurity.sandbox.groovy.GroovySandbox.runInSandbox(GroovySandbox.java:108)
[winJava7] 	at org.jenkinsci.plugins.workflow.cps.SandboxContinuable.run0(SandboxContinuable.java:32)
[winJava7] 	at org.jenkinsci.plugins.workflow.cps.CpsThread.runNextChunk(CpsThread.java:174)
[winJava7] 	at org.jenkinsci.plugins.workflow.cps.CpsThreadGroup.run(CpsThreadGroup.java:331)
[winJava7] 	at org.jenkinsci.plugins.workflow.cps.CpsThreadGroup.access$200(CpsThreadGroup.java:82)
[winJava7] 	at org.jenkinsci.plugins.workflow.cps.CpsThreadGroup$2.call(CpsThreadGroup.java:243)
[winJava7] 	at org.jenkinsci.plugins.workflow.cps.CpsThreadGroup$2.call(CpsThreadGroup.java:231)
[winJava7] 	at org.jenkinsci.plugins.workflow.cps.CpsVmExecutorService$2.call(CpsVmExecutorService.java:64)
[winJava7] 	at java.util.concurrent.FutureTask.run(FutureTask.java:266)
[winJava7] 	at hudson.remoting.SingleLaneExecutorService$1.run(SingleLaneExecutorService.java:112)
[winJava7] 	at jenkins.util.ContextResettingExecutorService$1.run(ContextResettingExecutorService.java:28)
[winJava7] 	at java.util.concurrent.Executors$RunnableAdapter.call(Executors.java:511)
[winJava7] 	at java.util.concurrent.FutureTask.run(FutureTask.java:266)
[winJava7] 	at java.util.concurrent.ThreadPoolExecutor.runWorker(ThreadPoolExecutor.java:1149)
[winJava7] 	at java.util.concurrent.ThreadPoolExecutor$Worker.run(ThreadPoolExecutor.java:624)
[winJava7] 	at java.lang.Thread.run(Thread.java:748)
[winJava7] ERROR: [withMaven] artifactsPublisher - WARNING: Exception archiving and fingerprinting MavenArtifact{org.apache.maven.its:core-it-support-artifacts:zip:repo:2.1-SNAPSHOT(version: 2.1-SNAPSHOT, snapshot:true)  C:\mvn-it-1.tmp\core-it-support\core-it-support-artifacts\target\core-it-support-artifacts-2.1-SNAPSHOT-repo.zip}, skip archiving of the artifacts
[winJava7] java.lang.IllegalArgumentException: Cannot relativize 'C:\mvn-it-1.tmp\core-it-support\core-it-support-artifacts\target\core-it-support-artifacts-2.1-SNAPSHOT-repo.zip' relatively to '/mvn-it-1.tmp'
[winJava7] 	at org.jenkinsci.plugins.pipeline.maven.util.XmlUtils.getPathInWorkspace(XmlUtils.java:396)
[winJava7] 	at org.jenkinsci.plugins.pipeline.maven.publishers.GeneratedArtifactsPublisher.process(GeneratedArtifactsPublisher.java:95)
[winJava7] 	at org.jenkinsci.plugins.pipeline.maven.MavenSpyLogProcessor.processMavenSpyLogs(MavenSpyLogProcessor.java:114)
[winJava7] 	at org.jenkinsci.plugins.pipeline.maven.WithMavenStepExecution$WorkspaceCleanupCallback.finished(WithMavenStepExecution.java:1015)
[winJava7] 	at org.jenkinsci.plugins.workflow.steps.BodyExecutionCallback$TailCall.onSuccess(BodyExecutionCallback.java:114)
[winJava7] 	at org.jenkinsci.plugins.workflow.cps.CpsBodyExecution$SuccessAdapter.receive(CpsBodyExecution.java:368)
[winJava7] 	at com.cloudbees.groovy.cps.Outcome.resumeFrom(Outcome.java:73)
[winJava7] 	at com.cloudbees.groovy.cps.Continuable$1.call(Continuable.java:166)
[winJava7] 	at com.cloudbees.groovy.cps.Continuable$1.call(Continuable.java:163)
[winJava7] 	at org.codehaus.groovy.runtime.GroovyCategorySupport$ThreadCategoryInfo.use(GroovyCategorySupport.java:122)
[winJava7] 	at org.codehaus.groovy.runtime.GroovyCategorySupport.use(GroovyCategorySupport.java:261)
[winJava7] 	at com.cloudbees.groovy.cps.Continuable.run0(Continuable.java:163)
[winJava7] 	at org.jenkinsci.plugins.workflow.cps.SandboxContinuable.access$001(SandboxContinuable.java:19)
[winJava7] 	at org.jenkinsci.plugins.workflow.cps.SandboxContinuable$1.call(SandboxContinuable.java:35)
[winJava7] 	at org.jenkinsci.plugins.workflow.cps.SandboxContinuable$1.call(SandboxContinuable.java:32)
[winJava7] 	at org.jenkinsci.plugins.scriptsecurity.sandbox.groovy.GroovySandbox.runInSandbox(GroovySandbox.java:108)
[winJava7] 	at org.jenkinsci.plugins.workflow.cps.SandboxContinuable.run0(SandboxContinuable.java:32)
[winJava7] 	at org.jenkinsci.plugins.workflow.cps.CpsThread.runNextChunk(CpsThread.java:174)
[winJava7] 	at org.jenkinsci.plugins.workflow.cps.CpsThreadGroup.run(CpsThreadGroup.java:331)
[winJava7] 	at org.jenkinsci.plugins.workflow.cps.CpsThreadGroup.access$200(CpsThreadGroup.java:82)
[winJava7] 	at org.jenkinsci.plugins.workflow.cps.CpsThreadGroup$2.call(CpsThreadGroup.java:243)
[winJava7] 	at org.jenkinsci.plugins.workflow.cps.CpsThreadGroup$2.call(CpsThreadGroup.java:231)
[winJava7] 	at org.jenkinsci.plugins.workflow.cps.CpsVmExecutorService$2.call(CpsVmExecutorService.java:64)
[winJava7] 	at java.util.concurrent.FutureTask.run(FutureTask.java:266)
[winJava7] 	at hudson.remoting.SingleLaneExecutorService$1.run(SingleLaneExecutorService.java:112)
[winJava7] 	at jenkins.util.ContextResettingExecutorService$1.run(ContextResettingExecutorService.java:28)
[winJava7] 	at java.util.concurrent.Executors$RunnableAdapter.call(Executors.java:511)
[winJava7] 	at java.util.concurrent.FutureTask.run(FutureTask.java:266)
[winJava7] 	at java.util.concurrent.ThreadPoolExecutor.runWorker(ThreadPoolExecutor.java:1149)
[winJava7] 	at java.util.concurrent.ThreadPoolExecutor$Worker.run(ThreadPoolExecutor.java:624)
[winJava7] 	at java.lang.Thread.run(Thread.java:748)
[winJava7] ERROR: [withMaven] artifactsPublisher - WARNING: Exception archiving and fingerprinting MavenArtifact{org.apache.maven.its:core-it-suite:test-jar:tests:2.1-SNAPSHOT(version: 2.1-SNAPSHOT, snapshot:true)  C:\mvn-it-1.tmp\core-it-suite\target\core-it-suite-2.1-SNAPSHOT-tests.jar}, skip archiving of the artifacts
[winJava7] java.lang.IllegalArgumentException: Cannot relativize 'C:\mvn-it-1.tmp\core-it-suite\target\core-it-suite-2.1-SNAPSHOT-tests.jar' relatively to '/mvn-it-1.tmp'
[winJava7] 	at org.jenkinsci.plugins.pipeline.maven.util.XmlUtils.getPathInWorkspace(XmlUtils.java:396)
[winJava7] 	at org.jenkinsci.plugins.pipeline.maven.publishers.GeneratedArtifactsPublisher.process(GeneratedArtifactsPublisher.java:95)
[winJava7] 	at org.jenkinsci.plugins.pipeline.maven.MavenSpyLogProcessor.processMavenSpyLogs(MavenSpyLogProcessor.java:114)
[winJava7] 	at org.jenkinsci.plugins.pipeline.maven.WithMavenStepExecution$WorkspaceCleanupCallback.finished(WithMavenStepExecution.java:1015)
[winJava7] 	at org.jenkinsci.plugins.workflow.steps.BodyExecutionCallback$TailCall.onSuccess(BodyExecutionCallback.java:114)
[winJava7] 	at org.jenkinsci.plugins.workflow.cps.CpsBodyExecution$SuccessAdapter.receive(CpsBodyExecution.java:368)
[winJava7] 	at com.cloudbees.groovy.cps.Outcome.resumeFrom(Outcome.java:73)
[winJava7] 	at com.cloudbees.groovy.cps.Continuable$1.call(Continuable.java:166)
[winJava7] 	at com.cloudbees.groovy.cps.Continuable$1.call(Continuable.java:163)
[winJava7] 	at org.codehaus.groovy.runtime.GroovyCategorySupport$ThreadCategoryInfo.use(GroovyCategorySupport.java:122)
[winJava7] 	at org.codehaus.groovy.runtime.GroovyCategorySupport.use(GroovyCategorySupport.java:261)
[winJava7] 	at com.cloudbees.groovy.cps.Continuable.run0(Continuable.java:163)
[winJava7] 	at org.jenkinsci.plugins.workflow.cps.SandboxContinuable.access$001(SandboxContinuable.java:19)
[winJava7] 	at org.jenkinsci.plugins.workflow.cps.SandboxContinuable$1.call(SandboxContinuable.java:35)
[winJava7] 	at org.jenkinsci.plugins.workflow.cps.SandboxContinuable$1.call(SandboxContinuable.java:32)
[winJava7] 	at org.jenkinsci.plugins.scriptsecurity.sandbox.groovy.GroovySandbox.runInSandbox(GroovySandbox.java:108)
[winJava7] 	at org.jenkinsci.plugins.workflow.cps.SandboxContinuable.run0(SandboxContinuable.java:32)
[winJava7] 	at org.jenkinsci.plugins.workflow.cps.CpsThread.runNextChunk(CpsThread.java:174)
[winJava7] 	at org.jenkinsci.plugins.workflow.cps.CpsThreadGroup.run(CpsThreadGroup.java:331)
[winJava7] 	at org.jenkinsci.plugins.workflow.cps.CpsThreadGroup.access$200(CpsThreadGroup.java:82)
[winJava7] 	at org.jenkinsci.plugins.workflow.cps.CpsThreadGroup$2.call(CpsThreadGroup.java:243)
[winJava7] 	at org.jenkinsci.plugins.workflow.cps.CpsThreadGroup$2.call(CpsThreadGroup.java:231)
[winJava7] 	at org.jenkinsci.plugins.workflow.cps.CpsVmExecutorService$2.call(CpsVmExecutorService.java:64)
[winJava7] 	at java.util.concurrent.FutureTask.run(FutureTask.java:266)
[winJava7] 	at hudson.remoting.SingleLaneExecutorService$1.run(SingleLaneExecutorService.java:112)
[winJava7] 	at jenkins.util.ContextResettingExecutorService$1.run(ContextResettingExecutorService.java:28)
[winJava7] 	at java.util.concurrent.Executors$RunnableAdapter.call(Executors.java:511)
[winJava7] 	at java.util.concurrent.FutureTask.run(FutureTask.java:266)
[winJava7] 	at java.util.concurrent.ThreadPoolExecutor.runWorker(ThreadPoolExecutor.java:1149)
[winJava7] 	at java.util.concurrent.ThreadPoolExecutor$Worker.run(ThreadPoolExecutor.java:624)
[winJava7] 	at java.lang.Thread.run(Thread.java:748)
[winJava7] ERROR: [withMaven] WARNING Exception executing Maven reporter 'Junit Publisher' / org.jenkinsci.plugins.pipeline.maven.publishers.JunitTestsPublisher. Please report a bug associated for the component 'pipeline-maven-plugin' at https://issues.jenkins-ci.org 
[winJava7] java.lang.IllegalArgumentException: Cannot relativize 'C:\mvn-it-1.tmp\core-it-support\core-it-plugins\maven-it-plugin-active-collection\target/surefire-reports' relatively to '/mvn-it-1.tmp'
[winJava7] 	at org.jenkinsci.plugins.pipeline.maven.util.XmlUtils.getPathInWorkspace(XmlUtils.java:396)
[winJava7] 	at org.jenkinsci.plugins.pipeline.maven.publishers.JunitTestsPublisher.executeReporter(JunitTestsPublisher.java:236)
[winJava7] 	at org.jenkinsci.plugins.pipeline.maven.publishers.JunitTestsPublisher.process(JunitTestsPublisher.java:182)
[winJava7] 	at org.jenkinsci.plugins.pipeline.maven.MavenSpyLogProcessor.processMavenSpyLogs(MavenSpyLogProcessor.java:114)
[winJava7] 	at org.jenkinsci.plugins.pipeline.maven.WithMavenStepExecution$WorkspaceCleanupCallback.finished(WithMavenStepExecution.java:1015)
[winJava7] 	at org.jenkinsci.plugins.workflow.steps.BodyExecutionCallback$TailCall.onSuccess(BodyExecutionCallback.java:114)
[winJava7] 	at org.jenkinsci.plugins.workflow.cps.CpsBodyExecution$SuccessAdapter.receive(CpsBodyExecution.java:368)
[winJava7] 	at com.cloudbees.groovy.cps.Outcome.resumeFrom(Outcome.java:73)
[winJava7] 	at com.cloudbees.groovy.cps.Continuable$1.call(Continuable.java:166)
[winJava7] 	at com.cloudbees.groovy.cps.Continuable$1.call(Continuable.java:163)
[winJava7] 	at org.codehaus.groovy.runtime.GroovyCategorySupport$ThreadCategoryInfo.use(GroovyCategorySupport.java:122)
[winJava7] 	at org.codehaus.groovy.runtime.GroovyCategorySupport.use(GroovyCategorySupport.java:261)
[winJava7] 	at com.cloudbees.groovy.cps.Continuable.run0(Continuable.java:163)
[winJava7] 	at org.jenkinsci.plugins.workflow.cps.SandboxContinuable.access$001(SandboxContinuable.java:19)
[winJava7] 	at org.jenkinsci.plugins.workflow.cps.SandboxContinuable$1.call(SandboxContinuable.java:35)
[winJava7] 	at org.jenkinsci.plugins.workflow.cps.SandboxContinuable$1.call(SandboxContinuable.java:32)
[winJava7] 	at org.jenkinsci.plugins.scriptsecurity.sandbox.groovy.GroovySandbox.runInSandbox(GroovySandbox.java:108)
[winJava7] 	at org.jenkinsci.plugins.workflow.cps.SandboxContinuable.run0(SandboxContinuable.java:32)
[winJava7] 	at org.jenkinsci.plugins.workflow.cps.CpsThread.runNextChunk(CpsThread.java:174)
[winJava7] 	at org.jenkinsci.plugins.workflow.cps.CpsThreadGroup.run(CpsThreadGroup.java:331)
[winJava7] 	at org.jenkinsci.plugins.workflow.cps.CpsThreadGroup.access$200(CpsThreadGroup.java:82)
[winJava7] 	at org.jenkinsci.plugins.workflow.cps.CpsThreadGroup$2.call(CpsThreadGroup.java:243)
[winJava7] 	at org.jenkinsci.plugins.workflow.cps.CpsThreadGroup$2.call(CpsThreadGroup.java:231)
[winJava7] 	at org.jenkinsci.plugins.workflow.cps.CpsVmExecutorService$2.call(CpsVmExecutorService.java:64)
[winJava7] 	at java.util.concurrent.FutureTask.run(FutureTask.java:266)
[winJava7] 	at hudson.remoting.SingleLaneExecutorService$1.run(SingleLaneExecutorService.java:112)
[winJava7] 	at jenkins.util.ContextResettingExecutorService$1.run(ContextResettingExecutorService.java:28)
[winJava7] 	at java.util.concurrent.Executors$RunnableAdapter.call(Executors.java:511)
[winJava7] 	at java.util.concurrent.FutureTask.run(FutureTask.java:266)
[winJava7] 	at java.util.concurrent.ThreadPoolExecutor.runWorker(ThreadPoolExecutor.java:1149)
[winJava7] 	at java.util.concurrent.ThreadPoolExecutor$Worker.run(ThreadPoolExecutor.java:624)
[winJava7] 	at java.lang.Thread.run(Thread.java:748)
[winJava7] ERROR: [withMaven] WARNING Exception executing Maven reporter 'Open Task Scanner Publisher' / org.jenkinsci.plugins.pipeline.maven.publishers.TasksScannerPublisher. Please report a bug associated for the component 'pipeline-maven-plugin' at https://issues.jenkins-ci.org 
[winJava7] java.lang.IllegalArgumentException: Cannot relativize 'C:\mvn-it-1.tmp\src\main\java' relatively to '/mvn-it-1.tmp'
[winJava7] 	at org.jenkinsci.plugins.pipeline.maven.util.XmlUtils.getPathInWorkspace(XmlUtils.java:396)
[winJava7] 	at org.jenkinsci.plugins.pipeline.maven.publishers.TasksScannerPublisher.process(TasksScannerPublisher.java:136)
[winJava7] 	at org.jenkinsci.plugins.pipeline.maven.MavenSpyLogProcessor.processMavenSpyLogs(MavenSpyLogProcessor.java:114)
[winJava7] 	at org.jenkinsci.plugins.pipeline.maven.WithMavenStepExecution$WorkspaceCleanupCallback.finished(WithMavenStepExecution.java:1015)
[winJava7] 	at org.jenkinsci.plugins.workflow.steps.BodyExecutionCallback$TailCall.onSuccess(BodyExecutionCallback.java:114)
[winJava7] 	at org.jenkinsci.plugins.workflow.cps.CpsBodyExecution$SuccessAdapter.receive(CpsBodyExecution.java:368)
[winJava7] 	at com.cloudbees.groovy.cps.Outcome.resumeFrom(Outcome.java:73)
[winJava7] 	at com.cloudbees.groovy.cps.Continuable$1.call(Continuable.java:166)
[winJava7] 	at com.cloudbees.groovy.cps.Continuable$1.call(Continuable.java:163)
[winJava7] 	at org.codehaus.groovy.runtime.GroovyCategorySupport$ThreadCategoryInfo.use(GroovyCategorySupport.java:122)
[winJava7] 	at org.codehaus.groovy.runtime.GroovyCategorySupport.use(GroovyCategorySupport.java:261)
[winJava7] 	at com.cloudbees.groovy.cps.Continuable.run0(Continuable.java:163)
[winJava7] 	at org.jenkinsci.plugins.workflow.cps.SandboxContinuable.access$001(SandboxContinuable.java:19)
[winJava7] 	at org.jenkinsci.plugins.workflow.cps.SandboxContinuable$1.call(SandboxContinuable.java:35)
[winJava7] 	at org.jenkinsci.plugins.workflow.cps.SandboxContinuable$1.call(SandboxContinuable.java:32)
[winJava7] 	at org.jenkinsci.plugins.scriptsecurity.sandbox.groovy.GroovySandbox.runInSandbox(GroovySandbox.java:108)
[winJava7] 	at org.jenkinsci.plugins.workflow.cps.SandboxContinuable.run0(SandboxContinuable.java:32)
[winJava7] 	at org.jenkinsci.plugins.workflow.cps.CpsThread.runNextChunk(CpsThread.java:174)
[winJava7] 	at org.jenkinsci.plugins.workflow.cps.CpsThreadGroup.run(CpsThreadGroup.java:331)
[winJava7] 	at org.jenkinsci.plugins.workflow.cps.CpsThreadGroup.access$200(CpsThreadGroup.java:82)
[winJava7] 	at org.jenkinsci.plugins.workflow.cps.CpsThreadGroup$2.call(CpsThreadGroup.java:243)
[winJava7] 	at org.jenkinsci.plugins.workflow.cps.CpsThreadGroup$2.call(CpsThreadGroup.java:231)
[winJava7] 	at org.jenkinsci.plugins.workflow.cps.CpsVmExecutorService$2.call(CpsVmExecutorService.java:64)
[winJava7] 	at java.util.concurrent.FutureTask.run(FutureTask.java:266)
[winJava7] 	at hudson.remoting.SingleLaneExecutorService$1.run(SingleLaneExecutorService.java:112)
[winJava7] 	at jenkins.util.ContextResettingExecutorService$1.run(ContextResettingExecutorService.java:28)
[winJava7] 	at java.util.concurrent.Executors$RunnableAdapter.call(Executors.java:511)
[winJava7] 	at java.util.concurrent.FutureTask.run(FutureTask.java:266)
[winJava7] 	at java.util.concurrent.ThreadPoolExecutor.runWorker(ThreadPoolExecutor.java:1149)
[winJava7] 	at java.util.concurrent.ThreadPoolExecutor$Worker.run(ThreadPoolExecutor.java:624)
[winJava7] 	at java.lang.Thread.run(Thread.java:748)
[Pipeline] [linuxJava7] // withMaven
[Pipeline] [winJava8] // withMaven
[Pipeline] [winJava7] // withMaven
[Pipeline] [linuxJava7] deleteDir
[Pipeline] [linuxJava8] }
[Pipeline] [winJava8] deleteDir
[Pipeline] [winJava7] deleteDir
[Pipeline] [linuxJava8] // dir
[Pipeline] [linuxJava8] }
[Pipeline] [linuxJava8] // stage
[Pipeline] [linuxJava8] }
[Pipeline] [linuxJava8] // node
[Pipeline] [linuxJava8] }
[Pipeline] [linuxJava7] }
[Pipeline] [linuxJava7] // dir
[Pipeline] [linuxJava7] }
[Pipeline] [linuxJava7] // stage
[Pipeline] [linuxJava7] }
[Pipeline] [linuxJava7] // node
[Pipeline] [linuxJava7] }
[Pipeline] [winJava8] }
[Pipeline] [winJava8] // dir
[Pipeline] [winJava8] }
[Pipeline] [winJava7] }
[Pipeline] [winJava8] // stage
[Pipeline] [winJava7] // dir
[Pipeline] [winJava8] }
[Pipeline] [winJava7] }
[Pipeline] [winJava8] // node
[Pipeline] [winJava7] // stage
[Pipeline] [winJava8] }
[Pipeline] [winJava7] }
[Pipeline] [winJava7] // node
[Pipeline] [winJava7] }
[Pipeline] // parallel
[Pipeline] stage
[Pipeline] { (Notifications)
[Pipeline] echo
Build result: UNSTABLE
[Pipeline] jiraIssueSelector
[Pipeline] jiraComment

Build unstable in Jenkins: Maven TLP » maven » MNG-6386 #5

Posted by Apache Jenkins Server <je...@builds.apache.org>.
See https://builds.apache.org/job/maven-box/job/maven/job/MNG-6386/5/

No changes.

2 tests failed.
FAILED:  org.apache.maven.it.MavenITmng6386BaseUriPropertyTest.testitMNG6386UnicodeChars

Error Message:
got: <false>, expected: is <true>

Stack Trace:
org.junit.AssumptionViolatedException: got: <false>, expected: is <true>
	at org.apache.maven.it.MavenITmng6386BaseUriPropertyTest.testitMNG6386UnicodeChars(MavenITmng6386BaseUriPropertyTest.java:65)


FAILED:  org.apache.maven.it.MavenITmng6386BaseUriPropertyTest.testitMNG6386UnicodeChars

Error Message:
got: <false>, expected: is <true>

Stack Trace:
org.junit.AssumptionViolatedException: got: <false>, expected: is <true>
	at org.apache.maven.it.MavenITmng6386BaseUriPropertyTest.testitMNG6386UnicodeChars(MavenITmng6386BaseUriPropertyTest.java:65)




Build log:
[...truncated 6.25 MB...]
[winJava7] 	at org.jenkinsci.plugins.workflow.cps.SandboxContinuable.run0(SandboxContinuable.java:32)
[winJava7] 	at org.jenkinsci.plugins.workflow.cps.CpsThread.runNextChunk(CpsThread.java:174)
[winJava7] 	at org.jenkinsci.plugins.workflow.cps.CpsThreadGroup.run(CpsThreadGroup.java:331)
[winJava7] 	at org.jenkinsci.plugins.workflow.cps.CpsThreadGroup.access$200(CpsThreadGroup.java:82)
[winJava7] 	at org.jenkinsci.plugins.workflow.cps.CpsThreadGroup$2.call(CpsThreadGroup.java:243)
[winJava7] 	at org.jenkinsci.plugins.workflow.cps.CpsThreadGroup$2.call(CpsThreadGroup.java:231)
[winJava7] 	at org.jenkinsci.plugins.workflow.cps.CpsVmExecutorService$2.call(CpsVmExecutorService.java:64)
[winJava7] 	at java.util.concurrent.FutureTask.run(FutureTask.java:266)
[winJava7] 	at hudson.remoting.SingleLaneExecutorService$1.run(SingleLaneExecutorService.java:112)
[winJava7] 	at jenkins.util.ContextResettingExecutorService$1.run(ContextResettingExecutorService.java:28)
[winJava7] 	at java.util.concurrent.Executors$RunnableAdapter.call(Executors.java:511)
[winJava7] 	at java.util.concurrent.FutureTask.run(FutureTask.java:266)
[winJava7] 	at java.util.concurrent.ThreadPoolExecutor.runWorker(ThreadPoolExecutor.java:1149)
[winJava7] 	at java.util.concurrent.ThreadPoolExecutor$Worker.run(ThreadPoolExecutor.java:624)
[winJava7] 	at java.lang.Thread.run(Thread.java:748)
[winJava7] ERROR: [withMaven] artifactsPublisher - WARNING: Exception archiving and fingerprinting MavenArtifact{org.apache.maven.its.plugins:maven-it-plugins:xml:site:2.1-SNAPSHOT(version: 2.1-SNAPSHOT, snapshot:true)  C:\mvn-it-0.tmp\core-it-support\core-it-plugins\target\maven-it-plugins-2.1-SNAPSHOT-site.xml}, skip archiving of the artifacts
[winJava7] java.lang.IllegalArgumentException: Cannot relativize 'C:\mvn-it-0.tmp\core-it-support\core-it-plugins\target\maven-it-plugins-2.1-SNAPSHOT-site.xml' relatively to '/mvn-it-0.tmp'
[winJava7] 	at org.jenkinsci.plugins.pipeline.maven.util.XmlUtils.getPathInWorkspace(XmlUtils.java:396)
[winJava7] 	at org.jenkinsci.plugins.pipeline.maven.publishers.GeneratedArtifactsPublisher.process(GeneratedArtifactsPublisher.java:95)
[winJava7] 	at org.jenkinsci.plugins.pipeline.maven.MavenSpyLogProcessor.processMavenSpyLogs(MavenSpyLogProcessor.java:114)
[winJava7] 	at org.jenkinsci.plugins.pipeline.maven.WithMavenStepExecution$WorkspaceCleanupCallback.finished(WithMavenStepExecution.java:1015)
[winJava7] 	at org.jenkinsci.plugins.workflow.steps.BodyExecutionCallback$TailCall.onSuccess(BodyExecutionCallback.java:114)
[winJava7] 	at org.jenkinsci.plugins.workflow.cps.CpsBodyExecution$SuccessAdapter.receive(CpsBodyExecution.java:368)
[winJava7] 	at com.cloudbees.groovy.cps.Outcome.resumeFrom(Outcome.java:73)
[winJava7] 	at com.cloudbees.groovy.cps.Continuable$1.call(Continuable.java:166)
[winJava7] 	at com.cloudbees.groovy.cps.Continuable$1.call(Continuable.java:163)
[winJava7] 	at org.codehaus.groovy.runtime.GroovyCategorySupport$ThreadCategoryInfo.use(GroovyCategorySupport.java:122)
[winJava7] 	at org.codehaus.groovy.runtime.GroovyCategorySupport.use(GroovyCategorySupport.java:261)
[winJava7] 	at com.cloudbees.groovy.cps.Continuable.run0(Continuable.java:163)
[winJava7] 	at org.jenkinsci.plugins.workflow.cps.SandboxContinuable.access$001(SandboxContinuable.java:19)
[winJava7] 	at org.jenkinsci.plugins.workflow.cps.SandboxContinuable$1.call(SandboxContinuable.java:35)
[winJava7] 	at org.jenkinsci.plugins.workflow.cps.SandboxContinuable$1.call(SandboxContinuable.java:32)
[winJava7] 	at org.jenkinsci.plugins.scriptsecurity.sandbox.groovy.GroovySandbox.runInSandbox(GroovySandbox.java:108)
[winJava7] 	at org.jenkinsci.plugins.workflow.cps.SandboxContinuable.run0(SandboxContinuable.java:32)
[winJava7] 	at org.jenkinsci.plugins.workflow.cps.CpsThread.runNextChunk(CpsThread.java:174)
[winJava7] 	at org.jenkinsci.plugins.workflow.cps.CpsThreadGroup.run(CpsThreadGroup.java:331)
[winJava7] 	at org.jenkinsci.plugins.workflow.cps.CpsThreadGroup.access$200(CpsThreadGroup.java:82)
[winJava7] 	at org.jenkinsci.plugins.workflow.cps.CpsThreadGroup$2.call(CpsThreadGroup.java:243)
[winJava7] 	at org.jenkinsci.plugins.workflow.cps.CpsThreadGroup$2.call(CpsThreadGroup.java:231)
[winJava7] 	at org.jenkinsci.plugins.workflow.cps.CpsVmExecutorService$2.call(CpsVmExecutorService.java:64)
[winJava7] 	at java.util.concurrent.FutureTask.run(FutureTask.java:266)
[winJava7] 	at hudson.remoting.SingleLaneExecutorService$1.run(SingleLaneExecutorService.java:112)
[winJava7] 	at jenkins.util.ContextResettingExecutorService$1.run(ContextResettingExecutorService.java:28)
[winJava7] 	at java.util.concurrent.Executors$RunnableAdapter.call(Executors.java:511)
[winJava7] 	at java.util.concurrent.FutureTask.run(FutureTask.java:266)
[winJava7] 	at java.util.concurrent.ThreadPoolExecutor.runWorker(ThreadPoolExecutor.java:1149)
[winJava7] 	at java.util.concurrent.ThreadPoolExecutor$Worker.run(ThreadPoolExecutor.java:624)
[winJava7] 	at java.lang.Thread.run(Thread.java:748)
[winJava7] ERROR: [withMaven] artifactsPublisher - WARNING: Exception archiving and fingerprinting MavenArtifact{org.apache.maven.its.plugins:maven-it-plugin-core-stubs:xml:site:2.1-SNAPSHOT(version: 2.1-SNAPSHOT, snapshot:true)  C:\mvn-it-0.tmp\core-it-support\core-it-plugins\maven-it-plugin-core-stubs\target\maven-it-plugin-core-stubs-2.1-SNAPSHOT-site.xml}, skip archiving of the artifacts
[winJava7] java.lang.IllegalArgumentException: Cannot relativize 'C:\mvn-it-0.tmp\core-it-support\core-it-plugins\maven-it-plugin-core-stubs\target\maven-it-plugin-core-stubs-2.1-SNAPSHOT-site.xml' relatively to '/mvn-it-0.tmp'
[winJava7] 	at org.jenkinsci.plugins.pipeline.maven.util.XmlUtils.getPathInWorkspace(XmlUtils.java:396)
[winJava7] 	at org.jenkinsci.plugins.pipeline.maven.publishers.GeneratedArtifactsPublisher.process(GeneratedArtifactsPublisher.java:95)
[winJava7] 	at org.jenkinsci.plugins.pipeline.maven.MavenSpyLogProcessor.processMavenSpyLogs(MavenSpyLogProcessor.java:114)
[winJava7] 	at org.jenkinsci.plugins.pipeline.maven.WithMavenStepExecution$WorkspaceCleanupCallback.finished(WithMavenStepExecution.java:1015)
[winJava7] 	at org.jenkinsci.plugins.workflow.steps.BodyExecutionCallback$TailCall.onSuccess(BodyExecutionCallback.java:114)
[winJava7] 	at org.jenkinsci.plugins.workflow.cps.CpsBodyExecution$SuccessAdapter.receive(CpsBodyExecution.java:368)
[winJava7] 	at com.cloudbees.groovy.cps.Outcome.resumeFrom(Outcome.java:73)
[winJava7] 	at com.cloudbees.groovy.cps.Continuable$1.call(Continuable.java:166)
[winJava7] 	at com.cloudbees.groovy.cps.Continuable$1.call(Continuable.java:163)
[winJava7] 	at org.codehaus.groovy.runtime.GroovyCategorySupport$ThreadCategoryInfo.use(GroovyCategorySupport.java:122)
[winJava7] 	at org.codehaus.groovy.runtime.GroovyCategorySupport.use(GroovyCategorySupport.java:261)
[winJava7] 	at com.cloudbees.groovy.cps.Continuable.run0(Continuable.java:163)
[winJava7] 	at org.jenkinsci.plugins.workflow.cps.SandboxContinuable.access$001(SandboxContinuable.java:19)
[winJava7] 	at org.jenkinsci.plugins.workflow.cps.SandboxContinuable$1.call(SandboxContinuable.java:35)
[winJava7] 	at org.jenkinsci.plugins.workflow.cps.SandboxContinuable$1.call(SandboxContinuable.java:32)
[winJava7] 	at org.jenkinsci.plugins.scriptsecurity.sandbox.groovy.GroovySandbox.runInSandbox(GroovySandbox.java:108)
[winJava7] 	at org.jenkinsci.plugins.workflow.cps.SandboxContinuable.run0(SandboxContinuable.java:32)
[winJava7] 	at org.jenkinsci.plugins.workflow.cps.CpsThread.runNextChunk(CpsThread.java:174)
[winJava7] 	at org.jenkinsci.plugins.workflow.cps.CpsThreadGroup.run(CpsThreadGroup.java:331)
[winJava7] 	at org.jenkinsci.plugins.workflow.cps.CpsThreadGroup.access$200(CpsThreadGroup.java:82)
[winJava7] 	at org.jenkinsci.plugins.workflow.cps.CpsThreadGroup$2.call(CpsThreadGroup.java:243)
[winJava7] 	at org.jenkinsci.plugins.workflow.cps.CpsThreadGroup$2.call(CpsThreadGroup.java:231)
[winJava7] 	at org.jenkinsci.plugins.workflow.cps.CpsVmExecutorService$2.call(CpsVmExecutorService.java:64)
[winJava7] 	at java.util.concurrent.FutureTask.run(FutureTask.java:266)
[winJava7] 	at hudson.remoting.SingleLaneExecutorService$1.run(SingleLaneExecutorService.java:112)
[winJava7] 	at jenkins.util.ContextResettingExecutorService$1.run(ContextResettingExecutorService.java:28)
[winJava7] 	at java.util.concurrent.Executors$RunnableAdapter.call(Executors.java:511)
[winJava7] 	at java.util.concurrent.FutureTask.run(FutureTask.java:266)
[winJava7] 	at java.util.concurrent.ThreadPoolExecutor.runWorker(ThreadPoolExecutor.java:1149)
[winJava7] 	at java.util.concurrent.ThreadPoolExecutor$Worker.run(ThreadPoolExecutor.java:624)
[winJava7] 	at java.lang.Thread.run(Thread.java:748)
[winJava7] ERROR: [withMaven] artifactsPublisher - WARNING: Exception archiving and fingerprinting MavenArtifact{org.apache.maven.its:core-it-support-artifacts:zip:repo:2.1-SNAPSHOT(version: 2.1-SNAPSHOT, snapshot:true)  C:\mvn-it-0.tmp\core-it-support\core-it-support-artifacts\target\core-it-support-artifacts-2.1-SNAPSHOT-repo.zip}, skip archiving of the artifacts
[winJava7] java.lang.IllegalArgumentException: Cannot relativize 'C:\mvn-it-0.tmp\core-it-support\core-it-support-artifacts\target\core-it-support-artifacts-2.1-SNAPSHOT-repo.zip' relatively to '/mvn-it-0.tmp'
[winJava7] 	at org.jenkinsci.plugins.pipeline.maven.util.XmlUtils.getPathInWorkspace(XmlUtils.java:396)
[winJava7] 	at org.jenkinsci.plugins.pipeline.maven.publishers.GeneratedArtifactsPublisher.process(GeneratedArtifactsPublisher.java:95)
[winJava7] 	at org.jenkinsci.plugins.pipeline.maven.MavenSpyLogProcessor.processMavenSpyLogs(MavenSpyLogProcessor.java:114)
[winJava7] 	at org.jenkinsci.plugins.pipeline.maven.WithMavenStepExecution$WorkspaceCleanupCallback.finished(WithMavenStepExecution.java:1015)
[winJava7] 	at org.jenkinsci.plugins.workflow.steps.BodyExecutionCallback$TailCall.onSuccess(BodyExecutionCallback.java:114)
[winJava7] 	at org.jenkinsci.plugins.workflow.cps.CpsBodyExecution$SuccessAdapter.receive(CpsBodyExecution.java:368)
[winJava7] 	at com.cloudbees.groovy.cps.Outcome.resumeFrom(Outcome.java:73)
[winJava7] 	at com.cloudbees.groovy.cps.Continuable$1.call(Continuable.java:166)
[winJava7] 	at com.cloudbees.groovy.cps.Continuable$1.call(Continuable.java:163)
[winJava7] 	at org.codehaus.groovy.runtime.GroovyCategorySupport$ThreadCategoryInfo.use(GroovyCategorySupport.java:122)
[winJava7] 	at org.codehaus.groovy.runtime.GroovyCategorySupport.use(GroovyCategorySupport.java:261)
[winJava7] 	at com.cloudbees.groovy.cps.Continuable.run0(Continuable.java:163)
[winJava7] 	at org.jenkinsci.plugins.workflow.cps.SandboxContinuable.access$001(SandboxContinuable.java:19)
[winJava7] 	at org.jenkinsci.plugins.workflow.cps.SandboxContinuable$1.call(SandboxContinuable.java:35)
[winJava7] 	at org.jenkinsci.plugins.workflow.cps.SandboxContinuable$1.call(SandboxContinuable.java:32)
[winJava7] 	at org.jenkinsci.plugins.scriptsecurity.sandbox.groovy.GroovySandbox.runInSandbox(GroovySandbox.java:108)
[winJava7] 	at org.jenkinsci.plugins.workflow.cps.SandboxContinuable.run0(SandboxContinuable.java:32)
[winJava7] 	at org.jenkinsci.plugins.workflow.cps.CpsThread.runNextChunk(CpsThread.java:174)
[winJava7] 	at org.jenkinsci.plugins.workflow.cps.CpsThreadGroup.run(CpsThreadGroup.java:331)
[winJava7] 	at org.jenkinsci.plugins.workflow.cps.CpsThreadGroup.access$200(CpsThreadGroup.java:82)
[winJava7] 	at org.jenkinsci.plugins.workflow.cps.CpsThreadGroup$2.call(CpsThreadGroup.java:243)
[winJava7] 	at org.jenkinsci.plugins.workflow.cps.CpsThreadGroup$2.call(CpsThreadGroup.java:231)
[winJava7] 	at org.jenkinsci.plugins.workflow.cps.CpsVmExecutorService$2.call(CpsVmExecutorService.java:64)
[winJava7] 	at java.util.concurrent.FutureTask.run(FutureTask.java:266)
[winJava7] 	at hudson.remoting.SingleLaneExecutorService$1.run(SingleLaneExecutorService.java:112)
[winJava7] 	at jenkins.util.ContextResettingExecutorService$1.run(ContextResettingExecutorService.java:28)
[winJava7] 	at java.util.concurrent.Executors$RunnableAdapter.call(Executors.java:511)
[winJava7] 	at java.util.concurrent.FutureTask.run(FutureTask.java:266)
[winJava7] 	at java.util.concurrent.ThreadPoolExecutor.runWorker(ThreadPoolExecutor.java:1149)
[winJava7] 	at java.util.concurrent.ThreadPoolExecutor$Worker.run(ThreadPoolExecutor.java:624)
[winJava7] 	at java.lang.Thread.run(Thread.java:748)
[winJava7] ERROR: [withMaven] artifactsPublisher - WARNING: Exception archiving and fingerprinting MavenArtifact{org.apache.maven.its:core-it-suite:test-jar:tests:2.1-SNAPSHOT(version: 2.1-SNAPSHOT, snapshot:true)  C:\mvn-it-0.tmp\core-it-suite\target\core-it-suite-2.1-SNAPSHOT-tests.jar}, skip archiving of the artifacts
[winJava7] java.lang.IllegalArgumentException: Cannot relativize 'C:\mvn-it-0.tmp\core-it-suite\target\core-it-suite-2.1-SNAPSHOT-tests.jar' relatively to '/mvn-it-0.tmp'
[winJava7] 	at org.jenkinsci.plugins.pipeline.maven.util.XmlUtils.getPathInWorkspace(XmlUtils.java:396)
[winJava7] 	at org.jenkinsci.plugins.pipeline.maven.publishers.GeneratedArtifactsPublisher.process(GeneratedArtifactsPublisher.java:95)
[winJava7] 	at org.jenkinsci.plugins.pipeline.maven.MavenSpyLogProcessor.processMavenSpyLogs(MavenSpyLogProcessor.java:114)
[winJava7] 	at org.jenkinsci.plugins.pipeline.maven.WithMavenStepExecution$WorkspaceCleanupCallback.finished(WithMavenStepExecution.java:1015)
[winJava7] 	at org.jenkinsci.plugins.workflow.steps.BodyExecutionCallback$TailCall.onSuccess(BodyExecutionCallback.java:114)
[winJava7] 	at org.jenkinsci.plugins.workflow.cps.CpsBodyExecution$SuccessAdapter.receive(CpsBodyExecution.java:368)
[winJava7] 	at com.cloudbees.groovy.cps.Outcome.resumeFrom(Outcome.java:73)
[winJava7] 	at com.cloudbees.groovy.cps.Continuable$1.call(Continuable.java:166)
[winJava7] 	at com.cloudbees.groovy.cps.Continuable$1.call(Continuable.java:163)
[winJava7] 	at org.codehaus.groovy.runtime.GroovyCategorySupport$ThreadCategoryInfo.use(GroovyCategorySupport.java:122)
[winJava7] 	at org.codehaus.groovy.runtime.GroovyCategorySupport.use(GroovyCategorySupport.java:261)
[winJava7] 	at com.cloudbees.groovy.cps.Continuable.run0(Continuable.java:163)
[winJava7] 	at org.jenkinsci.plugins.workflow.cps.SandboxContinuable.access$001(SandboxContinuable.java:19)
[winJava7] 	at org.jenkinsci.plugins.workflow.cps.SandboxContinuable$1.call(SandboxContinuable.java:35)
[winJava7] 	at org.jenkinsci.plugins.workflow.cps.SandboxContinuable$1.call(SandboxContinuable.java:32)
[winJava7] 	at org.jenkinsci.plugins.scriptsecurity.sandbox.groovy.GroovySandbox.runInSandbox(GroovySandbox.java:108)
[winJava7] 	at org.jenkinsci.plugins.workflow.cps.SandboxContinuable.run0(SandboxContinuable.java:32)
[winJava7] 	at org.jenkinsci.plugins.workflow.cps.CpsThread.runNextChunk(CpsThread.java:174)
[winJava7] 	at org.jenkinsci.plugins.workflow.cps.CpsThreadGroup.run(CpsThreadGroup.java:331)
[winJava7] 	at org.jenkinsci.plugins.workflow.cps.CpsThreadGroup.access$200(CpsThreadGroup.java:82)
[winJava7] 	at org.jenkinsci.plugins.workflow.cps.CpsThreadGroup$2.call(CpsThreadGroup.java:243)
[winJava7] 	at org.jenkinsci.plugins.workflow.cps.CpsThreadGroup$2.call(CpsThreadGroup.java:231)
[winJava7] 	at org.jenkinsci.plugins.workflow.cps.CpsVmExecutorService$2.call(CpsVmExecutorService.java:64)
[winJava7] 	at java.util.concurrent.FutureTask.run(FutureTask.java:266)
[winJava7] 	at hudson.remoting.SingleLaneExecutorService$1.run(SingleLaneExecutorService.java:112)
[winJava7] 	at jenkins.util.ContextResettingExecutorService$1.run(ContextResettingExecutorService.java:28)
[winJava7] 	at java.util.concurrent.Executors$RunnableAdapter.call(Executors.java:511)
[winJava7] 	at java.util.concurrent.FutureTask.run(FutureTask.java:266)
[winJava7] 	at java.util.concurrent.ThreadPoolExecutor.runWorker(ThreadPoolExecutor.java:1149)
[winJava7] 	at java.util.concurrent.ThreadPoolExecutor$Worker.run(ThreadPoolExecutor.java:624)
[winJava7] 	at java.lang.Thread.run(Thread.java:748)
[winJava7] ERROR: [withMaven] WARNING Exception executing Maven reporter 'Junit Publisher' / org.jenkinsci.plugins.pipeline.maven.publishers.JunitTestsPublisher. Please report a bug associated for the component 'pipeline-maven-plugin' at https://issues.jenkins-ci.org 
[winJava7] java.lang.IllegalArgumentException: Cannot relativize 'C:\mvn-it-0.tmp\core-it-support\core-it-plugins\maven-it-plugin-active-collection\target/surefire-reports' relatively to '/mvn-it-0.tmp'
[winJava7] 	at org.jenkinsci.plugins.pipeline.maven.util.XmlUtils.getPathInWorkspace(XmlUtils.java:396)
[winJava7] 	at org.jenkinsci.plugins.pipeline.maven.publishers.JunitTestsPublisher.executeReporter(JunitTestsPublisher.java:236)
[winJava7] 	at org.jenkinsci.plugins.pipeline.maven.publishers.JunitTestsPublisher.process(JunitTestsPublisher.java:182)
[winJava7] 	at org.jenkinsci.plugins.pipeline.maven.MavenSpyLogProcessor.processMavenSpyLogs(MavenSpyLogProcessor.java:114)
[winJava7] 	at org.jenkinsci.plugins.pipeline.maven.WithMavenStepExecution$WorkspaceCleanupCallback.finished(WithMavenStepExecution.java:1015)
[winJava7] 	at org.jenkinsci.plugins.workflow.steps.BodyExecutionCallback$TailCall.onSuccess(BodyExecutionCallback.java:114)
[winJava7] 	at org.jenkinsci.plugins.workflow.cps.CpsBodyExecution$SuccessAdapter.receive(CpsBodyExecution.java:368)
[winJava7] 	at com.cloudbees.groovy.cps.Outcome.resumeFrom(Outcome.java:73)
[winJava7] 	at com.cloudbees.groovy.cps.Continuable$1.call(Continuable.java:166)
[winJava7] 	at com.cloudbees.groovy.cps.Continuable$1.call(Continuable.java:163)
[winJava7] 	at org.codehaus.groovy.runtime.GroovyCategorySupport$ThreadCategoryInfo.use(GroovyCategorySupport.java:122)
[winJava7] 	at org.codehaus.groovy.runtime.GroovyCategorySupport.use(GroovyCategorySupport.java:261)
[winJava7] 	at com.cloudbees.groovy.cps.Continuable.run0(Continuable.java:163)
[winJava7] 	at org.jenkinsci.plugins.workflow.cps.SandboxContinuable.access$001(SandboxContinuable.java:19)
[winJava7] 	at org.jenkinsci.plugins.workflow.cps.SandboxContinuable$1.call(SandboxContinuable.java:35)
[winJava7] 	at org.jenkinsci.plugins.workflow.cps.SandboxContinuable$1.call(SandboxContinuable.java:32)
[winJava7] 	at org.jenkinsci.plugins.scriptsecurity.sandbox.groovy.GroovySandbox.runInSandbox(GroovySandbox.java:108)
[winJava7] 	at org.jenkinsci.plugins.workflow.cps.SandboxContinuable.run0(SandboxContinuable.java:32)
[winJava7] 	at org.jenkinsci.plugins.workflow.cps.CpsThread.runNextChunk(CpsThread.java:174)
[winJava7] 	at org.jenkinsci.plugins.workflow.cps.CpsThreadGroup.run(CpsThreadGroup.java:331)
[winJava7] 	at org.jenkinsci.plugins.workflow.cps.CpsThreadGroup.access$200(CpsThreadGroup.java:82)
[winJava7] 	at org.jenkinsci.plugins.workflow.cps.CpsThreadGroup$2.call(CpsThreadGroup.java:243)
[winJava7] 	at org.jenkinsci.plugins.workflow.cps.CpsThreadGroup$2.call(CpsThreadGroup.java:231)
[winJava7] 	at org.jenkinsci.plugins.workflow.cps.CpsVmExecutorService$2.call(CpsVmExecutorService.java:64)
[winJava7] 	at java.util.concurrent.FutureTask.run(FutureTask.java:266)
[winJava7] 	at hudson.remoting.SingleLaneExecutorService$1.run(SingleLaneExecutorService.java:112)
[winJava7] 	at jenkins.util.ContextResettingExecutorService$1.run(ContextResettingExecutorService.java:28)
[winJava7] 	at java.util.concurrent.Executors$RunnableAdapter.call(Executors.java:511)
[winJava7] 	at java.util.concurrent.FutureTask.run(FutureTask.java:266)
[winJava7] 	at java.util.concurrent.ThreadPoolExecutor.runWorker(ThreadPoolExecutor.java:1149)
[winJava7] 	at java.util.concurrent.ThreadPoolExecutor$Worker.run(ThreadPoolExecutor.java:624)
[winJava7] 	at java.lang.Thread.run(Thread.java:748)
[winJava7] ERROR: [withMaven] WARNING Exception executing Maven reporter 'Open Task Scanner Publisher' / org.jenkinsci.plugins.pipeline.maven.publishers.TasksScannerPublisher. Please report a bug associated for the component 'pipeline-maven-plugin' at https://issues.jenkins-ci.org 
[winJava7] java.lang.IllegalArgumentException: Cannot relativize 'C:\mvn-it-0.tmp\src\main\java' relatively to '/mvn-it-0.tmp'
[winJava7] 	at org.jenkinsci.plugins.pipeline.maven.util.XmlUtils.getPathInWorkspace(XmlUtils.java:396)
[winJava7] 	at org.jenkinsci.plugins.pipeline.maven.publishers.TasksScannerPublisher.process(TasksScannerPublisher.java:136)
[winJava7] 	at org.jenkinsci.plugins.pipeline.maven.MavenSpyLogProcessor.processMavenSpyLogs(MavenSpyLogProcessor.java:114)
[winJava7] 	at org.jenkinsci.plugins.pipeline.maven.WithMavenStepExecution$WorkspaceCleanupCallback.finished(WithMavenStepExecution.java:1015)
[winJava7] 	at org.jenkinsci.plugins.workflow.steps.BodyExecutionCallback$TailCall.onSuccess(BodyExecutionCallback.java:114)
[winJava7] 	at org.jenkinsci.plugins.workflow.cps.CpsBodyExecution$SuccessAdapter.receive(CpsBodyExecution.java:368)
[winJava7] 	at com.cloudbees.groovy.cps.Outcome.resumeFrom(Outcome.java:73)
[winJava7] 	at com.cloudbees.groovy.cps.Continuable$1.call(Continuable.java:166)
[winJava7] 	at com.cloudbees.groovy.cps.Continuable$1.call(Continuable.java:163)
[winJava7] 	at org.codehaus.groovy.runtime.GroovyCategorySupport$ThreadCategoryInfo.use(GroovyCategorySupport.java:122)
[winJava7] 	at org.codehaus.groovy.runtime.GroovyCategorySupport.use(GroovyCategorySupport.java:261)
[winJava7] 	at com.cloudbees.groovy.cps.Continuable.run0(Continuable.java:163)
[winJava7] 	at org.jenkinsci.plugins.workflow.cps.SandboxContinuable.access$001(SandboxContinuable.java:19)
[winJava7] 	at org.jenkinsci.plugins.workflow.cps.SandboxContinuable$1.call(SandboxContinuable.java:35)
[winJava7] 	at org.jenkinsci.plugins.workflow.cps.SandboxContinuable$1.call(SandboxContinuable.java:32)
[winJava7] 	at org.jenkinsci.plugins.scriptsecurity.sandbox.groovy.GroovySandbox.runInSandbox(GroovySandbox.java:108)
[winJava7] 	at org.jenkinsci.plugins.workflow.cps.SandboxContinuable.run0(SandboxContinuable.java:32)
[winJava7] 	at org.jenkinsci.plugins.workflow.cps.CpsThread.runNextChunk(CpsThread.java:174)
[winJava7] 	at org.jenkinsci.plugins.workflow.cps.CpsThreadGroup.run(CpsThreadGroup.java:331)
[winJava7] 	at org.jenkinsci.plugins.workflow.cps.CpsThreadGroup.access$200(CpsThreadGroup.java:82)
[winJava7] 	at org.jenkinsci.plugins.workflow.cps.CpsThreadGroup$2.call(CpsThreadGroup.java:243)
[winJava7] 	at org.jenkinsci.plugins.workflow.cps.CpsThreadGroup$2.call(CpsThreadGroup.java:231)
[winJava7] 	at org.jenkinsci.plugins.workflow.cps.CpsVmExecutorService$2.call(CpsVmExecutorService.java:64)
[winJava7] 	at java.util.concurrent.FutureTask.run(FutureTask.java:266)
[winJava7] 	at hudson.remoting.SingleLaneExecutorService$1.run(SingleLaneExecutorService.java:112)
[winJava7] 	at jenkins.util.ContextResettingExecutorService$1.run(ContextResettingExecutorService.java:28)
[winJava7] 	at java.util.concurrent.Executors$RunnableAdapter.call(Executors.java:511)
[winJava7] 	at java.util.concurrent.FutureTask.run(FutureTask.java:266)
[winJava7] 	at java.util.concurrent.ThreadPoolExecutor.runWorker(ThreadPoolExecutor.java:1149)
[winJava7] 	at java.util.concurrent.ThreadPoolExecutor$Worker.run(ThreadPoolExecutor.java:624)
[winJava7] 	at java.lang.Thread.run(Thread.java:748)
[Pipeline] [linuxJava8] // dir
[Pipeline] [winJava7] // withMaven
[Pipeline] [linuxJava8] }
[Pipeline] [linuxJava7] }
[Pipeline] [winJava7] deleteDir
[Pipeline] [linuxJava8] // stage
[Pipeline] [linuxJava7] // dir
[Pipeline] [linuxJava8] }
[Pipeline] [linuxJava7] }
[Pipeline] [linuxJava8] // node
[Pipeline] [linuxJava7] // stage
[Pipeline] [linuxJava8] }
[Pipeline] [linuxJava7] }
[Pipeline] [linuxJava7] // node
[Pipeline] [linuxJava7] }
[Pipeline] [winJava8] }
[Pipeline] [winJava8] // dir
[Pipeline] [winJava8] }
[Pipeline] [winJava8] // stage
[Pipeline] [winJava8] }
[Pipeline] [winJava8] // node
[Pipeline] [winJava8] }
[Pipeline] [winJava7] }
[Pipeline] [winJava7] // dir
[Pipeline] [winJava7] }
[Pipeline] [winJava7] // stage
[Pipeline] [winJava7] }
[Pipeline] [winJava7] // node
[Pipeline] [winJava7] }
[Pipeline] // parallel
[Pipeline] stage
[Pipeline] { (Notifications)
[Pipeline] echo
Build result: UNSTABLE
[Pipeline] jiraIssueSelector

Build unstable in Jenkins: Maven TLP » maven » MNG-6386 #4

Posted by Apache Jenkins Server <je...@builds.apache.org>.
See https://builds.apache.org/job/maven-box/job/maven/job/MNG-6386/4/

No changes.

2 tests failed.
FAILED:  org.apache.maven.it.MavenITmng6386BaseUriPropertyTest.testitMNG6386UnicodeChars

Error Message:
Resource not found: /mng-6386-это по-русский

Stack Trace:
java.lang.IllegalArgumentException: Resource not found: /mng-6386-это по-русский
	at org.apache.maven.it.MavenITmng6386BaseUriPropertyTest.testitMNG6386UnicodeChars(MavenITmng6386BaseUriPropertyTest.java:64)


FAILED:  org.apache.maven.it.MavenITmng6386BaseUriPropertyTest.testitMNG6386UnicodeChars

Error Message:
Resource not found: /mng-6386-это по-русский

Stack Trace:
java.lang.IllegalArgumentException: Resource not found: /mng-6386-это по-русский
	at org.apache.maven.it.MavenITmng6386BaseUriPropertyTest.testitMNG6386UnicodeChars(MavenITmng6386BaseUriPropertyTest.java:64)




Build log:
[...truncated 6.26 MB...]
[winJava7] 	at org.jenkinsci.plugins.workflow.cps.CpsThread.runNextChunk(CpsThread.java:174)
[winJava7] 	at org.jenkinsci.plugins.workflow.cps.CpsThreadGroup.run(CpsThreadGroup.java:331)
[winJava7] 	at org.jenkinsci.plugins.workflow.cps.CpsThreadGroup.access$200(CpsThreadGroup.java:82)
[winJava7] 	at org.jenkinsci.plugins.workflow.cps.CpsThreadGroup$2.call(CpsThreadGroup.java:243)
[winJava7] 	at org.jenkinsci.plugins.workflow.cps.CpsThreadGroup$2.call(CpsThreadGroup.java:231)
[winJava7] 	at org.jenkinsci.plugins.workflow.cps.CpsVmExecutorService$2.call(CpsVmExecutorService.java:64)
[winJava7] 	at java.util.concurrent.FutureTask.run(FutureTask.java:266)
[winJava7] 	at hudson.remoting.SingleLaneExecutorService$1.run(SingleLaneExecutorService.java:112)
[winJava7] 	at jenkins.util.ContextResettingExecutorService$1.run(ContextResettingExecutorService.java:28)
[winJava7] 	at java.util.concurrent.Executors$RunnableAdapter.call(Executors.java:511)
[winJava7] 	at java.util.concurrent.FutureTask.run(FutureTask.java:266)
[winJava7] 	at java.util.concurrent.ThreadPoolExecutor.runWorker(ThreadPoolExecutor.java:1149)
[winJava7] 	at java.util.concurrent.ThreadPoolExecutor$Worker.run(ThreadPoolExecutor.java:624)
[winJava7] 	at java.lang.Thread.run(Thread.java:748)
[winJava7] ERROR: [withMaven] artifactsPublisher - WARNING: Exception archiving and fingerprinting MavenArtifact{org.apache.maven.its.plugins:maven-it-plugins:xml:site:2.1-SNAPSHOT(version: 2.1-SNAPSHOT, snapshot:true)  C:\mvn-it-0.tmp\core-it-support\core-it-plugins\target\maven-it-plugins-2.1-SNAPSHOT-site.xml}, skip archiving of the artifacts
[winJava7] java.lang.IllegalArgumentException: Cannot relativize 'C:\mvn-it-0.tmp\core-it-support\core-it-plugins\target\maven-it-plugins-2.1-SNAPSHOT-site.xml' relatively to '/mvn-it-0.tmp'
[winJava7] 	at org.jenkinsci.plugins.pipeline.maven.util.XmlUtils.getPathInWorkspace(XmlUtils.java:396)
[winJava7] 	at org.jenkinsci.plugins.pipeline.maven.publishers.GeneratedArtifactsPublisher.process(GeneratedArtifactsPublisher.java:95)
[winJava7] 	at org.jenkinsci.plugins.pipeline.maven.MavenSpyLogProcessor.processMavenSpyLogs(MavenSpyLogProcessor.java:114)
[winJava7] 	at org.jenkinsci.plugins.pipeline.maven.WithMavenStepExecution$WorkspaceCleanupCallback.finished(WithMavenStepExecution.java:1015)
[winJava7] 	at org.jenkinsci.plugins.workflow.steps.BodyExecutionCallback$TailCall.onSuccess(BodyExecutionCallback.java:114)
[winJava7] 	at org.jenkinsci.plugins.workflow.cps.CpsBodyExecution$SuccessAdapter.receive(CpsBodyExecution.java:368)
[winJava7] 	at com.cloudbees.groovy.cps.Outcome.resumeFrom(Outcome.java:73)
[winJava7] 	at com.cloudbees.groovy.cps.Continuable$1.call(Continuable.java:166)
[winJava7] 	at com.cloudbees.groovy.cps.Continuable$1.call(Continuable.java:163)
[winJava7] 	at org.codehaus.groovy.runtime.GroovyCategorySupport$ThreadCategoryInfo.use(GroovyCategorySupport.java:122)
[winJava7] 	at org.codehaus.groovy.runtime.GroovyCategorySupport.use(GroovyCategorySupport.java:261)
[winJava7] 	at com.cloudbees.groovy.cps.Continuable.run0(Continuable.java:163)
[winJava7] 	at org.jenkinsci.plugins.workflow.cps.SandboxContinuable.access$001(SandboxContinuable.java:19)
[winJava7] 	at org.jenkinsci.plugins.workflow.cps.SandboxContinuable$1.call(SandboxContinuable.java:35)
[winJava7] 	at org.jenkinsci.plugins.workflow.cps.SandboxContinuable$1.call(SandboxContinuable.java:32)
[winJava7] 	at org.jenkinsci.plugins.scriptsecurity.sandbox.groovy.GroovySandbox.runInSandbox(GroovySandbox.java:108)
[winJava7] 	at org.jenkinsci.plugins.workflow.cps.SandboxContinuable.run0(SandboxContinuable.java:32)
[winJava7] 	at org.jenkinsci.plugins.workflow.cps.CpsThread.runNextChunk(CpsThread.java:174)
[winJava7] 	at org.jenkinsci.plugins.workflow.cps.CpsThreadGroup.run(CpsThreadGroup.java:331)
[winJava7] 	at org.jenkinsci.plugins.workflow.cps.CpsThreadGroup.access$200(CpsThreadGroup.java:82)
[winJava7] 	at org.jenkinsci.plugins.workflow.cps.CpsThreadGroup$2.call(CpsThreadGroup.java:243)
[winJava7] 	at org.jenkinsci.plugins.workflow.cps.CpsThreadGroup$2.call(CpsThreadGroup.java:231)
[winJava7] 	at org.jenkinsci.plugins.workflow.cps.CpsVmExecutorService$2.call(CpsVmExecutorService.java:64)
[winJava7] 	at java.util.concurrent.FutureTask.run(FutureTask.java:266)
[winJava7] 	at hudson.remoting.SingleLaneExecutorService$1.run(SingleLaneExecutorService.java:112)
[winJava7] 	at jenkins.util.ContextResettingExecutorService$1.run(ContextResettingExecutorService.java:28)
[winJava7] 	at java.util.concurrent.Executors$RunnableAdapter.call(Executors.java:511)
[winJava7] 	at java.util.concurrent.FutureTask.run(FutureTask.java:266)
[winJava7] 	at java.util.concurrent.ThreadPoolExecutor.runWorker(ThreadPoolExecutor.java:1149)
[winJava7] 	at java.util.concurrent.ThreadPoolExecutor$Worker.run(ThreadPoolExecutor.java:624)
[winJava7] 	at java.lang.Thread.run(Thread.java:748)
[winJava7] ERROR: [withMaven] artifactsPublisher - WARNING: Exception archiving and fingerprinting MavenArtifact{org.apache.maven.its.plugins:maven-it-plugin-core-stubs:xml:site:2.1-SNAPSHOT(version: 2.1-SNAPSHOT, snapshot:true)  C:\mvn-it-0.tmp\core-it-support\core-it-plugins\maven-it-plugin-core-stubs\target\maven-it-plugin-core-stubs-2.1-SNAPSHOT-site.xml}, skip archiving of the artifacts
[winJava7] java.lang.IllegalArgumentException: Cannot relativize 'C:\mvn-it-0.tmp\core-it-support\core-it-plugins\maven-it-plugin-core-stubs\target\maven-it-plugin-core-stubs-2.1-SNAPSHOT-site.xml' relatively to '/mvn-it-0.tmp'
[winJava7] 	at org.jenkinsci.plugins.pipeline.maven.util.XmlUtils.getPathInWorkspace(XmlUtils.java:396)
[winJava7] 	at org.jenkinsci.plugins.pipeline.maven.publishers.GeneratedArtifactsPublisher.process(GeneratedArtifactsPublisher.java:95)
[winJava7] 	at org.jenkinsci.plugins.pipeline.maven.MavenSpyLogProcessor.processMavenSpyLogs(MavenSpyLogProcessor.java:114)
[winJava7] 	at org.jenkinsci.plugins.pipeline.maven.WithMavenStepExecution$WorkspaceCleanupCallback.finished(WithMavenStepExecution.java:1015)
[winJava7] 	at org.jenkinsci.plugins.workflow.steps.BodyExecutionCallback$TailCall.onSuccess(BodyExecutionCallback.java:114)
[winJava7] 	at org.jenkinsci.plugins.workflow.cps.CpsBodyExecution$SuccessAdapter.receive(CpsBodyExecution.java:368)
[winJava7] 	at com.cloudbees.groovy.cps.Outcome.resumeFrom(Outcome.java:73)
[winJava7] 	at com.cloudbees.groovy.cps.Continuable$1.call(Continuable.java:166)
[winJava7] 	at com.cloudbees.groovy.cps.Continuable$1.call(Continuable.java:163)
[winJava7] 	at org.codehaus.groovy.runtime.GroovyCategorySupport$ThreadCategoryInfo.use(GroovyCategorySupport.java:122)
[winJava7] 	at org.codehaus.groovy.runtime.GroovyCategorySupport.use(GroovyCategorySupport.java:261)
[winJava7] 	at com.cloudbees.groovy.cps.Continuable.run0(Continuable.java:163)
[winJava7] 	at org.jenkinsci.plugins.workflow.cps.SandboxContinuable.access$001(SandboxContinuable.java:19)
[winJava7] 	at org.jenkinsci.plugins.workflow.cps.SandboxContinuable$1.call(SandboxContinuable.java:35)
[winJava7] 	at org.jenkinsci.plugins.workflow.cps.SandboxContinuable$1.call(SandboxContinuable.java:32)
[winJava7] 	at org.jenkinsci.plugins.scriptsecurity.sandbox.groovy.GroovySandbox.runInSandbox(GroovySandbox.java:108)
[winJava7] 	at org.jenkinsci.plugins.workflow.cps.SandboxContinuable.run0(SandboxContinuable.java:32)
[winJava7] 	at org.jenkinsci.plugins.workflow.cps.CpsThread.runNextChunk(CpsThread.java:174)
[winJava7] 	at org.jenkinsci.plugins.workflow.cps.CpsThreadGroup.run(CpsThreadGroup.java:331)
[winJava7] 	at org.jenkinsci.plugins.workflow.cps.CpsThreadGroup.access$200(CpsThreadGroup.java:82)
[winJava7] 	at org.jenkinsci.plugins.workflow.cps.CpsThreadGroup$2.call(CpsThreadGroup.java:243)
[winJava7] 	at org.jenkinsci.plugins.workflow.cps.CpsThreadGroup$2.call(CpsThreadGroup.java:231)
[winJava7] 	at org.jenkinsci.plugins.workflow.cps.CpsVmExecutorService$2.call(CpsVmExecutorService.java:64)
[winJava7] 	at java.util.concurrent.FutureTask.run(FutureTask.java:266)
[winJava7] 	at hudson.remoting.SingleLaneExecutorService$1.run(SingleLaneExecutorService.java:112)
[winJava7] 	at jenkins.util.ContextResettingExecutorService$1.run(ContextResettingExecutorService.java:28)
[winJava7] 	at java.util.concurrent.Executors$RunnableAdapter.call(Executors.java:511)
[winJava7] 	at java.util.concurrent.FutureTask.run(FutureTask.java:266)
[winJava7] 	at java.util.concurrent.ThreadPoolExecutor.runWorker(ThreadPoolExecutor.java:1149)
[winJava7] 	at java.util.concurrent.ThreadPoolExecutor$Worker.run(ThreadPoolExecutor.java:624)
[winJava7] 	at java.lang.Thread.run(Thread.java:748)
[winJava7] ERROR: [withMaven] artifactsPublisher - WARNING: Exception archiving and fingerprinting MavenArtifact{org.apache.maven.its:core-it-support-artifacts:zip:repo:2.1-SNAPSHOT(version: 2.1-SNAPSHOT, snapshot:true)  C:\mvn-it-0.tmp\core-it-support\core-it-support-artifacts\target\core-it-support-artifacts-2.1-SNAPSHOT-repo.zip}, skip archiving of the artifacts
[winJava7] java.lang.IllegalArgumentException: Cannot relativize 'C:\mvn-it-0.tmp\core-it-support\core-it-support-artifacts\target\core-it-support-artifacts-2.1-SNAPSHOT-repo.zip' relatively to '/mvn-it-0.tmp'
[winJava7] 	at org.jenkinsci.plugins.pipeline.maven.util.XmlUtils.getPathInWorkspace(XmlUtils.java:396)
[winJava7] 	at org.jenkinsci.plugins.pipeline.maven.publishers.GeneratedArtifactsPublisher.process(GeneratedArtifactsPublisher.java:95)
[winJava7] 	at org.jenkinsci.plugins.pipeline.maven.MavenSpyLogProcessor.processMavenSpyLogs(MavenSpyLogProcessor.java:114)
[winJava7] 	at org.jenkinsci.plugins.pipeline.maven.WithMavenStepExecution$WorkspaceCleanupCallback.finished(WithMavenStepExecution.java:1015)
[winJava7] 	at org.jenkinsci.plugins.workflow.steps.BodyExecutionCallback$TailCall.onSuccess(BodyExecutionCallback.java:114)
[winJava7] 	at org.jenkinsci.plugins.workflow.cps.CpsBodyExecution$SuccessAdapter.receive(CpsBodyExecution.java:368)
[winJava7] 	at com.cloudbees.groovy.cps.Outcome.resumeFrom(Outcome.java:73)
[winJava7] 	at com.cloudbees.groovy.cps.Continuable$1.call(Continuable.java:166)
[winJava7] 	at com.cloudbees.groovy.cps.Continuable$1.call(Continuable.java:163)
[winJava7] 	at org.codehaus.groovy.runtime.GroovyCategorySupport$ThreadCategoryInfo.use(GroovyCategorySupport.java:122)
[winJava7] 	at org.codehaus.groovy.runtime.GroovyCategorySupport.use(GroovyCategorySupport.java:261)
[winJava7] 	at com.cloudbees.groovy.cps.Continuable.run0(Continuable.java:163)
[winJava7] 	at org.jenkinsci.plugins.workflow.cps.SandboxContinuable.access$001(SandboxContinuable.java:19)
[winJava7] 	at org.jenkinsci.plugins.workflow.cps.SandboxContinuable$1.call(SandboxContinuable.java:35)
[winJava7] 	at org.jenkinsci.plugins.workflow.cps.SandboxContinuable$1.call(SandboxContinuable.java:32)
[winJava7] 	at org.jenkinsci.plugins.scriptsecurity.sandbox.groovy.GroovySandbox.runInSandbox(GroovySandbox.java:108)
[winJava7] 	at org.jenkinsci.plugins.workflow.cps.SandboxContinuable.run0(SandboxContinuable.java:32)
[winJava7] 	at org.jenkinsci.plugins.workflow.cps.CpsThread.runNextChunk(CpsThread.java:174)
[winJava7] 	at org.jenkinsci.plugins.workflow.cps.CpsThreadGroup.run(CpsThreadGroup.java:331)
[winJava7] 	at org.jenkinsci.plugins.workflow.cps.CpsThreadGroup.access$200(CpsThreadGroup.java:82)
[winJava7] 	at org.jenkinsci.plugins.workflow.cps.CpsThreadGroup$2.call(CpsThreadGroup.java:243)
[winJava7] 	at org.jenkinsci.plugins.workflow.cps.CpsThreadGroup$2.call(CpsThreadGroup.java:231)
[winJava7] 	at org.jenkinsci.plugins.workflow.cps.CpsVmExecutorService$2.call(CpsVmExecutorService.java:64)
[winJava7] 	at java.util.concurrent.FutureTask.run(FutureTask.java:266)
[winJava7] 	at hudson.remoting.SingleLaneExecutorService$1.run(SingleLaneExecutorService.java:112)
[winJava7] 	at jenkins.util.ContextResettingExecutorService$1.run(ContextResettingExecutorService.java:28)
[winJava7] 	at java.util.concurrent.Executors$RunnableAdapter.call(Executors.java:511)
[winJava7] 	at java.util.concurrent.FutureTask.run(FutureTask.java:266)
[winJava7] 	at java.util.concurrent.ThreadPoolExecutor.runWorker(ThreadPoolExecutor.java:1149)
[winJava7] 	at java.util.concurrent.ThreadPoolExecutor$Worker.run(ThreadPoolExecutor.java:624)
[winJava7] 	at java.lang.Thread.run(Thread.java:748)
[winJava7] ERROR: [withMaven] artifactsPublisher - WARNING: Exception archiving and fingerprinting MavenArtifact{org.apache.maven.its:core-it-suite:test-jar:tests:2.1-SNAPSHOT(version: 2.1-SNAPSHOT, snapshot:true)  C:\mvn-it-0.tmp\core-it-suite\target\core-it-suite-2.1-SNAPSHOT-tests.jar}, skip archiving of the artifacts
[winJava7] java.lang.IllegalArgumentException: Cannot relativize 'C:\mvn-it-0.tmp\core-it-suite\target\core-it-suite-2.1-SNAPSHOT-tests.jar' relatively to '/mvn-it-0.tmp'
[winJava7] 	at org.jenkinsci.plugins.pipeline.maven.util.XmlUtils.getPathInWorkspace(XmlUtils.java:396)
[winJava7] 	at org.jenkinsci.plugins.pipeline.maven.publishers.GeneratedArtifactsPublisher.process(GeneratedArtifactsPublisher.java:95)
[winJava7] 	at org.jenkinsci.plugins.pipeline.maven.MavenSpyLogProcessor.processMavenSpyLogs(MavenSpyLogProcessor.java:114)
[winJava7] 	at org.jenkinsci.plugins.pipeline.maven.WithMavenStepExecution$WorkspaceCleanupCallback.finished(WithMavenStepExecution.java:1015)
[winJava7] 	at org.jenkinsci.plugins.workflow.steps.BodyExecutionCallback$TailCall.onSuccess(BodyExecutionCallback.java:114)
[winJava7] 	at org.jenkinsci.plugins.workflow.cps.CpsBodyExecution$SuccessAdapter.receive(CpsBodyExecution.java:368)
[winJava7] 	at com.cloudbees.groovy.cps.Outcome.resumeFrom(Outcome.java:73)
[winJava7] 	at com.cloudbees.groovy.cps.Continuable$1.call(Continuable.java:166)
[winJava7] 	at com.cloudbees.groovy.cps.Continuable$1.call(Continuable.java:163)
[winJava7] 	at org.codehaus.groovy.runtime.GroovyCategorySupport$ThreadCategoryInfo.use(GroovyCategorySupport.java:122)
[winJava7] 	at org.codehaus.groovy.runtime.GroovyCategorySupport.use(GroovyCategorySupport.java:261)
[winJava7] 	at com.cloudbees.groovy.cps.Continuable.run0(Continuable.java:163)
[winJava7] 	at org.jenkinsci.plugins.workflow.cps.SandboxContinuable.access$001(SandboxContinuable.java:19)
[winJava7] 	at org.jenkinsci.plugins.workflow.cps.SandboxContinuable$1.call(SandboxContinuable.java:35)
[winJava7] 	at org.jenkinsci.plugins.workflow.cps.SandboxContinuable$1.call(SandboxContinuable.java:32)
[winJava7] 	at org.jenkinsci.plugins.scriptsecurity.sandbox.groovy.GroovySandbox.runInSandbox(GroovySandbox.java:108)
[winJava7] 	at org.jenkinsci.plugins.workflow.cps.SandboxContinuable.run0(SandboxContinuable.java:32)
[winJava7] 	at org.jenkinsci.plugins.workflow.cps.CpsThread.runNextChunk(CpsThread.java:174)
[winJava7] 	at org.jenkinsci.plugins.workflow.cps.CpsThreadGroup.run(CpsThreadGroup.java:331)
[winJava7] 	at org.jenkinsci.plugins.workflow.cps.CpsThreadGroup.access$200(CpsThreadGroup.java:82)
[winJava7] 	at org.jenkinsci.plugins.workflow.cps.CpsThreadGroup$2.call(CpsThreadGroup.java:243)
[winJava7] 	at org.jenkinsci.plugins.workflow.cps.CpsThreadGroup$2.call(CpsThreadGroup.java:231)
[winJava7] 	at org.jenkinsci.plugins.workflow.cps.CpsVmExecutorService$2.call(CpsVmExecutorService.java:64)
[winJava7] 	at java.util.concurrent.FutureTask.run(FutureTask.java:266)
[winJava7] 	at hudson.remoting.SingleLaneExecutorService$1.run(SingleLaneExecutorService.java:112)
[winJava7] 	at jenkins.util.ContextResettingExecutorService$1.run(ContextResettingExecutorService.java:28)
[winJava7] 	at java.util.concurrent.Executors$RunnableAdapter.call(Executors.java:511)
[winJava7] 	at java.util.concurrent.FutureTask.run(FutureTask.java:266)
[winJava7] 	at java.util.concurrent.ThreadPoolExecutor.runWorker(ThreadPoolExecutor.java:1149)
[winJava7] 	at java.util.concurrent.ThreadPoolExecutor$Worker.run(ThreadPoolExecutor.java:624)
[winJava7] 	at java.lang.Thread.run(Thread.java:748)
[winJava7] ERROR: [withMaven] WARNING Exception executing Maven reporter 'Junit Publisher' / org.jenkinsci.plugins.pipeline.maven.publishers.JunitTestsPublisher. Please report a bug associated for the component 'pipeline-maven-plugin' at https://issues.jenkins-ci.org 
[winJava7] java.lang.IllegalArgumentException: Cannot relativize 'C:\mvn-it-0.tmp\core-it-support\core-it-plugins\maven-it-plugin-active-collection\target/surefire-reports' relatively to '/mvn-it-0.tmp'
[winJava7] 	at org.jenkinsci.plugins.pipeline.maven.util.XmlUtils.getPathInWorkspace(XmlUtils.java:396)
[winJava7] 	at org.jenkinsci.plugins.pipeline.maven.publishers.JunitTestsPublisher.executeReporter(JunitTestsPublisher.java:236)
[winJava7] 	at org.jenkinsci.plugins.pipeline.maven.publishers.JunitTestsPublisher.process(JunitTestsPublisher.java:182)
[winJava7] 	at org.jenkinsci.plugins.pipeline.maven.MavenSpyLogProcessor.processMavenSpyLogs(MavenSpyLogProcessor.java:114)
[winJava7] 	at org.jenkinsci.plugins.pipeline.maven.WithMavenStepExecution$WorkspaceCleanupCallback.finished(WithMavenStepExecution.java:1015)
[winJava7] 	at org.jenkinsci.plugins.workflow.steps.BodyExecutionCallback$TailCall.onSuccess(BodyExecutionCallback.java:114)
[winJava7] 	at org.jenkinsci.plugins.workflow.cps.CpsBodyExecution$SuccessAdapter.receive(CpsBodyExecution.java:368)
[winJava7] 	at com.cloudbees.groovy.cps.Outcome.resumeFrom(Outcome.java:73)
[winJava7] 	at com.cloudbees.groovy.cps.Continuable$1.call(Continuable.java:166)
[winJava7] 	at com.cloudbees.groovy.cps.Continuable$1.call(Continuable.java:163)
[winJava7] 	at org.codehaus.groovy.runtime.GroovyCategorySupport$ThreadCategoryInfo.use(GroovyCategorySupport.java:122)
[winJava7] 	at org.codehaus.groovy.runtime.GroovyCategorySupport.use(GroovyCategorySupport.java:261)
[winJava7] 	at com.cloudbees.groovy.cps.Continuable.run0(Continuable.java:163)
[winJava7] 	at org.jenkinsci.plugins.workflow.cps.SandboxContinuable.access$001(SandboxContinuable.java:19)
[winJava7] 	at org.jenkinsci.plugins.workflow.cps.SandboxContinuable$1.call(SandboxContinuable.java:35)
[winJava7] 	at org.jenkinsci.plugins.workflow.cps.SandboxContinuable$1.call(SandboxContinuable.java:32)
[winJava7] 	at org.jenkinsci.plugins.scriptsecurity.sandbox.groovy.GroovySandbox.runInSandbox(GroovySandbox.java:108)
[winJava7] 	at org.jenkinsci.plugins.workflow.cps.SandboxContinuable.run0(SandboxContinuable.java:32)
[winJava7] 	at org.jenkinsci.plugins.workflow.cps.CpsThread.runNextChunk(CpsThread.java:174)
[winJava7] 	at org.jenkinsci.plugins.workflow.cps.CpsThreadGroup.run(CpsThreadGroup.java:331)
[winJava7] 	at org.jenkinsci.plugins.workflow.cps.CpsThreadGroup.access$200(CpsThreadGroup.java:82)
[winJava7] 	at org.jenkinsci.plugins.workflow.cps.CpsThreadGroup$2.call(CpsThreadGroup.java:243)
[winJava7] 	at org.jenkinsci.plugins.workflow.cps.CpsThreadGroup$2.call(CpsThreadGroup.java:231)
[winJava7] 	at org.jenkinsci.plugins.workflow.cps.CpsVmExecutorService$2.call(CpsVmExecutorService.java:64)
[winJava7] 	at java.util.concurrent.FutureTask.run(FutureTask.java:266)
[winJava7] 	at hudson.remoting.SingleLaneExecutorService$1.run(SingleLaneExecutorService.java:112)
[winJava7] 	at jenkins.util.ContextResettingExecutorService$1.run(ContextResettingExecutorService.java:28)
[winJava7] 	at java.util.concurrent.Executors$RunnableAdapter.call(Executors.java:511)
[winJava7] 	at java.util.concurrent.FutureTask.run(FutureTask.java:266)
[winJava7] 	at java.util.concurrent.ThreadPoolExecutor.runWorker(ThreadPoolExecutor.java:1149)
[winJava7] 	at java.util.concurrent.ThreadPoolExecutor$Worker.run(ThreadPoolExecutor.java:624)
[winJava7] 	at java.lang.Thread.run(Thread.java:748)
[winJava7] ERROR: [withMaven] WARNING Exception executing Maven reporter 'Open Task Scanner Publisher' / org.jenkinsci.plugins.pipeline.maven.publishers.TasksScannerPublisher. Please report a bug associated for the component 'pipeline-maven-plugin' at https://issues.jenkins-ci.org 
[winJava7] java.lang.IllegalArgumentException: Cannot relativize 'C:\mvn-it-0.tmp\src\main\java' relatively to '/mvn-it-0.tmp'
[winJava7] 	at org.jenkinsci.plugins.pipeline.maven.util.XmlUtils.getPathInWorkspace(XmlUtils.java:396)
[winJava7] 	at org.jenkinsci.plugins.pipeline.maven.publishers.TasksScannerPublisher.process(TasksScannerPublisher.java:136)
[winJava7] 	at org.jenkinsci.plugins.pipeline.maven.MavenSpyLogProcessor.processMavenSpyLogs(MavenSpyLogProcessor.java:114)
[winJava7] 	at org.jenkinsci.plugins.pipeline.maven.WithMavenStepExecution$WorkspaceCleanupCallback.finished(WithMavenStepExecution.java:1015)
[winJava7] 	at org.jenkinsci.plugins.workflow.steps.BodyExecutionCallback$TailCall.onSuccess(BodyExecutionCallback.java:114)
[winJava7] 	at org.jenkinsci.plugins.workflow.cps.CpsBodyExecution$SuccessAdapter.receive(CpsBodyExecution.java:368)
[winJava7] 	at com.cloudbees.groovy.cps.Outcome.resumeFrom(Outcome.java:73)
[winJava7] 	at com.cloudbees.groovy.cps.Continuable$1.call(Continuable.java:166)
[winJava7] 	at com.cloudbees.groovy.cps.Continuable$1.call(Continuable.java:163)
[winJava7] 	at org.codehaus.groovy.runtime.GroovyCategorySupport$ThreadCategoryInfo.use(GroovyCategorySupport.java:122)
[winJava7] 	at org.codehaus.groovy.runtime.GroovyCategorySupport.use(GroovyCategorySupport.java:261)
[winJava7] 	at com.cloudbees.groovy.cps.Continuable.run0(Continuable.java:163)
[winJava7] 	at org.jenkinsci.plugins.workflow.cps.SandboxContinuable.access$001(SandboxContinuable.java:19)
[winJava7] 	at org.jenkinsci.plugins.workflow.cps.SandboxContinuable$1.call(SandboxContinuable.java:35)
[winJava7] 	at org.jenkinsci.plugins.workflow.cps.SandboxContinuable$1.call(SandboxContinuable.java:32)
[winJava7] 	at org.jenkinsci.plugins.scriptsecurity.sandbox.groovy.GroovySandbox.runInSandbox(GroovySandbox.java:108)
[winJava7] 	at org.jenkinsci.plugins.workflow.cps.SandboxContinuable.run0(SandboxContinuable.java:32)
[winJava7] 	at org.jenkinsci.plugins.workflow.cps.CpsThread.runNextChunk(CpsThread.java:174)
[winJava7] 	at org.jenkinsci.plugins.workflow.cps.CpsThreadGroup.run(CpsThreadGroup.java:331)
[winJava7] 	at org.jenkinsci.plugins.workflow.cps.CpsThreadGroup.access$200(CpsThreadGroup.java:82)
[winJava7] 	at org.jenkinsci.plugins.workflow.cps.CpsThreadGroup$2.call(CpsThreadGroup.java:243)
[winJava7] 	at org.jenkinsci.plugins.workflow.cps.CpsThreadGroup$2.call(CpsThreadGroup.java:231)
[winJava7] 	at org.jenkinsci.plugins.workflow.cps.CpsVmExecutorService$2.call(CpsVmExecutorService.java:64)
[winJava7] 	at java.util.concurrent.FutureTask.run(FutureTask.java:266)
[winJava7] 	at hudson.remoting.SingleLaneExecutorService$1.run(SingleLaneExecutorService.java:112)
[winJava7] 	at jenkins.util.ContextResettingExecutorService$1.run(ContextResettingExecutorService.java:28)
[winJava7] 	at java.util.concurrent.Executors$RunnableAdapter.call(Executors.java:511)
[winJava7] 	at java.util.concurrent.FutureTask.run(FutureTask.java:266)
[winJava7] 	at java.util.concurrent.ThreadPoolExecutor.runWorker(ThreadPoolExecutor.java:1149)
[winJava7] 	at java.util.concurrent.ThreadPoolExecutor$Worker.run(ThreadPoolExecutor.java:624)
[winJava7] 	at java.lang.Thread.run(Thread.java:748)
[Pipeline] [linuxJava8] // dir
[Pipeline] [winJava7] // withMaven
[Pipeline] [linuxJava8] }
[Pipeline] [linuxJava7] }
[Pipeline] [winJava7] deleteDir
[Pipeline] [linuxJava8] // stage
[Pipeline] [linuxJava7] // dir
[Pipeline] [linuxJava8] }
[Pipeline] [linuxJava7] }
[Pipeline] [linuxJava8] // node
[Pipeline] [linuxJava7] // stage
[Pipeline] [linuxJava8] }
[Pipeline] [linuxJava7] }
[Pipeline] [linuxJava7] // node
[Pipeline] [linuxJava7] }
[Pipeline] [winJava8] }
[Pipeline] [winJava8] // dir
[Pipeline] [winJava8] }
[Pipeline] [winJava8] // stage
[Pipeline] [winJava8] }
[Pipeline] [winJava8] // node
[Pipeline] [winJava8] }
[Pipeline] [winJava7] }
[Pipeline] [winJava7] // dir
[Pipeline] [winJava7] }
[Pipeline] [winJava7] // stage
[Pipeline] [winJava7] }
[Pipeline] [winJava7] // node
[Pipeline] [winJava7] }
[Pipeline] // parallel
[Pipeline] stage
[Pipeline] { (Notifications)
[Pipeline] echo
Build result: UNSTABLE
[Pipeline] jiraIssueSelector
[Pipeline] emailext