You are viewing a plain text version of this content. The canonical link for it is here.
Posted to builds@cassandra.apache.org by Apache Jenkins Server <je...@builds.apache.org> on 2022/11/08 21:56:06 UTC

Build complete: Cassandra-3.0 #311 [UNSTABLE] 955231cacfc2732dd1fd4275049e224ab220d107

-------------------------------------------------------------------------------
Build Cassandra-3.0 #311 Still Unstable
URL: https://ci-cassandra.apache.org/job/Cassandra-3.0/311/
-------------------------------------------------------------------------------
Changes:
[a.penya.garcia] CircleCI: Remove repeated jobs from default LOWRES, MIDRES and HIGHRES


-------------------------------------------------------------------------------
Failed Tests:
10 tests failed.
FAILED:  dtest-novnode.jmx_test.TestJMX.test_compactionstats
FAILED:  dtest-upgrade.upgrade_tests.upgrade_through_versions_test.TestUpgrade_indev_3_0_x_To_indev_3_11_x.test_parallel_upgrade
FAILED:  dtest.materialized_views_test.TestMaterializedViews.test_populate_mv_after_insert_wide_rows
FAILED:  org.apache.cassandra.index.internal.CassandraIndexTest.indexCorrectlyMarkedAsBuildAndRemoved-compression
FAILED:  dtest.repair_tests.repair_test.TestRepair.test_dead_sync_initiator
FAILED:  dtest.repair_tests.repair_test.TestRepair.test_failure_during_validation
FAILED:  dtest-novnode.repair_tests.repair_test.TestRepair.test_dead_sync_initiator
FAILED:  dtest-novnode.repair_tests.repair_test.TestRepair.test_failure_during_validation
FAILED:  dtest-upgrade.upgrade_internal_auth_test.TestAuthUpgrade.test_upgrade_legacy_table
FAILED:  dtest-upgrade.upgrade_internal_auth_test.TestAuthUpgrade.test_upgrade_to_30

-------------------------------------------------------------------------------
For complete test report and logs see https://nightlies.apache.org/cassandra/Cassandra-3.0/311/