You are viewing a plain text version of this content. The canonical link for it is here.
Posted to commits@tomee.apache.org by Apache Jenkins Server <je...@builds.apache.org> on 2026/03/24 15:09:03 UTC

Build failed in Jenkins: TomEE » master-build-full-tck #489

See <https://ci-builds.apache.org/job/Tomee/job/master-build-full-tck/489/display/redirect?page=changes>

Changes:

[github] TOMEE-4594 - Jakarta Data 1.0 (#2550)


------------------------------------------
[...truncated 36.62 MiB...]
[INFO] 
[INFO] TomEE :: TCK ....................................... SUCCESS [  8.882 s]
[INFO] TomEE :: TCK :: Common ............................. SUCCESS [ 33.762 s]
[INFO] TomEE :: TCK :: CDI Embedded ....................... SUCCESS [ 35.020 s]
[INFO] TomEE :: TCK :: CDI TomEE .......................... SUCCESS [ 17.352 s]
[INFO] TomEE :: TCK :: CDI TCK Signature Tests ............ SUCCESS [  5.331 s]
[INFO] TomEE :: TCK :: Bean Validation Embedded ........... SUCCESS [01:28 min]
[INFO] TomEE :: TCK :: Bean Validation TomEE .............. SUCCESS [07:58 min]
[INFO] TomEE :: TCK :: Bean Validation TCK Signature tests  SUCCESS [  7.674 s]
[INFO] TomEE :: TCK :: JSON-P Standalone .................. SUCCESS [  4.966 s]
[INFO] TomEE :: TCK :: JSON-P Signature Tests ............. SUCCESS [  5.355 s]
[INFO] TomEE :: TCK :: JSON-B Standalone .................. SUCCESS [  5.410 s]
[INFO] TomEE :: TCK :: JSON-B Signature Tests ............. SUCCESS [  5.168 s]
[INFO] TomEE :: TCK :: Concurrency Standalone ............. SUCCESS [03:48 min]
[INFO] TomEE :: TCK :: Concurrency Signature Tests ........ SUCCESS [ 25.723 s]
[INFO] TomEE :: TCK :: MicroProfile ....................... SUCCESS [  2.533 s]
[INFO] TomEE :: TCK :: MicroProfile Config TCK ............ SUCCESS [05:16 min]
[INFO] TomEE :: TCK :: MicroProfile JWT TCK ............... SUCCESS [06:20 min]
[INFO] TomEE :: TCK :: MicroProfile Health TCK ............ SUCCESS [14:22 min]
[INFO] TomEE :: TCK :: MicroProfile Rest Client TCK ....... SUCCESS [18:26 min]
[INFO] TomEE :: TCK :: MicroProfile Open API TCK .......... SUCCESS [15:19 min]
[INFO] TomEE :: TCK :: MicroProfile Fault Tolerance TCK ... SUCCESS [33:02 min]
[INFO] TomEE :: TCK :: MicroProfile Telemetry TCK ......... SUCCESS [  2.831 s]
[INFO] TomEE :: TCK :: MicroProfile Telemetry Tracing TCK . SUCCESS [12:04 min]
[INFO] TomEE :: TCK :: MicroProfile Telemetry Metrics TCK . SUCCESS [09:43 min]
[INFO] TomEE :: TCK :: MicroProfile Telemetry Logs TCK .... SUCCESS [ 43.280 s]
[INFO] TomEE :: TCK :: JAX-RS TCK ......................... FAILURE [  2.775 s]
[INFO] TomEE :: TCK :: JAX-RS TCK :: Tests ................ SKIPPED
[INFO] TomEE :: TCK :: JAX-RS TCK :: Tests Embedded ....... SKIPPED
[INFO] TomEE :: TCK :: JAX-RS TCK :: Signature Test ....... SKIPPED
[INFO] TomEE :: TCK :: Jakarta Data ....................... SUCCESS [ 13.555 s]
[INFO] TomEE :: TCK :: Jakarta Data Signature Tests ....... SUCCESS [  6.237 s]
[INFO] ------------------------------------------------------------------------
[INFO] BUILD FAILURE
[INFO] ------------------------------------------------------------------------
[INFO] Total time:  02:20 h
[INFO] Finished at: 2026-03-24T15:03:15Z
[INFO] ------------------------------------------------------------------------
[WARNING] The requested profile "all-adapters" could not be activated because it does not exist.
[WARNING] The requested profile "jsonb-tck" could not be activated because it does not exist.
[WARNING] The requested profile "jsonp-tck" could not be activated because it does not exist.
Waiting for Jenkins to finish collecting data
[ERROR] Failed to execute goal org.apache.maven.plugins:maven-antrun-plugin:3.2.0:run (default) on project jax-rs: An Ant BuildException has occurred: Can't get https://download.eclipse.org/ee4j/jakartaee-tck/jakartaee10/staged/eftl/jakarta-restful-ws-tck-4.0.0.zip to <https://ci-builds.apache.org/job/Tomee/job/master-build-full-tck/ws/tck/jax-rs/jakarta-restful-ws-tck-4.0.0.zip>
[ERROR] around Ant part ...<get skipexisting="true" src="https://download.eclipse.org/ee4j/jakartaee-tck/jakartaee10/staged/eftl/jakarta-restful-ws-tck-4.0.0.zip" dest="jakarta-restful-ws-tck-4.0.0.zip" />... @ 4:183 in <https://ci-builds.apache.org/job/Tomee/job/master-build-full-tck/ws/tck/jax-rs/target/antrun/build-main.xml>
[ERROR] -> [Help 1]
[ERROR] 
[ERROR] To see the full stack trace of the errors, re-run Maven with the -e switch.
[ERROR] Re-run Maven using the -X switch to enable full debug logging.
[ERROR] 
[ERROR] For more information about the errors and possible solutions, please read the following articles:
[ERROR] [Help 1] http://cwiki.apache.org/confluence/display/MAVEN/MojoExecutionException
[ERROR] 
[ERROR] After correcting the problems, you can resume the build with the command
[ERROR]   mvn <goals> -rf :jax-rs
[JENKINS] Archiving <https://ci-builds.apache.org/job/Tomee/job/master-build-full-tck/ws/tck/microprofile-tck/health/pom.xml> to org.apache.tomee/microprofile-health-tck/11.0.0-SNAPSHOT/microprofile-health-tck-11.0.0-SNAPSHOT.pom
[JENKINS] Archiving <https://ci-builds.apache.org/job/Tomee/job/master-build-full-tck/ws/tck/microprofile-tck/health/target/microprofile-health-tck-11.0.0-SNAPSHOT.jar> to org.apache.tomee/microprofile-health-tck/11.0.0-SNAPSHOT/microprofile-health-tck-11.0.0-SNAPSHOT.jar
[JENKINS] Archiving <https://ci-builds.apache.org/job/Tomee/job/master-build-full-tck/ws/tck/jax-rs/jax-rs-tests-embedded/pom.xml> to org.apache.tomee/jax-rs-tests-embedded/11.0.0-SNAPSHOT/jax-rs-tests-embedded-11.0.0-SNAPSHOT.pom
[JENKINS] Archiving <https://ci-builds.apache.org/job/Tomee/job/master-build-full-tck/ws/tck/microprofile-tck/jwt/pom.xml> to org.apache.tomee/microprofile-jwt-tck/11.0.0-SNAPSHOT/microprofile-jwt-tck-11.0.0-SNAPSHOT.pom
[JENKINS] Archiving <https://ci-builds.apache.org/job/Tomee/job/master-build-full-tck/ws/tck/microprofile-tck/jwt/target/microprofile-jwt-tck-11.0.0-SNAPSHOT.jar> to org.apache.tomee/microprofile-jwt-tck/11.0.0-SNAPSHOT/microprofile-jwt-tck-11.0.0-SNAPSHOT.jar
[JENKINS] Archiving <https://ci-builds.apache.org/job/Tomee/job/master-build-full-tck/ws/tck/bval-tomee/pom.xml> to org.apache.tomee/bval-tomee/11.0.0-SNAPSHOT/bval-tomee-11.0.0-SNAPSHOT.pom
[JENKINS] Archiving <https://ci-builds.apache.org/job/Tomee/job/master-build-full-tck/ws/tck/bval-tomee/target/bval-tomee-11.0.0-SNAPSHOT.jar> to org.apache.tomee/bval-tomee/11.0.0-SNAPSHOT/bval-tomee-11.0.0-SNAPSHOT.jar
[JENKINS] Archiving <https://ci-builds.apache.org/job/Tomee/job/master-build-full-tck/ws/tck/jax-rs/jax-rs-tests/pom.xml> to org.apache.tomee/jax-rs-tests/11.0.0-SNAPSHOT/jax-rs-tests-11.0.0-SNAPSHOT.pom
[JENKINS] Archiving <https://ci-builds.apache.org/job/Tomee/job/master-build-full-tck/ws/tck/jax-rs/pom.xml> to org.apache.tomee/jax-rs/11.0.0-SNAPSHOT/jax-rs-11.0.0-SNAPSHOT.pom
[JENKINS] Archiving <https://ci-builds.apache.org/job/Tomee/job/master-build-full-tck/ws/tck/pom.xml> to org.apache.tomee/tck/11.0.0-SNAPSHOT/tck-11.0.0-SNAPSHOT.pom
[JENKINS] Archiving <https://ci-builds.apache.org/job/Tomee/job/master-build-full-tck/ws/tck/bval-signature-test/pom.xml> to org.apache.tomee/bval-signature-test/11.0.0-SNAPSHOT/bval-signature-test-11.0.0-SNAPSHOT.pom
[JENKINS] Archiving <https://ci-builds.apache.org/job/Tomee/job/master-build-full-tck/ws/tck/bval-signature-test/target/bval-signature-test-11.0.0-SNAPSHOT.jar> to org.apache.tomee/bval-signature-test/11.0.0-SNAPSHOT/bval-signature-test-11.0.0-SNAPSHOT.jar
[JENKINS] Archiving <https://ci-builds.apache.org/job/Tomee/job/master-build-full-tck/ws/tck/cdi-signature-test/pom.xml> to org.apache.tomee/cdi-signature-test/11.0.0-SNAPSHOT/cdi-signature-test-11.0.0-SNAPSHOT.pom
[JENKINS] Archiving <https://ci-builds.apache.org/job/Tomee/job/master-build-full-tck/ws/tck/cdi-signature-test/target/cdi-signature-test-11.0.0-SNAPSHOT.jar> to org.apache.tomee/cdi-signature-test/11.0.0-SNAPSHOT/cdi-signature-test-11.0.0-SNAPSHOT.jar
[JENKINS] Archiving <https://ci-builds.apache.org/job/Tomee/job/master-build-full-tck/ws/tck/microprofile-tck/opentelemetry/tracing/pom.xml> to org.apache.tomee/microprofile-telemetry-tracing-tck/11.0.0-SNAPSHOT/microprofile-telemetry-tracing-tck-11.0.0-SNAPSHOT.pom
[JENKINS] Archiving <https://ci-builds.apache.org/job/Tomee/job/master-build-full-tck/ws/tck/microprofile-tck/opentelemetry/tracing/target/microprofile-telemetry-tracing-tck-11.0.0-SNAPSHOT.jar> to org.apache.tomee/microprofile-telemetry-tracing-tck/11.0.0-SNAPSHOT/microprofile-telemetry-tracing-tck-11.0.0-SNAPSHOT.jar
[JENKINS] Archiving <https://ci-builds.apache.org/job/Tomee/job/master-build-full-tck/ws/tck/jsonp-standalone/pom.xml> to org.apache.tomee/jsonp-standalone/11.0.0-SNAPSHOT/jsonp-standalone-11.0.0-SNAPSHOT.pom
[JENKINS] Archiving <https://ci-builds.apache.org/job/Tomee/job/master-build-full-tck/ws/tck/jsonp-standalone/target/jsonp-standalone-11.0.0-SNAPSHOT.jar> to org.apache.tomee/jsonp-standalone/11.0.0-SNAPSHOT/jsonp-standalone-11.0.0-SNAPSHOT.jar
[JENKINS] Archiving <https://ci-builds.apache.org/job/Tomee/job/master-build-full-tck/ws/tck/microprofile-tck/opentelemetry/logs/pom.xml> to org.apache.tomee/microprofile-telemetry-logs-tck/11.0.0-SNAPSHOT/microprofile-telemetry-logs-tck-11.0.0-SNAPSHOT.pom
[JENKINS] Archiving <https://ci-builds.apache.org/job/Tomee/job/master-build-full-tck/ws/tck/microprofile-tck/opentelemetry/logs/target/microprofile-telemetry-logs-tck-11.0.0-SNAPSHOT.jar> to org.apache.tomee/microprofile-telemetry-logs-tck/11.0.0-SNAPSHOT/microprofile-telemetry-logs-tck-11.0.0-SNAPSHOT.jar
[JENKINS] Archiving <https://ci-builds.apache.org/job/Tomee/job/master-build-full-tck/ws/tck/cdi-tomee/pom.xml> to org.apache.tomee/cdi-tomee/11.0.0-SNAPSHOT/cdi-tomee-11.0.0-SNAPSHOT.pom
[JENKINS] Archiving <https://ci-builds.apache.org/job/Tomee/job/master-build-full-tck/ws/tck/cdi-tomee/target/cdi-tomee-11.0.0-SNAPSHOT.jar> to org.apache.tomee/cdi-tomee/11.0.0-SNAPSHOT/cdi-tomee-11.0.0-SNAPSHOT.jar
[JENKINS] Archiving <https://ci-builds.apache.org/job/Tomee/job/master-build-full-tck/ws/tck/tck-common/pom.xml> to org.apache.tomee/tck-common/11.0.0-SNAPSHOT/tck-common-11.0.0-SNAPSHOT.pom
[JENKINS] Archiving <https://ci-builds.apache.org/job/Tomee/job/master-build-full-tck/ws/tck/tck-common/target/tck-common-11.0.0-SNAPSHOT.jar> to org.apache.tomee/tck-common/11.0.0-SNAPSHOT/tck-common-11.0.0-SNAPSHOT.jar
[JENKINS] Archiving <https://ci-builds.apache.org/job/Tomee/job/master-build-full-tck/ws/tck/microprofile-tck/openapi/pom.xml> to org.apache.tomee/microprofile-openapi-tck/11.0.0-SNAPSHOT/microprofile-openapi-tck-11.0.0-SNAPSHOT.pom
[JENKINS] Archiving <https://ci-builds.apache.org/job/Tomee/job/master-build-full-tck/ws/tck/microprofile-tck/openapi/target/microprofile-openapi-tck-11.0.0-SNAPSHOT.jar> to org.apache.tomee/microprofile-openapi-tck/11.0.0-SNAPSHOT/microprofile-openapi-tck-11.0.0-SNAPSHOT.jar
[JENKINS] Archiving <https://ci-builds.apache.org/job/Tomee/job/master-build-full-tck/ws/tck/bval-embedded/pom.xml> to org.apache.tomee/bval-embedded/11.0.0-SNAPSHOT/bval-embedded-11.0.0-SNAPSHOT.pom
[JENKINS] Archiving <https://ci-builds.apache.org/job/Tomee/job/master-build-full-tck/ws/tck/bval-embedded/target/bval-embedded-11.0.0-SNAPSHOT.jar> to org.apache.tomee/bval-embedded/11.0.0-SNAPSHOT/bval-embedded-11.0.0-SNAPSHOT.jar
[JENKINS] Archiving <https://ci-builds.apache.org/job/Tomee/job/master-build-full-tck/ws/tck/cdi-embedded/pom.xml> to org.apache.tomee/cdi-embedded/11.0.0-SNAPSHOT/cdi-embedded-11.0.0-SNAPSHOT.pom
[JENKINS] Archiving <https://ci-builds.apache.org/job/Tomee/job/master-build-full-tck/ws/tck/cdi-embedded/target/cdi-embedded-11.0.0-SNAPSHOT.jar> to org.apache.tomee/cdi-embedded/11.0.0-SNAPSHOT/cdi-embedded-11.0.0-SNAPSHOT.jar
[JENKINS] Archiving <https://ci-builds.apache.org/job/Tomee/job/master-build-full-tck/ws/tck/jax-rs/jax-rs-signature-test/pom.xml> to org.apache.tomee/jax-rs-signature-test/11.0.0-SNAPSHOT/jax-rs-signature-test-11.0.0-SNAPSHOT.pom
[JENKINS] Archiving <https://ci-builds.apache.org/job/Tomee/job/master-build-full-tck/ws/tck/microprofile-tck/opentelemetry/pom.xml> to org.apache.tomee/microprofile-opentelemetry-tck/11.0.0-SNAPSHOT/microprofile-opentelemetry-tck-11.0.0-SNAPSHOT.pom
[JENKINS] Archiving <https://ci-builds.apache.org/job/Tomee/job/master-build-full-tck/ws/tck/jsonb-signature-test/pom.xml> to org.apache.tomee/jsonb-signature-test/11.0.0-SNAPSHOT/jsonb-signature-test-11.0.0-SNAPSHOT.pom
[JENKINS] Archiving <https://ci-builds.apache.org/job/Tomee/job/master-build-full-tck/ws/tck/jsonb-signature-test/target/jsonb-signature-test-11.0.0-SNAPSHOT.jar> to org.apache.tomee/jsonb-signature-test/11.0.0-SNAPSHOT/jsonb-signature-test-11.0.0-SNAPSHOT.jar
[JENKINS] Archiving <https://ci-builds.apache.org/job/Tomee/job/master-build-full-tck/ws/tck/microprofile-tck/opentelemetry/metrics/pom.xml> to org.apache.tomee/microprofile-telemetry-metrics-tck/11.0.0-SNAPSHOT/microprofile-telemetry-metrics-tck-11.0.0-SNAPSHOT.pom
[JENKINS] Archiving <https://ci-builds.apache.org/job/Tomee/job/master-build-full-tck/ws/tck/microprofile-tck/opentelemetry/metrics/target/microprofile-telemetry-metrics-tck-11.0.0-SNAPSHOT.jar> to org.apache.tomee/microprofile-telemetry-metrics-tck/11.0.0-SNAPSHOT/microprofile-telemetry-metrics-tck-11.0.0-SNAPSHOT.jar
[JENKINS] Archiving <https://ci-builds.apache.org/job/Tomee/job/master-build-full-tck/ws/tck/jsonb-standalone/pom.xml> to org.apache.tomee/jsonb-standalone/11.0.0-SNAPSHOT/jsonb-standalone-11.0.0-SNAPSHOT.pom
[JENKINS] Archiving <https://ci-builds.apache.org/job/Tomee/job/master-build-full-tck/ws/tck/jsonb-standalone/target/jsonb-standalone-11.0.0-SNAPSHOT.jar> to org.apache.tomee/jsonb-standalone/11.0.0-SNAPSHOT/jsonb-standalone-11.0.0-SNAPSHOT.jar
[JENKINS] Archiving <https://ci-builds.apache.org/job/Tomee/job/master-build-full-tck/ws/tck/data-standalone/pom.xml> to org.apache.tomee/data-standalone/11.0.0-SNAPSHOT/data-standalone-11.0.0-SNAPSHOT.pom
[JENKINS] Archiving <https://ci-builds.apache.org/job/Tomee/job/master-build-full-tck/ws/tck/data-standalone/target/data-standalone-11.0.0-SNAPSHOT.jar> to org.apache.tomee/data-standalone/11.0.0-SNAPSHOT/data-standalone-11.0.0-SNAPSHOT.jar
[JENKINS] Archiving <https://ci-builds.apache.org/job/Tomee/job/master-build-full-tck/ws/tck/jsonp-signature-test/pom.xml> to org.apache.tomee/jsonp-signature-test/11.0.0-SNAPSHOT/jsonp-signature-test-11.0.0-SNAPSHOT.pom
[JENKINS] Archiving <https://ci-builds.apache.org/job/Tomee/job/master-build-full-tck/ws/tck/jsonp-signature-test/target/jsonp-signature-test-11.0.0-SNAPSHOT.jar> to org.apache.tomee/jsonp-signature-test/11.0.0-SNAPSHOT/jsonp-signature-test-11.0.0-SNAPSHOT.jar
[JENKINS] Archiving <https://ci-builds.apache.org/job/Tomee/job/master-build-full-tck/ws/tck/microprofile-tck/pom.xml> to org.apache.tomee/microprofile-tck/11.0.0-SNAPSHOT/microprofile-tck-11.0.0-SNAPSHOT.pom
[JENKINS] Archiving <https://ci-builds.apache.org/job/Tomee/job/master-build-full-tck/ws/tck/data-signature-test/pom.xml> to org.apache.tomee/data-signature-test/11.0.0-SNAPSHOT/data-signature-test-11.0.0-SNAPSHOT.pom
[JENKINS] Archiving <https://ci-builds.apache.org/job/Tomee/job/master-build-full-tck/ws/tck/data-signature-test/target/data-signature-test-11.0.0-SNAPSHOT.jar> to org.apache.tomee/data-signature-test/11.0.0-SNAPSHOT/data-signature-test-11.0.0-SNAPSHOT.jar
[JENKINS] Archiving <https://ci-builds.apache.org/job/Tomee/job/master-build-full-tck/ws/tck/microprofile-tck/rest-client/pom.xml> to org.apache.tomee/microprofile-rest-client-tck/11.0.0-SNAPSHOT/microprofile-rest-client-tck-11.0.0-SNAPSHOT.pom
[JENKINS] Archiving <https://ci-builds.apache.org/job/Tomee/job/master-build-full-tck/ws/tck/microprofile-tck/rest-client/target/microprofile-rest-client-tck-11.0.0-SNAPSHOT.jar> to org.apache.tomee/microprofile-rest-client-tck/11.0.0-SNAPSHOT/microprofile-rest-client-tck-11.0.0-SNAPSHOT.jar
[JENKINS] Archiving <https://ci-builds.apache.org/job/Tomee/job/master-build-full-tck/ws/tck/microprofile-tck/fault-tolerance/pom.xml> to org.apache.tomee/microprofile-fault-tolerance-tck/11.0.0-SNAPSHOT/microprofile-fault-tolerance-tck-11.0.0-SNAPSHOT.pom
[JENKINS] Archiving <https://ci-builds.apache.org/job/Tomee/job/master-build-full-tck/ws/tck/microprofile-tck/fault-tolerance/target/microprofile-fault-tolerance-tck-11.0.0-SNAPSHOT.jar> to org.apache.tomee/microprofile-fault-tolerance-tck/11.0.0-SNAPSHOT/microprofile-fault-tolerance-tck-11.0.0-SNAPSHOT.jar
[JENKINS] Archiving <https://ci-builds.apache.org/job/Tomee/job/master-build-full-tck/ws/tck/microprofile-tck/config/pom.xml> to org.apache.tomee/microprofile-config-tck/11.0.0-SNAPSHOT/microprofile-config-tck-11.0.0-SNAPSHOT.pom
[JENKINS] Archiving <https://ci-builds.apache.org/job/Tomee/job/master-build-full-tck/ws/tck/microprofile-tck/config/target/microprofile-config-tck-11.0.0-SNAPSHOT.jar> to org.apache.tomee/microprofile-config-tck/11.0.0-SNAPSHOT/microprofile-config-tck-11.0.0-SNAPSHOT.jar
[JENKINS] Archiving <https://ci-builds.apache.org/job/Tomee/job/master-build-full-tck/ws/tck/concurrency-standalone/pom.xml> to org.apache.tomee/concurrency-standalone/11.0.0-SNAPSHOT/concurrency-standalone-11.0.0-SNAPSHOT.pom
[JENKINS] Archiving <https://ci-builds.apache.org/job/Tomee/job/master-build-full-tck/ws/tck/concurrency-standalone/target/concurrency-standalone-11.0.0-SNAPSHOT.jar> to org.apache.tomee/concurrency-standalone/11.0.0-SNAPSHOT/concurrency-standalone-11.0.0-SNAPSHOT.jar
[JENKINS] Archiving <https://ci-builds.apache.org/job/Tomee/job/master-build-full-tck/ws/tck/concurrency-signature-test/pom.xml> to org.apache.tomee/concurrency-signature-test/11.0.0-SNAPSHOT/concurrency-signature-test-11.0.0-SNAPSHOT.pom
[JENKINS] Archiving <https://ci-builds.apache.org/job/Tomee/job/master-build-full-tck/ws/tck/concurrency-signature-test/target/concurrency-signature-test-11.0.0-SNAPSHOT.jar> to org.apache.tomee/concurrency-signature-test/11.0.0-SNAPSHOT/concurrency-signature-test-11.0.0-SNAPSHOT.jar
No mail will be sent out, as 'TomEE » master-build-full-tck » TomEE :: TCK :: JAX-RS TCK :: Tests Embedded #489' does not have a result yet. Please make sure you set a proper result in case of pipeline/build scripts.
No mail will be sent out, as 'TomEE » master-build-full-tck » TomEE :: TCK :: JAX-RS TCK :: Tests #489' does not have a result yet. Please make sure you set a proper result in case of pipeline/build scripts.
Sending e-mails to: commits@tomee.apache.org
No mail will be sent out, as 'TomEE » master-build-full-tck » TomEE :: TCK :: JAX-RS TCK :: Signature Test #489' does not have a result yet. Please make sure you set a proper result in case of pipeline/build scripts.
Sending e-mails to: commits@tomee.apache.org
Sending e-mails to: commits@tomee.apache.org
channel stopped
INFO: Processing JUnit
INFO: [JUnit] - 279 test report file(s) were found with the pattern '**/target/surefire-reports/TEST-*.xml' relative to '<https://ci-builds.apache.org/job/Tomee/job/master-build-full-tck/ws/'> for the testing framework 'JUnit'.
WARNING: The file '<https://ci-builds.apache.org/job/Tomee/job/master-build-full-tck/ws/tck/microprofile-tck/opentelemetry/logs/target/surefire-reports/TEST-org.eclipse.microprofile.telemetry.logs.tck.config.ServerInstanceTest.xml'> is an invalid file.
WARNING: At line 2 of <https://ci-builds.apache.org/job/Tomee/job/master-build-full-tck/ws/tck/microprofile-tck/opentelemetry/logs/target/surefire-reports/TEST-org.eclipse.microprofile.telemetry.logs.tck.config.ServerInstanceTest.xml>:cvc-complex-type.3.2.2: Attribute 'flakes' is not allowed to appear in element 'testsuite'.
WARNING: The result file '<https://ci-builds.apache.org/job/Tomee/job/master-build-full-tck/ws/tck/microprofile-tck/opentelemetry/logs/target/surefire-reports/TEST-org.eclipse.microprofile.telemetry.logs.tck.config.ServerInstanceTest.xml'> for the metric 'JUnit' is not valid. The result file has been skipped.
WARNING: The file '<https://ci-builds.apache.org/job/Tomee/job/master-build-full-tck/ws/tck/microprofile-tck/opentelemetry/metrics/target/surefire-reports/TEST-org.eclipse.microprofile.telemetry.metrics.tck.application.TestLibraries.xml'> is an invalid file.
WARNING: At line 2 of <https://ci-builds.apache.org/job/Tomee/job/master-build-full-tck/ws/tck/microprofile-tck/opentelemetry/metrics/target/surefire-reports/TEST-org.eclipse.microprofile.telemetry.metrics.tck.application.TestLibraries.xml>:cvc-complex-type.3.2.2: Attribute 'flakes' is not allowed to appear in element 'testsuite'.
WARNING: The result file '<https://ci-builds.apache.org/job/Tomee/job/master-build-full-tck/ws/tck/microprofile-tck/opentelemetry/metrics/target/surefire-reports/TEST-org.eclipse.microprofile.telemetry.metrics.tck.application.TestLibraries.xml'> for the metric 'JUnit' is not valid. The result file has been skipped.
WARNING: The file '<https://ci-builds.apache.org/job/Tomee/job/master-build-full-tck/ws/tck/microprofile-tck/opentelemetry/metrics/target/surefire-reports/TEST-org.eclipse.microprofile.telemetry.metrics.tck.application.TestUtils.xml'> is an invalid file.
WARNING: At line 2 of <https://ci-builds.apache.org/job/Tomee/job/master-build-full-tck/ws/tck/microprofile-tck/opentelemetry/metrics/target/surefire-reports/TEST-org.eclipse.microprofile.telemetry.metrics.tck.application.TestUtils.xml>:cvc-complex-type.3.2.2: Attribute 'flakes' is not allowed to appear in element 'testsuite'.
WARNING: The result file '<https://ci-builds.apache.org/job/Tomee/job/master-build-full-tck/ws/tck/microprofile-tck/opentelemetry/metrics/target/surefire-reports/TEST-org.eclipse.microprofile.telemetry.metrics.tck.application.TestUtils.xml'> for the metric 'JUnit' is not valid. The result file has been skipped.
WARNING: The file '<https://ci-builds.apache.org/job/Tomee/job/master-build-full-tck/ws/tck/microprofile-tck/opentelemetry/metrics/target/surefire-reports/TEST-org.eclipse.microprofile.telemetry.metrics.tck.application.cdi.AsyncDoubleCounterTest.xml'> is an invalid file.
WARNING: At line 2 of <https://ci-builds.apache.org/job/Tomee/job/master-build-full-tck/ws/tck/microprofile-tck/opentelemetry/metrics/target/surefire-reports/TEST-org.eclipse.microprofile.telemetry.metrics.tck.application.cdi.AsyncDoubleCounterTest.xml>:cvc-complex-type.3.2.2: Attribute 'flakes' is not allowed to appear in element 'testsuite'.
WARNING: The result file '<https://ci-builds.apache.org/job/Tomee/job/master-build-full-tck/ws/tck/microprofile-tck/opentelemetry/metrics/target/surefire-reports/TEST-org.eclipse.microprofile.telemetry.metrics.tck.application.cdi.AsyncDoubleCounterTest.xml'> for the metric 'JUnit' is not valid. The result file has been skipped.
WARNING: The file '<https://ci-builds.apache.org/job/Tomee/job/master-build-full-tck/ws/tck/microprofile-tck/opentelemetry/metrics/target/surefire-reports/TEST-org.eclipse.microprofile.telemetry.metrics.tck.application.cdi.AsyncLongCounterTest.xml'> is an invalid file.
WARNING: At line 2 of <https://ci-builds.apache.org/job/Tomee/job/master-build-full-tck/ws/tck/microprofile-tck/opentelemetry/metrics/target/surefire-reports/TEST-org.eclipse.microprofile.telemetry.metrics.tck.application.cdi.AsyncLongCounterTest.xml>:cvc-complex-type.3.2.2: Attribute 'flakes' is not allowed to appear in element 'testsuite'.
WARNING: The result file '<https://ci-builds.apache.org/job/Tomee/job/master-build-full-tck/ws/tck/microprofile-tck/opentelemetry/metrics/target/surefire-reports/TEST-org.eclipse.microprofile.telemetry.metrics.tck.application.cdi.AsyncLongCounterTest.xml'> for the metric 'JUnit' is not valid. The result file has been skipped.
WARNING: The file '<https://ci-builds.apache.org/job/Tomee/job/master-build-full-tck/ws/tck/microprofile-tck/opentelemetry/metrics/target/surefire-reports/TEST-org.eclipse.microprofile.telemetry.metrics.tck.application.cdi.DoubleCounterTest.xml'> is an invalid file.
WARNING: At line 2 of <https://ci-builds.apache.org/job/Tomee/job/master-build-full-tck/ws/tck/microprofile-tck/opentelemetry/metrics/target/surefire-reports/TEST-org.eclipse.microprofile.telemetry.metrics.tck.application.cdi.DoubleCounterTest.xml>:cvc-complex-type.3.2.2: Attribute 'flakes' is not allowed to appear in element 'testsuite'.
WARNING: The result file '<https://ci-builds.apache.org/job/Tomee/job/master-build-full-tck/ws/tck/microprofile-tck/opentelemetry/metrics/target/surefire-reports/TEST-org.eclipse.microprofile.telemetry.metrics.tck.application.cdi.DoubleCounterTest.xml'> for the metric 'JUnit' is not valid. The result file has been skipped.
WARNING: The file '<https://ci-builds.apache.org/job/Tomee/job/master-build-full-tck/ws/tck/microprofile-tck/opentelemetry/metrics/target/surefire-reports/TEST-org.eclipse.microprofile.telemetry.metrics.tck.application.cdi.DoubleGaugeTest.xml'> is an invalid file.
WARNING: At line 2 of <https://ci-builds.apache.org/job/Tomee/job/master-build-full-tck/ws/tck/microprofile-tck/opentelemetry/metrics/target/surefire-reports/TEST-org.eclipse.microprofile.telemetry.metrics.tck.application.cdi.DoubleGaugeTest.xml>:cvc-complex-type.3.2.2: Attribute 'flakes' is not allowed to appear in element 'testsuite'.
WARNING: The result file '<https://ci-builds.apache.org/job/Tomee/job/master-build-full-tck/ws/tck/microprofile-tck/opentelemetry/metrics/target/surefire-reports/TEST-org.eclipse.microprofile.telemetry.metrics.tck.application.cdi.DoubleGaugeTest.xml'> for the metric 'JUnit' is not valid. The result file has been skipped.
WARNING: The file '<https://ci-builds.apache.org/job/Tomee/job/master-build-full-tck/ws/tck/microprofile-tck/opentelemetry/metrics/target/surefire-reports/TEST-org.eclipse.microprofile.telemetry.metrics.tck.application.cdi.DoubleHistogramTest.xml'> is an invalid file.
WARNING: At line 2 of <https://ci-builds.apache.org/job/Tomee/job/master-build-full-tck/ws/tck/microprofile-tck/opentelemetry/metrics/target/surefire-reports/TEST-org.eclipse.microprofile.telemetry.metrics.tck.application.cdi.DoubleHistogramTest.xml>:cvc-complex-type.3.2.2: Attribute 'flakes' is not allowed to appear in element 'testsuite'.
WARNING: The result file '<https://ci-builds.apache.org/job/Tomee/job/master-build-full-tck/ws/tck/microprofile-tck/opentelemetry/metrics/target/surefire-reports/TEST-org.eclipse.microprofile.telemetry.metrics.tck.application.cdi.DoubleHistogramTest.xml'> for the metric 'JUnit' is not valid. The result file has been skipped.
WARNING: The file '<https://ci-builds.apache.org/job/Tomee/job/master-build-full-tck/ws/tck/microprofile-tck/opentelemetry/metrics/target/surefire-reports/TEST-org.eclipse.microprofile.telemetry.metrics.tck.application.cdi.DoubleUpDownCounterTest.xml'> is an invalid file.
WARNING: At line 2 of <https://ci-builds.apache.org/job/Tomee/job/master-build-full-tck/ws/tck/microprofile-tck/opentelemetry/metrics/target/surefire-reports/TEST-org.eclipse.microprofile.telemetry.metrics.tck.application.cdi.DoubleUpDownCounterTest.xml>:cvc-complex-type.3.2.2: Attribute 'flakes' is not allowed to appear in element 'testsuite'.
WARNING: The result file '<https://ci-builds.apache.org/job/Tomee/job/master-build-full-tck/ws/tck/microprofile-tck/opentelemetry/metrics/target/surefire-reports/TEST-org.eclipse.microprofile.telemetry.metrics.tck.application.cdi.DoubleUpDownCounterTest.xml'> for the metric 'JUnit' is not valid. The result file has been skipped.
WARNING: The file '<https://ci-builds.apache.org/job/Tomee/job/master-build-full-tck/ws/tck/microprofile-tck/opentelemetry/metrics/target/surefire-reports/TEST-org.eclipse.microprofile.telemetry.metrics.tck.application.cdi.LongCounterTest.xml'> is an invalid file.
WARNING: At line 2 of <https://ci-builds.apache.org/job/Tomee/job/master-build-full-tck/ws/tck/microprofile-tck/opentelemetry/metrics/target/surefire-reports/TEST-org.eclipse.microprofile.telemetry.metrics.tck.application.cdi.LongCounterTest.xml>:cvc-complex-type.3.2.2: Attribute 'flakes' is not allowed to appear in element 'testsuite'.
WARNING: The result file '<https://ci-builds.apache.org/job/Tomee/job/master-build-full-tck/ws/tck/microprofile-tck/opentelemetry/metrics/target/surefire-reports/TEST-org.eclipse.microprofile.telemetry.metrics.tck.application.cdi.LongCounterTest.xml'> for the metric 'JUnit' is not valid. The result file has been skipped.
WARNING: The file '<https://ci-builds.apache.org/job/Tomee/job/master-build-full-tck/ws/tck/microprofile-tck/opentelemetry/metrics/target/surefire-reports/TEST-org.eclipse.microprofile.telemetry.metrics.tck.application.cdi.LongGaugeTest.xml'> is an invalid file.
WARNING: At line 2 of <https://ci-builds.apache.org/job/Tomee/job/master-build-full-tck/ws/tck/microprofile-tck/opentelemetry/metrics/target/surefire-reports/TEST-org.eclipse.microprofile.telemetry.metrics.tck.application.cdi.LongGaugeTest.xml>:cvc-complex-type.3.2.2: Attribute 'flakes' is not allowed to appear in element 'testsuite'.
WARNING: The result file '<https://ci-builds.apache.org/job/Tomee/job/master-build-full-tck/ws/tck/microprofile-tck/opentelemetry/metrics/target/surefire-reports/TEST-org.eclipse.microprofile.telemetry.metrics.tck.application.cdi.LongGaugeTest.xml'> for the metric 'JUnit' is not valid. The result file has been skipped.
WARNING: The file '<https://ci-builds.apache.org/job/Tomee/job/master-build-full-tck/ws/tck/microprofile-tck/opentelemetry/metrics/target/surefire-reports/TEST-org.eclipse.microprofile.telemetry.metrics.tck.application.cdi.LongHistogramTest.xml'> is an invalid file.
WARNING: At line 2 of <https://ci-builds.apache.org/job/Tomee/job/master-build-full-tck/ws/tck/microprofile-tck/opentelemetry/metrics/target/surefire-reports/TEST-org.eclipse.microprofile.telemetry.metrics.tck.application.cdi.LongHistogramTest.xml>:cvc-complex-type.3.2.2: Attribute 'flakes' is not allowed to appear in element 'testsuite'.
WARNING: The result file '<https://ci-builds.apache.org/job/Tomee/job/master-build-full-tck/ws/tck/microprofile-tck/opentelemetry/metrics/target/surefire-reports/TEST-org.eclipse.microprofile.telemetry.metrics.tck.application.cdi.LongHistogramTest.xml'> for the metric 'JUnit' is not valid. The result file has been skipped.
WARNING: The file '<https://ci-builds.apache.org/job/Tomee/job/master-build-full-tck/ws/tck/microprofile-tck/opentelemetry/metrics/target/surefire-reports/TEST-org.eclipse.microprofile.telemetry.metrics.tck.application.cdi.LongUpDownCounterTest.xml'> is an invalid file.
WARNING: At line 2 of <https://ci-builds.apache.org/job/Tomee/job/master-build-full-tck/ws/tck/microprofile-tck/opentelemetry/metrics/target/surefire-reports/TEST-org.eclipse.microprofile.telemetry.metrics.tck.application.cdi.LongUpDownCounterTest.xml>:cvc-complex-type.3.2.2: Attribute 'flakes' is not allowed to appear in element 'testsuite'.
WARNING: The result file '<https://ci-builds.apache.org/job/Tomee/job/master-build-full-tck/ws/tck/microprofile-tck/opentelemetry/metrics/target/surefire-reports/TEST-org.eclipse.microprofile.telemetry.metrics.tck.application.cdi.LongUpDownCounterTest.xml'> for the metric 'JUnit' is not valid. The result file has been skipped.
WARNING: The file '<https://ci-builds.apache.org/job/Tomee/job/master-build-full-tck/ws/tck/microprofile-tck/opentelemetry/metrics/target/surefire-reports/TEST-org.eclipse.microprofile.telemetry.metrics.tck.application.http.HttpHistogramTest.xml'> is an invalid file.
WARNING: At line 2 of <https://ci-builds.apache.org/job/Tomee/job/master-build-full-tck/ws/tck/microprofile-tck/opentelemetry/metrics/target/surefire-reports/TEST-org.eclipse.microprofile.telemetry.metrics.tck.application.http.HttpHistogramTest.xml>:cvc-complex-type.3.2.2: Attribute 'flakes' is not allowed to appear in element 'testsuite'.
WARNING: The result file '<https://ci-builds.apache.org/job/Tomee/job/master-build-full-tck/ws/tck/microprofile-tck/opentelemetry/metrics/target/surefire-reports/TEST-org.eclipse.microprofile.telemetry.metrics.tck.application.http.HttpHistogramTest.xml'> for the metric 'JUnit' is not valid. The result file has been skipped.
WARNING: The file '<https://ci-builds.apache.org/job/Tomee/job/master-build-full-tck/ws/tck/microprofile-tck/opentelemetry/tracing/target/surefire-reports/TEST-org.eclipse.microprofile.telemetry.tracing.tck.TestApplication$HelloBean.xml'> is an invalid file.
WARNING: At line 2 of <https://ci-builds.apache.org/job/Tomee/job/master-build-full-tck/ws/tck/microprofile-tck/opentelemetry/tracing/target/surefire-reports/TEST-org.eclipse.microprofile.telemetry.tracing.tck.TestApplication$HelloBean.xml>:cvc-complex-type.3.2.2: Attribute 'flakes' is not allowed to appear in element 'testsuite'.
WARNING: The result file '<https://ci-builds.apache.org/job/Tomee/job/master-build-full-tck/ws/tck/microprofile-tck/opentelemetry/tracing/target/surefire-reports/TEST-org.eclipse.microprofile.telemetry.tracing.tck.TestApplication$HelloBean.xml'> for the metric 'JUnit' is not valid. The result file has been skipped.
WARNING: The file '<https://ci-builds.apache.org/job/Tomee/job/master-build-full-tck/ws/tck/microprofile-tck/opentelemetry/tracing/target/surefire-reports/TEST-org.eclipse.microprofile.telemetry.tracing.tck.TestApplication$RestApplication.xml'> is an invalid file.
WARNING: At line 2 of <https://ci-builds.apache.org/job/Tomee/job/master-build-full-tck/ws/tck/microprofile-tck/opentelemetry/tracing/target/surefire-reports/TEST-org.eclipse.microprofile.telemetry.tracing.tck.TestApplication$RestApplication.xml>:cvc-complex-type.3.2.2: Attribute 'flakes' is not allowed to appear in element 'testsuite'.
WARNING: The result file '<https://ci-builds.apache.org/job/Tomee/job/master-build-full-tck/ws/tck/microprofile-tck/opentelemetry/tracing/target/surefire-reports/TEST-org.eclipse.microprofile.telemetry.tracing.tck.TestApplication$RestApplication.xml'> for the metric 'JUnit' is not valid. The result file has been skipped.
WARNING: The file '<https://ci-builds.apache.org/job/Tomee/job/master-build-full-tck/ws/tck/microprofile-tck/opentelemetry/tracing/target/surefire-reports/TEST-org.eclipse.microprofile.telemetry.tracing.tck.TestApplication$TestEndpoint.xml'> is an invalid file.
WARNING: At line 2 of <https://ci-builds.apache.org/job/Tomee/job/master-build-full-tck/ws/tck/microprofile-tck/opentelemetry/tracing/target/surefire-reports/TEST-org.eclipse.microprofile.telemetry.tracing.tck.TestApplication$TestEndpoint.xml>:cvc-complex-type.3.2.2: Attribute 'flakes' is not allowed to appear in element 'testsuite'.
WARNING: The result file '<https://ci-builds.apache.org/job/Tomee/job/master-build-full-tck/ws/tck/microprofile-tck/opentelemetry/tracing/target/surefire-reports/TEST-org.eclipse.microprofile.telemetry.tracing.tck.TestApplication$TestEndpoint.xml'> for the metric 'JUnit' is not valid. The result file has been skipped.
WARNING: The file '<https://ci-builds.apache.org/job/Tomee/job/master-build-full-tck/ws/tck/microprofile-tck/opentelemetry/tracing/target/surefire-reports/TEST-org.eclipse.microprofile.telemetry.tracing.tck.TestApplication.xml'> is an invalid file.
WARNING: At line 2 of <https://ci-builds.apache.org/job/Tomee/job/master-build-full-tck/ws/tck/microprofile-tck/opentelemetry/tracing/target/surefire-reports/TEST-org.eclipse.microprofile.telemetry.tracing.tck.TestApplication.xml>:cvc-complex-type.3.2.2: Attribute 'flakes' is not allowed to appear in element 'testsuite'.
WARNING: The result file '<https://ci-builds.apache.org/job/Tomee/job/master-build-full-tck/ws/tck/microprofile-tck/opentelemetry/tracing/target/surefire-reports/TEST-org.eclipse.microprofile.telemetry.tracing.tck.TestApplication.xml'> for the metric 'JUnit' is not valid. The result file has been skipped.
WARNING: The file '<https://ci-builds.apache.org/job/Tomee/job/master-build-full-tck/ws/tck/microprofile-tck/opentelemetry/tracing/target/surefire-reports/TEST-org.eclipse.microprofile.telemetry.tracing.tck.TestLibraries.xml'> is an invalid file.
WARNING: At line 2 of <https://ci-builds.apache.org/job/Tomee/job/master-build-full-tck/ws/tck/microprofile-tck/opentelemetry/tracing/target/surefire-reports/TEST-org.eclipse.microprofile.telemetry.tracing.tck.TestLibraries.xml>:cvc-complex-type.3.2.2: Attribute 'flakes' is not allowed to appear in element 'testsuite'.
WARNING: The result file '<https://ci-builds.apache.org/job/Tomee/job/master-build-full-tck/ws/tck/microprofile-tck/opentelemetry/tracing/target/surefire-reports/TEST-org.eclipse.microprofile.telemetry.tracing.tck.TestLibraries.xml'> for the metric 'JUnit' is not valid. The result file has been skipped.
WARNING: The file '<https://ci-builds.apache.org/job/Tomee/job/master-build-full-tck/ws/tck/microprofile-tck/opentelemetry/tracing/target/surefire-reports/TEST-org.eclipse.microprofile.telemetry.tracing.tck.cdi.BaggageBeanTest.xml'> is an invalid file.
WARNING: At line 2 of <https://ci-builds.apache.org/job/Tomee/job/master-build-full-tck/ws/tck/microprofile-tck/opentelemetry/tracing/target/surefire-reports/TEST-org.eclipse.microprofile.telemetry.tracing.tck.cdi.BaggageBeanTest.xml>:cvc-complex-type.3.2.2: Attribute 'flakes' is not allowed to appear in element 'testsuite'.
WARNING: The result file '<https://ci-builds.apache.org/job/Tomee/job/master-build-full-tck/ws/tck/microprofile-tck/opentelemetry/tracing/target/surefire-reports/TEST-org.eclipse.microprofile.telemetry.tracing.tck.cdi.BaggageBeanTest.xml'> for the metric 'JUnit' is not valid. The result file has been skipped.
WARNING: The file '<https://ci-builds.apache.org/job/Tomee/job/master-build-full-tck/ws/tck/microprofile-tck/opentelemetry/tracing/target/surefire-reports/TEST-org.eclipse.microprofile.telemetry.tracing.tck.cdi.OpenTelemetryBeanTest.xml'> is an invalid file.
WARNING: At line 2 of <https://ci-builds.apache.org/job/Tomee/job/master-build-full-tck/ws/tck/microprofile-tck/opentelemetry/tracing/target/surefire-reports/TEST-org.eclipse.microprofile.telemetry.tracing.tck.cdi.OpenTelemetryBeanTest.xml>:cvc-complex-type.3.2.2: Attribute 'flakes' is not allowed to appear in element 'testsuite'.
WARNING: The result file '<https://ci-builds.apache.org/job/Tomee/job/master-build-full-tck/ws/tck/microprofile-tck/opentelemetry/tracing/target/surefire-reports/TEST-org.eclipse.microprofile.telemetry.tracing.tck.cdi.OpenTelemetryBeanTest.xml'> for the metric 'JUnit' is not valid. The result file has been skipped.
WARNING: The file '<https://ci-builds.apache.org/job/Tomee/job/master-build-full-tck/ws/tck/microprofile-tck/opentelemetry/tracing/target/surefire-reports/TEST-org.eclipse.microprofile.telemetry.tracing.tck.cdi.SpanBeanTest.xml'> is an invalid file.
WARNING: At line 2 of <https://ci-builds.apache.org/job/Tomee/job/master-build-full-tck/ws/tck/microprofile-tck/opentelemetry/tracing/target/surefire-reports/TEST-org.eclipse.microprofile.telemetry.tracing.tck.cdi.SpanBeanTest.xml>:cvc-complex-type.3.2.2: Attribute 'flakes' is not allowed to appear in element 'testsuite'.
WARNING: The result file '<https://ci-builds.apache.org/job/Tomee/job/master-build-full-tck/ws/tck/microprofile-tck/opentelemetry/tracing/target/surefire-reports/TEST-org.eclipse.microprofile.telemetry.tracing.tck.cdi.SpanBeanTest.xml'> for the metric 'JUnit' is not valid. The result file has been skipped.
WARNING: The file '<https://ci-builds.apache.org/job/Tomee/job/master-build-full-tck/ws/tck/microprofile-tck/opentelemetry/tracing/target/surefire-reports/TEST-org.eclipse.microprofile.telemetry.tracing.tck.cdi.TracerTest.xml'> is an invalid file.
WARNING: At line 2 of <https://ci-builds.apache.org/job/Tomee/job/master-build-full-tck/ws/tck/microprofile-tck/opentelemetry/tracing/target/surefire-reports/TEST-org.eclipse.microprofile.telemetry.tracing.tck.cdi.TracerTest.xml>:cvc-complex-type.3.2.2: Attribute 'flakes' is not allowed to appear in element 'testsuite'.
WARNING: The result file '<https://ci-builds.apache.org/job/Tomee/job/master-build-full-tck/ws/tck/microprofile-tck/opentelemetry/tracing/target/surefire-reports/TEST-org.eclipse.microprofile.telemetry.tracing.tck.cdi.TracerTest.xml'> for the metric 'JUnit' is not valid. The result file has been skipped.
WARNING: The file '<https://ci-builds.apache.org/job/Tomee/job/master-build-full-tck/ws/tck/microprofile-tck/opentelemetry/tracing/target/surefire-reports/TEST-org.eclipse.microprofile.telemetry.tracing.tck.rest.BaggageTest.xml'> is an invalid file.
WARNING: At line 2 of <https://ci-builds.apache.org/job/Tomee/job/master-build-full-tck/ws/tck/microprofile-tck/opentelemetry/tracing/target/surefire-reports/TEST-org.eclipse.microprofile.telemetry.tracing.tck.rest.BaggageTest.xml>:cvc-complex-type.3.2.2: Attribute 'flakes' is not allowed to appear in element 'testsuite'.
WARNING: The result file '<https://ci-builds.apache.org/job/Tomee/job/master-build-full-tck/ws/tck/microprofile-tck/opentelemetry/tracing/target/surefire-reports/TEST-org.eclipse.microprofile.telemetry.tracing.tck.rest.BaggageTest.xml'> for the metric 'JUnit' is not valid. The result file has been skipped.
WARNING: The file '<https://ci-builds.apache.org/job/Tomee/job/master-build-full-tck/ws/tck/microprofile-tck/opentelemetry/tracing/target/surefire-reports/TEST-org.eclipse.microprofile.telemetry.tracing.tck.rest.PropagatorSpiTest.xml'> is an invalid file.
WARNING: At line 2 of <https://ci-builds.apache.org/job/Tomee/job/master-build-full-tck/ws/tck/microprofile-tck/opentelemetry/tracing/target/surefire-reports/TEST-org.eclipse.microprofile.telemetry.tracing.tck.rest.PropagatorSpiTest.xml>:cvc-complex-type.3.2.2: Attribute 'flakes' is not allowed to appear in element 'testsuite'.
WARNING: The result file '<https://ci-builds.apache.org/job/Tomee/job/master-build-full-tck/ws/tck/microprofile-tck/opentelemetry/tracing/target/surefire-reports/TEST-org.eclipse.microprofile.telemetry.tracing.tck.rest.PropagatorSpiTest.xml'> for the metric 'JUnit' is not valid. The result file has been skipped.
WARNING: The file '<https://ci-builds.apache.org/job/Tomee/job/master-build-full-tck/ws/tck/microprofile-tck/opentelemetry/tracing/target/surefire-reports/TEST-org.eclipse.microprofile.telemetry.tracing.tck.rest.RestClientSpanDefaultTest.xml'> is an invalid file.
WARNING: At line 2 of <https://ci-builds.apache.org/job/Tomee/job/master-build-full-tck/ws/tck/microprofile-tck/opentelemetry/tracing/target/surefire-reports/TEST-org.eclipse.microprofile.telemetry.tracing.tck.rest.RestClientSpanDefaultTest.xml>:cvc-complex-type.3.2.2: Attribute 'flakes' is not allowed to appear in element 'testsuite'.
WARNING: The result file '<https://ci-builds.apache.org/job/Tomee/job/master-build-full-tck/ws/tck/microprofile-tck/opentelemetry/tracing/target/surefire-reports/TEST-org.eclipse.microprofile.telemetry.tracing.tck.rest.RestClientSpanDefaultTest.xml'> for the metric 'JUnit' is not valid. The result file has been skipped.
WARNING: The file '<https://ci-builds.apache.org/job/Tomee/job/master-build-full-tck/ws/tck/microprofile-tck/opentelemetry/tracing/target/surefire-reports/TEST-org.eclipse.microprofile.telemetry.tracing.tck.rest.RestClientSpanDisabledTest.xml'> is an invalid file.
WARNING: At line 2 of <https://ci-builds.apache.org/job/Tomee/job/master-build-full-tck/ws/tck/microprofile-tck/opentelemetry/tracing/target/surefire-reports/TEST-org.eclipse.microprofile.telemetry.tracing.tck.rest.RestClientSpanDisabledTest.xml>:cvc-complex-type.3.2.2: Attribute 'flakes' is not allowed to appear in element 'testsuite'.
WARNING: The result file '<https://ci-builds.apache.org/job/Tomee/job/master-build-full-tck/ws/tck/microprofile-tck/opentelemetry/tracing/target/surefire-reports/TEST-org.eclipse.microprofile.telemetry.tracing.tck.rest.RestClientSpanDisabledTest.xml'> for the metric 'JUnit' is not valid. The result file has been skipped.
WARNING: The file '<https://ci-builds.apache.org/job/Tomee/job/master-build-full-tck/ws/tck/microprofile-tck/opentelemetry/tracing/target/surefire-reports/TEST-org.eclipse.microprofile.telemetry.tracing.tck.rest.RestClientSpanTest.xml'> is an invalid file.
WARNING: At line 2 of <https://ci-builds.apache.org/job/Tomee/job/master-build-full-tck/ws/tck/microprofile-tck/opentelemetry/tracing/target/surefire-reports/TEST-org.eclipse.microprofile.telemetry.tracing.tck.rest.RestClientSpanTest.xml>:cvc-complex-type.3.2.2: Attribute 'flakes' is not allowed to appear in element 'testsuite'.
WARNING: The result file '<https://ci-builds.apache.org/job/Tomee/job/master-build-full-tck/ws/tck/microprofile-tck/opentelemetry/tracing/target/surefire-reports/TEST-org.eclipse.microprofile.telemetry.tracing.tck.rest.RestClientSpanTest.xml'> for the metric 'JUnit' is not valid. The result file has been skipped.
WARNING: The file '<https://ci-builds.apache.org/job/Tomee/job/master-build-full-tck/ws/tck/microprofile-tck/opentelemetry/tracing/target/surefire-reports/TEST-org.eclipse.microprofile.telemetry.tracing.tck.rest.RestSpanDefaultTest.xml'> is an invalid file.
WARNING: At line 2 of <https://ci-builds.apache.org/job/Tomee/job/master-build-full-tck/ws/tck/microprofile-tck/opentelemetry/tracing/target/surefire-reports/TEST-org.eclipse.microprofile.telemetry.tracing.tck.rest.RestSpanDefaultTest.xml>:cvc-complex-type.3.2.2: Attribute 'flakes' is not allowed to appear in element 'testsuite'.
WARNING: The result file '<https://ci-builds.apache.org/job/Tomee/job/master-build-full-tck/ws/tck/microprofile-tck/opentelemetry/tracing/target/surefire-reports/TEST-org.eclipse.microprofile.telemetry.tracing.tck.rest.RestSpanDefaultTest.xml'> for the metric 'JUnit' is not valid. The result file has been skipped.
WARNING: The file '<https://ci-builds.apache.org/job/Tomee/job/master-build-full-tck/ws/tck/microprofile-tck/opentelemetry/tracing/target/surefire-reports/TEST-org.eclipse.microprofile.telemetry.tracing.tck.rest.RestSpanDisabledTest.xml'> is an invalid file.
WARNING: At line 2 of <https://ci-builds.apache.org/job/Tomee/job/master-build-full-tck/ws/tck/microprofile-tck/opentelemetry/tracing/target/surefire-reports/TEST-org.eclipse.microprofile.telemetry.tracing.tck.rest.RestSpanDisabledTest.xml>:cvc-complex-type.3.2.2: Attribute 'flakes' is not allowed to appear in element 'testsuite'.
WARNING: The result file '<https://ci-builds.apache.org/job/Tomee/job/master-build-full-tck/ws/tck/microprofile-tck/opentelemetry/tracing/target/surefire-reports/TEST-org.eclipse.microprofile.telemetry.tracing.tck.rest.RestSpanDisabledTest.xml'> for the metric 'JUnit' is not valid. The result file has been skipped.
WARNING: The file '<https://ci-builds.apache.org/job/Tomee/job/master-build-full-tck/ws/tck/microprofile-tck/opentelemetry/tracing/target/surefire-reports/TEST-org.eclipse.microprofile.telemetry.tracing.tck.rest.RestSpanTest.xml'> is an invalid file.
WARNING: At line 2 of <https://ci-builds.apache.org/job/Tomee/job/master-build-full-tck/ws/tck/microprofile-tck/opentelemetry/tracing/target/surefire-reports/TEST-org.eclipse.microprofile.telemetry.tracing.tck.rest.RestSpanTest.xml>:cvc-complex-type.3.2.2: Attribute 'flakes' is not allowed to appear in element 'testsuite'.
WARNING: The result file '<https://ci-builds.apache.org/job/Tomee/job/master-build-full-tck/ws/tck/microprofile-tck/opentelemetry/tracing/target/surefire-reports/TEST-org.eclipse.microprofile.telemetry.tracing.tck.rest.RestSpanTest.xml'> for the metric 'JUnit' is not valid. The result file has been skipped.
WARNING: The file '<https://ci-builds.apache.org/job/Tomee/job/master-build-full-tck/ws/tck/microprofile-tck/opentelemetry/tracing/target/surefire-reports/TEST-org.eclipse.microprofile.telemetry.tracing.tck.rest.TestPropagator.xml'> is an invalid file.
WARNING: At line 2 of <https://ci-builds.apache.org/job/Tomee/job/master-build-full-tck/ws/tck/microprofile-tck/opentelemetry/tracing/target/surefire-reports/TEST-org.eclipse.microprofile.telemetry.tracing.tck.rest.TestPropagator.xml>:cvc-complex-type.3.2.2: Attribute 'flakes' is not allowed to appear in element 'testsuite'.
WARNING: The result file '<https://ci-builds.apache.org/job/Tomee/job/master-build-full-tck/ws/tck/microprofile-tck/opentelemetry/tracing/target/surefire-reports/TEST-org.eclipse.microprofile.telemetry.tracing.tck.rest.TestPropagator.xml'> for the metric 'JUnit' is not valid. The result file has been skipped.
WARNING: The file '<https://ci-builds.apache.org/job/Tomee/job/master-build-full-tck/ws/tck/microprofile-tck/opentelemetry/tracing/target/surefire-reports/TEST-org.eclipse.microprofile.telemetry.tracing.tck.rest.TestPropagatorProvider.xml'> is an invalid file.
WARNING: At line 2 of <https://ci-builds.apache.org/job/Tomee/job/master-build-full-tck/ws/tck/microprofile-tck/opentelemetry/tracing/target/surefire-reports/TEST-org.eclipse.microprofile.telemetry.tracing.tck.rest.TestPropagatorProvider.xml>:cvc-complex-type.3.2.2: Attribute 'flakes' is not allowed to appear in element 'testsuite'.
WARNING: The result file '<https://ci-builds.apache.org/job/Tomee/job/master-build-full-tck/ws/tck/microprofile-tck/opentelemetry/tracing/target/surefire-reports/TEST-org.eclipse.microprofile.telemetry.tracing.tck.rest.TestPropagatorProvider.xml'> for the metric 'JUnit' is not valid. The result file has been skipped.
WARNING: The file '<https://ci-builds.apache.org/job/Tomee/job/master-build-full-tck/ws/tck/microprofile-tck/opentelemetry/tracing/target/surefire-reports/TEST-org.eclipse.microprofile.telemetry.tracing.tck.rest.W3BaggagePropagationTest.xml'> is an invalid file.
WARNING: At line 2 of <https://ci-builds.apache.org/job/Tomee/job/master-build-full-tck/ws/tck/microprofile-tck/opentelemetry/tracing/target/surefire-reports/TEST-org.eclipse.microprofile.telemetry.tracing.tck.rest.W3BaggagePropagationTest.xml>:cvc-complex-type.3.2.2: Attribute 'flakes' is not allowed to appear in element 'testsuite'.
WARNING: The result file '<https://ci-builds.apache.org/job/Tomee/job/master-build-full-tck/ws/tck/microprofile-tck/opentelemetry/tracing/target/surefire-reports/TEST-org.eclipse.microprofile.telemetry.tracing.tck.rest.W3BaggagePropagationTest.xml'> for the metric 'JUnit' is not valid. The result file has been skipped.
WARNING: The file '<https://ci-builds.apache.org/job/Tomee/job/master-build-full-tck/ws/tck/microprofile-tck/opentelemetry/tracing/target/surefire-reports/TEST-org.eclipse.microprofile.telemetry.tracing.tck.rest.W3PropagationTest.xml'> is an invalid file.
WARNING: At line 2 of <https://ci-builds.apache.org/job/Tomee/job/master-build-full-tck/ws/tck/microprofile-tck/opentelemetry/tracing/target/surefire-reports/TEST-org.eclipse.microprofile.telemetry.tracing.tck.rest.W3PropagationTest.xml>:cvc-complex-type.3.2.2: Attribute 'flakes' is not allowed to appear in element 'testsuite'.
WARNING: The result file '<https://ci-builds.apache.org/job/Tomee/job/master-build-full-tck/ws/tck/microprofile-tck/opentelemetry/tracing/target/surefire-reports/TEST-org.eclipse.microprofile.telemetry.tracing.tck.rest.W3PropagationTest.xml'> for the metric 'JUnit' is not valid. The result file has been skipped.
WARNING: The file '<https://ci-builds.apache.org/job/Tomee/job/master-build-full-tck/ws/tck/microprofile-tck/opentelemetry/tracing/target/surefire-reports/TEST-org.eclipse.microprofile.telemetry.tracing.tck.spi.CustomizerSpiTest.xml'> is an invalid file.
WARNING: At line 2 of <https://ci-builds.apache.org/job/Tomee/job/master-build-full-tck/ws/tck/microprofile-tck/opentelemetry/tracing/target/surefire-reports/TEST-org.eclipse.microprofile.telemetry.tracing.tck.spi.CustomizerSpiTest.xml>:cvc-complex-type.3.2.2: Attribute 'flakes' is not allowed to appear in element 'testsuite'.
WARNING: The result file '<https://ci-builds.apache.org/job/Tomee/job/master-build-full-tck/ws/tck/microprofile-tck/opentelemetry/tracing/target/surefire-reports/TEST-org.eclipse.microprofile.telemetry.tracing.tck.spi.CustomizerSpiTest.xml'> for the metric 'JUnit' is not valid. The result file has been skipped.
WARNING: The file '<https://ci-builds.apache.org/job/Tomee/job/master-build-full-tck/ws/tck/microprofile-tck/opentelemetry/tracing/target/surefire-reports/TEST-org.eclipse.microprofile.telemetry.tracing.tck.spi.ExporterSpiTest.xml'> is an invalid file.
WARNING: At line 2 of <https://ci-builds.apache.org/job/Tomee/job/master-build-full-tck/ws/tck/microprofile-tck/opentelemetry/tracing/target/surefire-reports/TEST-org.eclipse.microprofile.telemetry.tracing.tck.spi.ExporterSpiTest.xml>:cvc-complex-type.3.2.2: Attribute 'flakes' is not allowed to appear in element 'testsuite'.
WARNING: The result file '<https://ci-builds.apache.org/job/Tomee/job/master-build-full-tck/ws/tck/microprofile-tck/opentelemetry/tracing/target/surefire-reports/TEST-org.eclipse.microprofile.telemetry.tracing.tck.spi.ExporterSpiTest.xml'> for the metric 'JUnit' is not valid. The result file has been skipped.
WARNING: The file '<https://ci-builds.apache.org/job/Tomee/job/master-build-full-tck/ws/tck/microprofile-tck/opentelemetry/tracing/target/surefire-reports/TEST-org.eclipse.microprofile.telemetry.tracing.tck.spi.ResourceSpiTest.xml'> is an invalid file.
WARNING: At line 2 of <https://ci-builds.apache.org/job/Tomee/job/master-build-full-tck/ws/tck/microprofile-tck/opentelemetry/tracing/target/surefire-reports/TEST-org.eclipse.microprofile.telemetry.tracing.tck.spi.ResourceSpiTest.xml>:cvc-complex-type.3.2.2: Attribute 'flakes' is not allowed to appear in element 'testsuite'.
WARNING: The result file '<https://ci-builds.apache.org/job/Tomee/job/master-build-full-tck/ws/tck/microprofile-tck/opentelemetry/tracing/target/surefire-reports/TEST-org.eclipse.microprofile.telemetry.tracing.tck.spi.ResourceSpiTest.xml'> for the metric 'JUnit' is not valid. The result file has been skipped.
WARNING: The file '<https://ci-builds.apache.org/job/Tomee/job/master-build-full-tck/ws/tck/microprofile-tck/opentelemetry/tracing/target/surefire-reports/TEST-org.eclipse.microprofile.telemetry.tracing.tck.spi.SamplerSpiTest.xml'> is an invalid file.
WARNING: At line 2 of <https://ci-builds.apache.org/job/Tomee/job/master-build-full-tck/ws/tck/microprofile-tck/opentelemetry/tracing/target/surefire-reports/TEST-org.eclipse.microprofile.telemetry.tracing.tck.spi.SamplerSpiTest.xml>:cvc-complex-type.3.2.2: Attribute 'flakes' is not allowed to appear in element 'testsuite'.
WARNING: The result file '<https://ci-builds.apache.org/job/Tomee/job/master-build-full-tck/ws/tck/microprofile-tck/opentelemetry/tracing/target/surefire-reports/TEST-org.eclipse.microprofile.telemetry.tracing.tck.spi.SamplerSpiTest.xml'> for the metric 'JUnit' is not valid. The result file has been skipped.
WARNING: The file '<https://ci-builds.apache.org/job/Tomee/job/master-build-full-tck/ws/tck/microprofile-tck/opentelemetry/tracing/target/surefire-reports/TEST-org.eclipse.microprofile.telemetry.tracing.tck.spi.TestCustomizer.xml'> is an invalid file.
WARNING: At line 2 of <https://ci-builds.apache.org/job/Tomee/job/master-build-full-tck/ws/tck/microprofile-tck/opentelemetry/tracing/target/surefire-reports/TEST-org.eclipse.microprofile.telemetry.tracing.tck.spi.TestCustomizer.xml>:cvc-complex-type.3.2.2: Attribute 'flakes' is not allowed to appear in element 'testsuite'.
WARNING: The result file '<https://ci-builds.apache.org/job/Tomee/job/master-build-full-tck/ws/tck/microprofile-tck/opentelemetry/tracing/target/surefire-reports/TEST-org.eclipse.microprofile.telemetry.tracing.tck.spi.TestCustomizer.xml'> for the metric 'JUnit' is not valid. The result file has been skipped.
WARNING: The file '<https://ci-builds.apache.org/job/Tomee/job/master-build-full-tck/ws/tck/microprofile-tck/opentelemetry/tracing/target/surefire-reports/TEST-org.eclipse.microprofile.telemetry.tracing.tck.spi.TestResourceProvider.xml'> is an invalid file.
WARNING: At line 2 of <https://ci-builds.apache.org/job/Tomee/job/master-build-full-tck/ws/tck/microprofile-tck/opentelemetry/tracing/target/surefire-reports/TEST-org.eclipse.microprofile.telemetry.tracing.tck.spi.TestResourceProvider.xml>:cvc-complex-type.3.2.2: Attribute 'flakes' is not allowed to appear in element 'testsuite'.
WARNING: The result file '<https://ci-builds.apache.org/job/Tomee/job/master-build-full-tck/ws/tck/microprofile-tck/opentelemetry/tracing/target/surefire-reports/TEST-org.eclipse.microprofile.telemetry.tracing.tck.spi.TestResourceProvider.xml'> for the metric 'JUnit' is not valid. The result file has been skipped.
WARNING: The file '<https://ci-builds.apache.org/job/Tomee/job/master-build-full-tck/ws/tck/microprofile-tck/opentelemetry/tracing/target/surefire-reports/TEST-org.eclipse.microprofile.telemetry.tracing.tck.spi.TestSampler.xml'> is an invalid file.
WARNING: At line 2 of <https://ci-builds.apache.org/job/Tomee/job/master-build-full-tck/ws/tck/microprofile-tck/opentelemetry/tracing/target/surefire-reports/TEST-org.eclipse.microprofile.telemetry.tracing.tck.spi.TestSampler.xml>:cvc-complex-type.3.2.2: Attribute 'flakes' is not allowed to appear in element 'testsuite'.
WARNING: The result file '<https://ci-builds.apache.org/job/Tomee/job/master-build-full-tck/ws/tck/microprofile-tck/opentelemetry/tracing/target/surefire-reports/TEST-org.eclipse.microprofile.telemetry.tracing.tck.spi.TestSampler.xml'> for the metric 'JUnit' is not valid. The result file has been skipped.
WARNING: The file '<https://ci-builds.apache.org/job/Tomee/job/master-build-full-tck/ws/tck/microprofile-tck/opentelemetry/tracing/target/surefire-reports/TEST-org.eclipse.microprofile.telemetry.tracing.tck.spi.TestSamplerProvider.xml'> is an invalid file.
WARNING: At line 2 of <https://ci-builds.apache.org/job/Tomee/job/master-build-full-tck/ws/tck/microprofile-tck/opentelemetry/tracing/target/surefire-reports/TEST-org.eclipse.microprofile.telemetry.tracing.tck.spi.TestSamplerProvider.xml>:cvc-complex-type.3.2.2: Attribute 'flakes' is not allowed to appear in element 'testsuite'.
WARNING: The result file '<https://ci-builds.apache.org/job/Tomee/job/master-build-full-tck/ws/tck/microprofile-tck/opentelemetry/tracing/target/surefire-reports/TEST-org.eclipse.microprofile.telemetry.tracing.tck.spi.TestSamplerProvider.xml'> for the metric 'JUnit' is not valid. The result file has been skipped.
[Checks API] No suitable checks publisher found.
INFO: Setting the build status to SUCCESS

Jenkins build is still unstable: TomEE » master-build-full-tck #511

Posted by Apache Jenkins Server <je...@builds.apache.org>.
See <https://ci-builds.apache.org/job/Tomee/job/master-build-full-tck/511/display/redirect?page=changes>


Jenkins build is still unstable: TomEE » master-build-full-tck #510

Posted by Apache Jenkins Server <je...@builds.apache.org>.
See <https://ci-builds.apache.org/job/Tomee/job/master-build-full-tck/510/display/redirect?page=changes>


Jenkins build is still unstable: TomEE » master-build-full-tck #509

Posted by Apache Jenkins Server <je...@builds.apache.org>.
See <https://ci-builds.apache.org/job/Tomee/job/master-build-full-tck/509/display/redirect?page=changes>


Jenkins build is unstable: TomEE » master-build-full-tck #508

Posted by Apache Jenkins Server <je...@builds.apache.org>.
See <https://ci-builds.apache.org/job/Tomee/job/master-build-full-tck/508/display/redirect?page=changes>


Build failed in Jenkins: TomEE » master-build-full-tck #507

Posted by Apache Jenkins Server <je...@builds.apache.org>.
See <https://ci-builds.apache.org/job/Tomee/job/master-build-full-tck/507/display/redirect>

Changes:


------------------------------------------
Started by upstream project "Tomee/master-sanity-checks" build number 1157
originally caused by:
 Started by an SCM change
Running as SYSTEM
[EnvInject] - Loading node environment variables.
Building remotely on builds60 (ubuntu ubuntu-avx) in workspace <https://ci-builds.apache.org/job/Tomee/job/master-build-full-tck/ws/>
The recommended git tool is: NONE
No credentials specified
 > git rev-parse --resolve-git-dir <https://ci-builds.apache.org/job/Tomee/job/master-build-full-tck/ws/.git> # timeout=10
Fetching changes from the remote Git repository
Also:   hudson.remoting.Channel$CallSiteStackTrace: Remote call to builds60
		at hudson.remoting.Channel.attachCallSiteStackTrace(Channel.java:1923)
		at hudson.remoting.UserRequest$ExceptionResponse.retrieve(UserRequest.java:384)
		at hudson.remoting.Channel.call(Channel.java:1112)
		at hudson.remoting.RemoteInvocationHandler.invoke(RemoteInvocationHandler.java:306)
		at PluginClassLoader for git-client/jdk.proxy139/jdk.proxy139.$Proxy271.withRepository(Unknown Source)
		at PluginClassLoader for git-client//org.jenkinsci.plugins.gitclient.RemoteGitImpl.withRepository(RemoteGitImpl.java:261)
		at PluginClassLoader for git//jenkins.plugins.git.GitHooksConfiguration.configure(GitHooksConfiguration.java:104)
		at PluginClassLoader for git//jenkins.plugins.git.GitHooksConfiguration.configure(GitHooksConfiguration.java:94)
		at PluginClassLoader for git//jenkins.plugins.git.GitHooksConfiguration.configure(GitHooksConfiguration.java:83)
		at PluginClassLoader for git//hudson.plugins.git.GitSCM.retrieveChanges(GitSCM.java:1231)
		at PluginClassLoader for git//hudson.plugins.git.GitSCM._checkout(GitSCM.java:1310)
		at PluginClassLoader for git//hudson.plugins.git.GitSCM.checkout(GitSCM.java:1277)
		at hudson.scm.SCM.checkout(SCM.java:540)
		at hudson.model.AbstractProject.checkout(AbstractProject.java:1250)
		at hudson.model.AbstractBuild$AbstractBuildExecution.defaultCheckout(AbstractBuild.java:649)
		at jenkins.scm.SCMCheckoutStrategy.checkout(SCMCheckoutStrategy.java:85)
		at hudson.model.AbstractBuild$AbstractBuildExecution.run(AbstractBuild.java:522)
		at hudson.model.Run.execute(Run.java:1833)
		at PluginClassLoader for maven-plugin//hudson.maven.MavenModuleSetBuild.run(MavenModuleSetBuild.java:543)
		at hudson.model.ResourceController.execute(ResourceController.java:101)
		at hudson.model.Executor.run(Executor.java:446)
java.io.IOException: No space left on device
	at java.base/java.io.FileOutputStream.writeBytes(Native Method)
	at java.base/java.io.FileOutputStream.write(FileOutputStream.java:336)
	at PluginClassLoader for git-client//org.eclipse.jgit.internal.storage.file.LockFile.write(LockFile.java:305)
	at PluginClassLoader for git-client//org.eclipse.jgit.storage.file.FileBasedConfig.save(FileBasedConfig.java:205)
	at PluginClassLoader for git//jenkins.plugins.git.DisableHooks.invoke(DisableHooks.java:24)
	at PluginClassLoader for git-client//org.jenkinsci.plugins.gitclient.AbstractGitAPIImpl.withRepository(AbstractGitAPIImpl.java:28)
	at PluginClassLoader for git-client//org.jenkinsci.plugins.gitclient.CliGitAPIImpl.withRepository(CliGitAPIImpl.java:82)
	at jdk.internal.reflect.GeneratedMethodAccessor237.invoke(Unknown Source)
	at java.base/jdk.internal.reflect.DelegatingMethodAccessorImpl.invoke(DelegatingMethodAccessorImpl.java:43)
	at java.base/java.lang.reflect.Method.invoke(Method.java:569)
	at hudson.remoting.RemoteInvocationHandler$RPCRequest.perform(RemoteInvocationHandler.java:986)
	at hudson.remoting.RemoteInvocationHandler$RPCRequest.call(RemoteInvocationHandler.java:961)
	at hudson.remoting.RemoteInvocationHandler$RPCRequest.call(RemoteInvocationHandler.java:907)
	at hudson.remoting.UserRequest.perform(UserRequest.java:225)
	at hudson.remoting.UserRequest.perform(UserRequest.java:50)
	at hudson.remoting.Request$2.run(Request.java:391)
	at hudson.remoting.InterceptingExecutorService.lambda$wrap$0(InterceptingExecutorService.java:81)
	at java.base/java.util.concurrent.FutureTask.run(FutureTask.java:264)
	at java.base/java.util.concurrent.ThreadPoolExecutor.runWorker(ThreadPoolExecutor.java:1136)
	at java.base/java.util.concurrent.ThreadPoolExecutor$Worker.run(ThreadPoolExecutor.java:635)
	at java.base/java.lang.Thread.run(Thread.java:840)
INFO: Processing JUnit
ERROR: Step ‘Publish xUnit test result report’ aborted due to exception: 
Also:   hudson.remoting.Channel$CallSiteStackTrace: Remote call to builds60
		at hudson.remoting.Channel.attachCallSiteStackTrace(Channel.java:1923)
		at hudson.remoting.UserRequest$ExceptionResponse.retrieve(UserRequest.java:384)
		at hudson.remoting.Channel.call(Channel.java:1112)
		at hudson.FilePath.act(FilePath.java:1228)
		at hudson.FilePath.act(FilePath.java:1217)
		at PluginClassLoader for xunit//org.jenkinsci.plugins.xunit.XUnitProcessor.processTestsReport(XUnitProcessor.java:212)
		at PluginClassLoader for xunit//org.jenkinsci.plugins.xunit.XUnitProcessor.process(XUnitProcessor.java:161)
		at PluginClassLoader for xunit//org.jenkinsci.plugins.xunit.XUnitPublisher.perform(XUnitPublisher.java:230)
		at jenkins.tasks.SimpleBuildStep.perform(SimpleBuildStep.java:123)
		at hudson.tasks.BuildStepCompatibilityLayer.perform(BuildStepCompatibilityLayer.java:80)
		at hudson.tasks.BuildStepMonitor$1.perform(BuildStepMonitor.java:20)
		at hudson.model.AbstractBuild$AbstractBuildExecution.perform(AbstractBuild.java:818)
		at hudson.model.AbstractBuild$AbstractBuildExecution.performAllBuildSteps(AbstractBuild.java:767)
		at PluginClassLoader for maven-plugin//hudson.maven.MavenModuleSetBuild$MavenModuleSetBuildExecution.post2(MavenModuleSetBuild.java:1072)
		at hudson.model.AbstractBuild$AbstractBuildExecution.post(AbstractBuild.java:711)
		at hudson.model.Run.execute(Run.java:1856)
		at PluginClassLoader for maven-plugin//hudson.maven.MavenModuleSetBuild.run(MavenModuleSetBuild.java:543)
		at hudson.model.ResourceController.execute(ResourceController.java:101)
		at hudson.model.Executor.run(Executor.java:446)
java.io.IOException: Cannot create directory '<https://ci-builds.apache.org/job/Tomee/job/master-build-full-tck/ws/generatedJUnitFiles/85b3588c-41cb-4a25-ad56-ded8bada5b42'.>
	at org.apache.commons.io.FileUtils.mkdirs(FileUtils.java:2373)
	at org.apache.commons.io.FileUtils.forceMkdir(FileUtils.java:1431)
	at PluginClassLoader for xunit//org.jenkinsci.plugins.xunit.service.XUnitTransformerCallable.invoke(XUnitTransformerCallable.java:80)
	at PluginClassLoader for xunit//org.jenkinsci.plugins.xunit.service.XUnitTransformerCallable.invoke(XUnitTransformerCallable.java:38)
	at hudson.FilePath$FileCallableWrapper.call(FilePath.java:3614)
	at hudson.remoting.UserRequest.perform(UserRequest.java:225)
	at hudson.remoting.UserRequest.perform(UserRequest.java:50)
	at hudson.remoting.Request$2.run(Request.java:391)
	at hudson.remoting.InterceptingExecutorService.lambda$wrap$0(InterceptingExecutorService.java:81)
	at java.base/java.util.concurrent.FutureTask.run(FutureTask.java:264)
	at java.base/java.util.concurrent.ThreadPoolExecutor.runWorker(ThreadPoolExecutor.java:1136)
	at java.base/java.util.concurrent.ThreadPoolExecutor$Worker.run(ThreadPoolExecutor.java:635)
	at java.base/java.lang.Thread.run(Thread.java:840)

Build failed in Jenkins: TomEE » master-build-full-tck #506

Posted by Apache Jenkins Server <je...@builds.apache.org>.
See <https://ci-builds.apache.org/job/Tomee/job/master-build-full-tck/506/display/redirect>

Changes:


------------------------------------------
Started by upstream project "Tomee/master-sanity-checks" build number 1156
originally caused by:
 Started by an SCM change
Running as SYSTEM
[EnvInject] - Loading node environment variables.
Building remotely on builds60 (ubuntu ubuntu-avx) in workspace <https://ci-builds.apache.org/job/Tomee/job/master-build-full-tck/ws/>
The recommended git tool is: NONE
No credentials specified
 > git rev-parse --resolve-git-dir <https://ci-builds.apache.org/job/Tomee/job/master-build-full-tck/ws/.git> # timeout=10
Fetching changes from the remote Git repository
Also:   hudson.remoting.Channel$CallSiteStackTrace: Remote call to builds60
		at hudson.remoting.Channel.attachCallSiteStackTrace(Channel.java:1923)
		at hudson.remoting.UserRequest$ExceptionResponse.retrieve(UserRequest.java:384)
		at hudson.remoting.Channel.call(Channel.java:1112)
		at hudson.remoting.RemoteInvocationHandler.invoke(RemoteInvocationHandler.java:306)
		at PluginClassLoader for git-client/jdk.proxy139/jdk.proxy139.$Proxy271.withRepository(Unknown Source)
		at PluginClassLoader for git-client//org.jenkinsci.plugins.gitclient.RemoteGitImpl.withRepository(RemoteGitImpl.java:261)
		at PluginClassLoader for git//jenkins.plugins.git.GitHooksConfiguration.configure(GitHooksConfiguration.java:104)
		at PluginClassLoader for git//jenkins.plugins.git.GitHooksConfiguration.configure(GitHooksConfiguration.java:94)
		at PluginClassLoader for git//jenkins.plugins.git.GitHooksConfiguration.configure(GitHooksConfiguration.java:83)
		at PluginClassLoader for git//hudson.plugins.git.GitSCM.retrieveChanges(GitSCM.java:1231)
		at PluginClassLoader for git//hudson.plugins.git.GitSCM._checkout(GitSCM.java:1310)
		at PluginClassLoader for git//hudson.plugins.git.GitSCM.checkout(GitSCM.java:1277)
		at hudson.scm.SCM.checkout(SCM.java:540)
		at hudson.model.AbstractProject.checkout(AbstractProject.java:1250)
		at hudson.model.AbstractBuild$AbstractBuildExecution.defaultCheckout(AbstractBuild.java:649)
		at jenkins.scm.SCMCheckoutStrategy.checkout(SCMCheckoutStrategy.java:85)
		at hudson.model.AbstractBuild$AbstractBuildExecution.run(AbstractBuild.java:522)
		at hudson.model.Run.execute(Run.java:1833)
		at PluginClassLoader for maven-plugin//hudson.maven.MavenModuleSetBuild.run(MavenModuleSetBuild.java:543)
		at hudson.model.ResourceController.execute(ResourceController.java:101)
		at hudson.model.Executor.run(Executor.java:446)
java.io.IOException: No space left on device
	at java.base/java.io.FileOutputStream.writeBytes(Native Method)
	at java.base/java.io.FileOutputStream.write(FileOutputStream.java:336)
	at PluginClassLoader for git-client//org.eclipse.jgit.internal.storage.file.LockFile.write(LockFile.java:305)
	at PluginClassLoader for git-client//org.eclipse.jgit.storage.file.FileBasedConfig.save(FileBasedConfig.java:205)
	at PluginClassLoader for git//jenkins.plugins.git.DisableHooks.invoke(DisableHooks.java:24)
	at PluginClassLoader for git-client//org.jenkinsci.plugins.gitclient.AbstractGitAPIImpl.withRepository(AbstractGitAPIImpl.java:28)
	at PluginClassLoader for git-client//org.jenkinsci.plugins.gitclient.CliGitAPIImpl.withRepository(CliGitAPIImpl.java:82)
	at jdk.internal.reflect.GeneratedMethodAccessor237.invoke(Unknown Source)
	at java.base/jdk.internal.reflect.DelegatingMethodAccessorImpl.invoke(DelegatingMethodAccessorImpl.java:43)
	at java.base/java.lang.reflect.Method.invoke(Method.java:569)
	at hudson.remoting.RemoteInvocationHandler$RPCRequest.perform(RemoteInvocationHandler.java:986)
	at hudson.remoting.RemoteInvocationHandler$RPCRequest.call(RemoteInvocationHandler.java:961)
	at hudson.remoting.RemoteInvocationHandler$RPCRequest.call(RemoteInvocationHandler.java:907)
	at hudson.remoting.UserRequest.perform(UserRequest.java:225)
	at hudson.remoting.UserRequest.perform(UserRequest.java:50)
	at hudson.remoting.Request$2.run(Request.java:391)
	at hudson.remoting.InterceptingExecutorService.lambda$wrap$0(InterceptingExecutorService.java:81)
	at java.base/java.util.concurrent.FutureTask.run(FutureTask.java:264)
	at java.base/java.util.concurrent.ThreadPoolExecutor.runWorker(ThreadPoolExecutor.java:1136)
	at java.base/java.util.concurrent.ThreadPoolExecutor$Worker.run(ThreadPoolExecutor.java:635)
	at java.base/java.lang.Thread.run(Thread.java:840)
INFO: Processing JUnit
ERROR: Step ‘Publish xUnit test result report’ aborted due to exception: 
Also:   hudson.remoting.Channel$CallSiteStackTrace: Remote call to builds60
		at hudson.remoting.Channel.attachCallSiteStackTrace(Channel.java:1923)
		at hudson.remoting.UserRequest$ExceptionResponse.retrieve(UserRequest.java:384)
		at hudson.remoting.Channel.call(Channel.java:1112)
		at hudson.FilePath.act(FilePath.java:1228)
		at hudson.FilePath.act(FilePath.java:1217)
		at PluginClassLoader for xunit//org.jenkinsci.plugins.xunit.XUnitProcessor.processTestsReport(XUnitProcessor.java:212)
		at PluginClassLoader for xunit//org.jenkinsci.plugins.xunit.XUnitProcessor.process(XUnitProcessor.java:161)
		at PluginClassLoader for xunit//org.jenkinsci.plugins.xunit.XUnitPublisher.perform(XUnitPublisher.java:230)
		at jenkins.tasks.SimpleBuildStep.perform(SimpleBuildStep.java:123)
		at hudson.tasks.BuildStepCompatibilityLayer.perform(BuildStepCompatibilityLayer.java:80)
		at hudson.tasks.BuildStepMonitor$1.perform(BuildStepMonitor.java:20)
		at hudson.model.AbstractBuild$AbstractBuildExecution.perform(AbstractBuild.java:818)
		at hudson.model.AbstractBuild$AbstractBuildExecution.performAllBuildSteps(AbstractBuild.java:767)
		at PluginClassLoader for maven-plugin//hudson.maven.MavenModuleSetBuild$MavenModuleSetBuildExecution.post2(MavenModuleSetBuild.java:1072)
		at hudson.model.AbstractBuild$AbstractBuildExecution.post(AbstractBuild.java:711)
		at hudson.model.Run.execute(Run.java:1856)
		at PluginClassLoader for maven-plugin//hudson.maven.MavenModuleSetBuild.run(MavenModuleSetBuild.java:543)
		at hudson.model.ResourceController.execute(ResourceController.java:101)
		at hudson.model.Executor.run(Executor.java:446)
java.io.IOException: Cannot create directory '<https://ci-builds.apache.org/job/Tomee/job/master-build-full-tck/ws/generatedJUnitFiles/a2391cc3-7db7-442d-a394-59234201565b'.>
	at org.apache.commons.io.FileUtils.mkdirs(FileUtils.java:2373)
	at org.apache.commons.io.FileUtils.forceMkdir(FileUtils.java:1431)
	at PluginClassLoader for xunit//org.jenkinsci.plugins.xunit.service.XUnitTransformerCallable.invoke(XUnitTransformerCallable.java:80)
	at PluginClassLoader for xunit//org.jenkinsci.plugins.xunit.service.XUnitTransformerCallable.invoke(XUnitTransformerCallable.java:38)
	at hudson.FilePath$FileCallableWrapper.call(FilePath.java:3614)
	at hudson.remoting.UserRequest.perform(UserRequest.java:225)
	at hudson.remoting.UserRequest.perform(UserRequest.java:50)
	at hudson.remoting.Request$2.run(Request.java:391)
	at hudson.remoting.InterceptingExecutorService.lambda$wrap$0(InterceptingExecutorService.java:81)
	at java.base/java.util.concurrent.FutureTask.run(FutureTask.java:264)
	at java.base/java.util.concurrent.ThreadPoolExecutor.runWorker(ThreadPoolExecutor.java:1136)
	at java.base/java.util.concurrent.ThreadPoolExecutor$Worker.run(ThreadPoolExecutor.java:635)
	at java.base/java.lang.Thread.run(Thread.java:840)

Jenkins build is still unstable: TomEE » master-build-full-tck #505

Posted by Apache Jenkins Server <je...@builds.apache.org>.
See <https://ci-builds.apache.org/job/Tomee/job/master-build-full-tck/505/display/redirect?page=changes>


Jenkins build is still unstable: TomEE » master-build-full-tck #504

Posted by Apache Jenkins Server <je...@builds.apache.org>.
See <https://ci-builds.apache.org/job/Tomee/job/master-build-full-tck/504/display/redirect?page=changes>


Jenkins build is still unstable: TomEE » master-build-full-tck #503

Posted by Apache Jenkins Server <je...@builds.apache.org>.
See <https://ci-builds.apache.org/job/Tomee/job/master-build-full-tck/503/display/redirect?page=changes>


Jenkins build is still unstable: TomEE » master-build-full-tck #502

Posted by Apache Jenkins Server <je...@builds.apache.org>.
See <https://ci-builds.apache.org/job/Tomee/job/master-build-full-tck/502/display/redirect?page=changes>


Jenkins build is still unstable: TomEE » master-build-full-tck #501

Posted by Apache Jenkins Server <je...@builds.apache.org>.
See <https://ci-builds.apache.org/job/Tomee/job/master-build-full-tck/501/display/redirect?page=changes>


Jenkins build is still unstable: TomEE » master-build-full-tck #500

Posted by Apache Jenkins Server <je...@builds.apache.org>.
See <https://ci-builds.apache.org/job/Tomee/job/master-build-full-tck/500/display/redirect?page=changes>


Jenkins build is still unstable: TomEE » master-build-full-tck #499

Posted by Apache Jenkins Server <je...@builds.apache.org>.
See <https://ci-builds.apache.org/job/Tomee/job/master-build-full-tck/499/display/redirect?page=changes>


Jenkins build is still unstable: TomEE » master-build-full-tck #498

Posted by Apache Jenkins Server <je...@builds.apache.org>.
See <https://ci-builds.apache.org/job/Tomee/job/master-build-full-tck/498/display/redirect?page=changes>


Jenkins build is still unstable: TomEE » master-build-full-tck #497

Posted by Apache Jenkins Server <je...@builds.apache.org>.
See <https://ci-builds.apache.org/job/Tomee/job/master-build-full-tck/497/display/redirect?page=changes>


Jenkins build is still unstable: TomEE » master-build-full-tck #496

Posted by Apache Jenkins Server <je...@builds.apache.org>.
See <https://ci-builds.apache.org/job/Tomee/job/master-build-full-tck/496/display/redirect?page=changes>


Jenkins build is unstable: TomEE » master-build-full-tck #495

Posted by Apache Jenkins Server <je...@builds.apache.org>.
See <https://ci-builds.apache.org/job/Tomee/job/master-build-full-tck/495/display/redirect?page=changes>


Build failed in Jenkins: TomEE » master-build-full-tck #494

Posted by Apache Jenkins Server <je...@builds.apache.org>.
See <https://ci-builds.apache.org/job/Tomee/job/master-build-full-tck/494/display/redirect?page=changes>

Changes:

[github] Bump org.apache.tomcat:tomcat-catalina from 11.0.20 to 11.0.21 (#2611)

[github] Bump org.apache.activemq:activemq-client from 6.2.1 to 6.2.4 (#2607)

[github] Bump org.apache.activemq:activemq-broker (#2606)

[github] Bump org.apache.activemq:activemq-broker (#2605)

[github] Minor: Regenerated BOMs for 13c0e3f79cf44f628c740c54bb034d756bf10c04 (#2615)


------------------------------------------
[...truncated 13.77 MiB...]
12-Apr-2026 11:32:26.781 INFO [main] jdk.internal.reflect.DelegatingMethodAccessorImpl.invoke Initializing ProtocolHandler ["http-nio-37495"]
12-Apr-2026 11:32:27.008 INFO [main] org.apache.openejb.util.OptionsLog.info Using 'tomee.remote.support=true'
12-Apr-2026 11:32:27.021 INFO [main] org.apache.openejb.util.OptionsLog.info Using 'openejb.jdbc.datasource-creator=org.apache.tomee.jdbc.TomEEDataSourceCreator'
12-Apr-2026 11:32:27.127 INFO [main] org.apache.openejb.OpenEJB$Instance.<init> ********************************************************************************
12-Apr-2026 11:32:27.128 INFO [main] org.apache.openejb.OpenEJB$Instance.<init> OpenEJB http://tomee.apache.org/
12-Apr-2026 11:32:27.128 INFO [main] org.apache.openejb.OpenEJB$Instance.<init> Startup: Sun Apr 12 11:32:27 UTC 2026
12-Apr-2026 11:32:27.128 INFO [main] org.apache.openejb.OpenEJB$Instance.<init> Copyright 1999-2025 (C) Apache TomEE Project, All Rights Reserved.
12-Apr-2026 11:32:27.128 INFO [main] org.apache.openejb.OpenEJB$Instance.<init> Version: 11.0.0-SNAPSHOT
12-Apr-2026 11:32:27.128 INFO [main] org.apache.openejb.OpenEJB$Instance.<init> Build date: 20260412
12-Apr-2026 11:32:27.129 INFO [main] org.apache.openejb.OpenEJB$Instance.<init> Build time: 10:39
12-Apr-2026 11:32:27.129 INFO [main] org.apache.openejb.OpenEJB$Instance.<init> ********************************************************************************
12-Apr-2026 11:32:27.129 INFO [main] org.apache.openejb.OpenEJB$Instance.<init> openejb.home = <https://ci-builds.apache.org/job/Tomee/job/master-build-full-tck/ws/tck/microprofile-tck/health/target/tomee/apache-tomee-plume-11.0.0-SNAPSHOT>
12-Apr-2026 11:32:27.129 INFO [main] org.apache.openejb.OpenEJB$Instance.<init> openejb.base = <https://ci-builds.apache.org/job/Tomee/job/master-build-full-tck/ws/tck/microprofile-tck/health/target/tomee/apache-tomee-plume-11.0.0-SNAPSHOT>
12-Apr-2026 11:32:27.132 INFO [main] org.apache.openejb.cdi.CdiBuilder.initializeOWB Created new singletonService org.apache.openejb.cdi.ThreadSingletonServiceImpl@455b6df1
12-Apr-2026 11:32:27.134 INFO [main] org.apache.openejb.cdi.CdiBuilder.initializeOWB Succeeded in installing singleton service
12-Apr-2026 11:32:27.176 INFO [main] org.apache.openejb.config.ConfigurationFactory.init TomEE configuration file is '<https://ci-builds.apache.org/job/Tomee/job/master-build-full-tck/ws/tck/microprofile-tck/health/target/tomee/apache-tomee-plume-11.0.0-SNAPSHOT/conf/tomee.xml'>
12-Apr-2026 11:32:27.219 INFO [main] org.apache.openejb.config.ConfigurationFactory.configureService Configuring Service(id=Tomcat Security Service, type=SecurityService, provider-id=Tomcat Security Service)
12-Apr-2026 11:32:27.220 INFO [main] org.apache.openejb.config.ConfigurationFactory.configureService Configuring Service(id=Default Transaction Manager, type=TransactionManager, provider-id=Default Transaction Manager)
12-Apr-2026 11:32:27.222 INFO [main] org.apache.openejb.util.OptionsLog.info Using 'openejb.system.apps=true'
12-Apr-2026 11:32:27.224 INFO [main] org.apache.openejb.config.ConfigurationFactory.configureService Configuring Service(id=Default Singleton Container, type=Container, provider-id=Default Singleton Container)
12-Apr-2026 11:32:27.255 INFO [main] org.apache.openejb.assembler.classic.Assembler.createRecipe Creating TransactionManager(id=Default Transaction Manager)
12-Apr-2026 11:32:27.326 INFO [main] org.apache.openejb.assembler.classic.Assembler.createRecipe Creating SecurityService(id=Tomcat Security Service)
12-Apr-2026 11:32:27.375 INFO [main] org.apache.openejb.assembler.classic.Assembler.createRecipe Creating Container(id=Default Singleton Container)
12-Apr-2026 11:32:27.396 INFO [main] org.apache.openejb.assembler.classic.Assembler.createApplication Assembling app: openejb
12-Apr-2026 11:32:27.478 INFO [main] org.apache.openejb.util.OptionsLog.info Using 'openejb.jndiname.format={deploymentId}{interfaceType.openejbLegacyName}'
12-Apr-2026 11:32:27.490 INFO [main] org.apache.openejb.assembler.classic.JndiBuilder.bind Jndi(name=openejb/DeployerBusinessRemote) --> Ejb(deployment-id=openejb/Deployer)
12-Apr-2026 11:32:27.491 INFO [main] org.apache.openejb.assembler.classic.JndiBuilder.bind Jndi(name=global/openejb/openejb/openejb/Deployer!org.apache.openejb.assembler.Deployer) --> Ejb(deployment-id=openejb/Deployer)
12-Apr-2026 11:32:27.493 INFO [main] org.apache.openejb.assembler.classic.JndiBuilder.bind Jndi(name=global/openejb/openejb/openejb/Deployer) --> Ejb(deployment-id=openejb/Deployer)
12-Apr-2026 11:32:27.494 INFO [main] org.apache.openejb.assembler.classic.JndiBuilder.bind Jndi(name=openejb/ConfigurationInfoBusinessRemote) --> Ejb(deployment-id=openejb/ConfigurationInfo)
12-Apr-2026 11:32:27.494 INFO [main] org.apache.openejb.assembler.classic.JndiBuilder.bind Jndi(name=global/openejb/openejb/openejb/Deployer!org.apache.openejb.assembler.classic.cmd.ConfigurationInfo) --> Ejb(deployment-id=openejb/ConfigurationInfo)
12-Apr-2026 11:32:27.506 INFO [main] org.apache.openejb.assembler.classic.Assembler.startEjbs Created Ejb(deployment-id=openejb/ConfigurationInfo, ejb-name=openejb/Deployer, container=Default Singleton Container)
12-Apr-2026 11:32:27.510 INFO [main] org.apache.openejb.assembler.classic.Assembler.startEjbs Created Ejb(deployment-id=openejb/Deployer, ejb-name=openejb/Deployer, container=Default Singleton Container)
12-Apr-2026 11:32:27.510 INFO [main] org.apache.openejb.assembler.classic.Assembler.startEjbs Started Ejb(deployment-id=openejb/ConfigurationInfo, ejb-name=openejb/Deployer, container=Default Singleton Container)
12-Apr-2026 11:32:27.510 INFO [main] org.apache.openejb.assembler.classic.Assembler.startEjbs Started Ejb(deployment-id=openejb/Deployer, ejb-name=openejb/Deployer, container=Default Singleton Container)
12-Apr-2026 11:32:27.517 INFO [main] org.apache.openejb.assembler.classic.Assembler.deployMBean Deployed MBean(openejb.user.mbeans:application=openejb,group=org.apache.openejb.assembler.monitoring,name=JMXDeployer)
12-Apr-2026 11:32:27.519 WARNING [main] org.apache.batchee.container.services.ServicesManager.init You didn't specify org.apache.batchee.jmx.application and JMX is already registered, skipping
12-Apr-2026 11:32:27.520 INFO [main] org.apache.openejb.assembler.classic.Assembler.createApplication Deployed Application(path=openejb)
12-Apr-2026 11:32:27.567 INFO [main] org.apache.openejb.server.ServiceManager.initServer Creating ServerService(id=cxf)
12-Apr-2026 11:32:27.821 INFO [main] org.apache.openejb.server.ServiceManager.initServer Creating ServerService(id=cxf-rs)
12-Apr-2026 11:32:27.917 INFO [main] org.apache.openejb.util.OptionsLog.info Using 'tomee.mp.scan=all'
12-Apr-2026 11:32:27.945 INFO [main] org.apache.openejb.server.SimpleServiceManager.start   ** Bound Services **
12-Apr-2026 11:32:27.946 INFO [main] org.apache.openejb.server.SimpleServiceManager.printRow   NAME                 IP              PORT  
12-Apr-2026 11:32:27.947 INFO [main] org.apache.openejb.server.SimpleServiceManager.start -------
12-Apr-2026 11:32:27.947 INFO [main] org.apache.openejb.server.SimpleServiceManager.start Ready!
12-Apr-2026 11:32:27.947 INFO [main] jdk.internal.reflect.DelegatingMethodAccessorImpl.invoke Server initialization in [1773] milliseconds
12-Apr-2026 11:32:28.015 INFO [main] org.apache.tomee.catalina.OpenEJBNamingContextListener.bindResource Importing a Tomcat Resource with id 'UserDatabase' of type 'org.apache.catalina.UserDatabase'.
12-Apr-2026 11:32:28.028 INFO [main] org.apache.openejb.assembler.classic.Assembler.createRecipe Creating Resource(id=UserDatabase)
12-Apr-2026 11:32:28.067 INFO [main] jdk.internal.reflect.DelegatingMethodAccessorImpl.invoke Starting service [Catalina]
12-Apr-2026 11:32:28.068 INFO [main] jdk.internal.reflect.DelegatingMethodAccessorImpl.invoke Starting Servlet engine: [Apache Tomcat (TomEE)/11.0.21 (11.0.0-SNAPSHOT)]
12-Apr-2026 11:32:28.202 INFO [main] jdk.internal.reflect.DelegatingMethodAccessorImpl.invoke Starting ProtocolHandler ["http-nio-37495"]
12-Apr-2026 11:32:28.219 INFO [main] jdk.internal.reflect.DelegatingMethodAccessorImpl.invoke Server startup in [270] milliseconds
Apr 12, 2026 11:32:29 AM org.apache.openejb.client.EventLogger log
INFO: RemoteInitialContextCreated{providerUri=http://localhost:37495/tomee/ejb}
12-Apr-2026 11:32:29.344 INFO [http-nio-37495-exec-3] org.apache.openejb.util.JarExtractor.extract Extracting jar: <https://ci-builds.apache.org/job/Tomee/job/master-build-full-tck/ws/tck/microprofile-tck/health/target/workdir/0/EnforceQualifierTest.war>
12-Apr-2026 11:32:29.378 INFO [http-nio-37495-exec-3] org.apache.openejb.util.JarExtractor.extract Extracted path: <https://ci-builds.apache.org/job/Tomee/job/master-build-full-tck/ws/tck/microprofile-tck/health/target/workdir/0/EnforceQualifierTest>
12-Apr-2026 11:32:29.378 INFO [http-nio-37495-exec-3] org.apache.tomee.catalina.TomcatWebAppBuilder.deployWebApps using default host: localhost
12-Apr-2026 11:32:29.379 INFO [http-nio-37495-exec-3] org.apache.tomee.catalina.TomcatWebAppBuilder.init ------------------------- localhost -> /EnforceQualifierTest
12-Apr-2026 11:32:29.380 INFO [http-nio-37495-exec-3] org.apache.openejb.util.OptionsLog.info Using 'openejb.session.manager=org.apache.tomee.catalina.session.QuickSessionManager'
12-Apr-2026 11:32:29.459 INFO [http-nio-37495-exec-3] org.apache.openejb.util.OptionsLog.info Using 'tomee.mp.cdi.extensions=io.smallrye.config.inject.ConfigExtension,io.smallrye.faulttolerance.FaultToleranceExtension,io.smallrye.opentelemetry.implementation.cdi.OpenTelemetryExtension,org.apache.cxf.microprofile.client.cdi.RestClientExtension,org.apache.tomee.microprofile.faulttolerance.MPFaultToleranceCDIExtension,org.apache.tomee.microprofile.health.MPHealthCDIExtension,org.apache.tomee.microprofile.jwt.cdi.MPJWTCDIExtension,org.apache.tomee.microprofile.opentelemetry.MPOpenTelemetryCDIExtension'
12-Apr-2026 11:32:29.459 INFO [http-nio-37495-exec-3] org.apache.openejb.util.OptionsLog.info Using 'tomee.mp.scan=all'
12-Apr-2026 11:32:29.647 INFO [http-nio-37495-exec-3] org.apache.openejb.config.ConfigurationFactory.configureApplication Configuring enterprise application: <https://ci-builds.apache.org/job/Tomee/job/master-build-full-tck/ws/tck/microprofile-tck/health/target/workdir/0/EnforceQualifierTest>
12-Apr-2026 11:32:30.583 INFO [http-nio-37495-exec-3] org.apache.openejb.config.ConfigurationFactory.configureService Configuring Service(id=Default Managed Container, type=Container, provider-id=Default Managed Container)
12-Apr-2026 11:32:30.584 INFO [http-nio-37495-exec-3] org.apache.openejb.config.AutoConfig.createContainer Auto-creating a container for bean EnforceQualifierTest.Comp934326168: Container(type=MANAGED, id=Default Managed Container)
12-Apr-2026 11:32:30.584 INFO [http-nio-37495-exec-3] org.apache.openejb.assembler.classic.Assembler.createRecipe Creating Container(id=Default Managed Container)
12-Apr-2026 11:32:30.591 INFO [http-nio-37495-exec-3] org.apache.openejb.core.managed.SimplePassivater.init Using directory <https://ci-builds.apache.org/job/Tomee/job/master-build-full-tck/ws/tck/microprofile-tck/health/target/tomee/apache-tomee-plume-11.0.0-SNAPSHOT/temp> for stateful session passivation
12-Apr-2026 11:32:30.615 INFO [http-nio-37495-exec-3] org.apache.openejb.config.AppInfoBuilder.build Enterprise application "<https://ci-builds.apache.org/job/Tomee/job/master-build-full-tck/ws/tck/microprofile-tck/health/target/workdir/0/EnforceQualifierTest"> loaded.
12-Apr-2026 11:32:30.616 INFO [http-nio-37495-exec-3] org.apache.openejb.assembler.classic.Assembler.createApplication Assembling app: <https://ci-builds.apache.org/job/Tomee/job/master-build-full-tck/ws/tck/microprofile-tck/health/target/workdir/0/EnforceQualifierTest>
12-Apr-2026 11:32:30.656 INFO [http-nio-37495-exec-3] org.apache.openejb.cdi.CdiBuilder.initSingleton Existing thread singleton service in SystemInstance(): org.apache.openejb.cdi.ThreadSingletonServiceImpl@455b6df1
12-Apr-2026 11:32:30.758 INFO [http-nio-37495-exec-3] org.apache.openejb.cdi.OpenEJBLifecycle.startApplication OpenWebBeans Container is starting...
12-Apr-2026 11:32:30.763 INFO [http-nio-37495-exec-3] org.apache.webbeans.plugins.PluginLoader.startUp Adding OpenWebBeansPlugin : [CdiPlugin]
12-Apr-2026 11:32:30.771 WARNING [http-nio-37495-exec-3] org.apache.openejb.cdi.CdiScanner.load Can not load dependencies of org.eclipse.microprofile.health.tck.EnforceQualifierTest: class org/eclipse/microprofile/health/tck/TCKBase can not be found
12-Apr-2026 11:32:30.958 INFO [http-nio-37495-exec-3] org.apache.openejb.util.OptionsLog.info Using 'tomee.mp.scan=all'
12-Apr-2026 11:32:30.959 INFO [http-nio-37495-exec-3] org.apache.openejb.util.OptionsLog.info Using 'tomee.mp.scan=all'
12-Apr-2026 11:32:30.959 INFO [http-nio-37495-exec-3] org.apache.openejb.util.OptionsLog.info Using 'tomee.mp.scan=all'
12-Apr-2026 11:32:30.959 INFO [http-nio-37495-exec-3] org.apache.openejb.util.OptionsLog.info Using 'tomee.mp.scan=all'
12-Apr-2026 11:32:30.959 INFO [http-nio-37495-exec-3] org.apache.openejb.util.OptionsLog.info Using 'tomee.mp.scan=all'
12-Apr-2026 11:32:30.959 INFO [http-nio-37495-exec-3] org.apache.openejb.util.OptionsLog.info Using 'tomee.mp.scan=all'
12-Apr-2026 11:32:30.960 INFO [http-nio-37495-exec-3] org.apache.openejb.util.OptionsLog.info Using 'tomee.mp.scan=all'
12-Apr-2026 11:32:30.960 INFO [http-nio-37495-exec-3] org.apache.openejb.util.OptionsLog.info Using 'tomee.mp.scan=all'
12-Apr-2026 11:32:30.960 INFO [http-nio-37495-exec-3] org.apache.openejb.util.OptionsLog.info Using 'tomee.mp.scan=all'
12-Apr-2026 11:32:30.960 INFO [http-nio-37495-exec-3] org.apache.openejb.util.OptionsLog.info Using 'tomee.mp.scan=all'
12-Apr-2026 11:32:30.960 INFO [http-nio-37495-exec-3] org.apache.openejb.util.OptionsLog.info Using 'tomee.mp.scan=all'
12-Apr-2026 11:32:30.960 INFO [http-nio-37495-exec-3] org.apache.openejb.util.OptionsLog.info Using 'tomee.mp.scan=all'
12-Apr-2026 11:32:30.961 INFO [http-nio-37495-exec-3] org.apache.openejb.util.OptionsLog.info Using 'tomee.mp.scan=all'
12-Apr-2026 11:32:30.961 INFO [http-nio-37495-exec-3] org.apache.openejb.util.OptionsLog.info Using 'tomee.mp.scan=all'
12-Apr-2026 11:32:30.961 INFO [http-nio-37495-exec-3] org.apache.openejb.util.OptionsLog.info Using 'tomee.mp.scan=all'
12-Apr-2026 11:32:30.961 INFO [http-nio-37495-exec-3] org.apache.openejb.util.OptionsLog.info Using 'tomee.mp.scan=all'
12-Apr-2026 11:32:30.961 INFO [http-nio-37495-exec-3] org.apache.openejb.util.OptionsLog.info Using 'tomee.mp.scan=all'
12-Apr-2026 11:32:30.961 INFO [http-nio-37495-exec-3] org.apache.openejb.util.OptionsLog.info Using 'tomee.mp.scan=all'
12-Apr-2026 11:32:30.961 INFO [http-nio-37495-exec-3] org.apache.openejb.util.OptionsLog.info Using 'tomee.mp.scan=all'
12-Apr-2026 11:32:31.065 INFO [http-nio-37495-exec-3] org.apache.openejb.util.OptionsLog.info Using 'tomee.mp.scan=all'
12-Apr-2026 11:32:31.128 INFO [http-nio-37495-exec-3] io.smallrye.faulttolerance.FaultToleranceExtension.registerInterceptorBindings SRFTL00001: MicroProfile: Fault Tolerance activated (SmallRye Fault Tolerance version: 6.11.0)
12-Apr-2026 11:32:31.147 INFO [http-nio-37495-exec-3] org.apache.openejb.util.OptionsLog.info Using 'tomee.mp.scan=all'
12-Apr-2026 11:32:31.463 WARNING [http-nio-37495-exec-3] org.apache.webbeans.portable.events.discovery.AfterBeanDiscoveryImpl.addBean [io.smallrye.opentelemetry.implementation.cdi.WithSpanInterceptorBean] has a name. If an interceptor or decorator has name, non-portable behaviour results.
12-Apr-2026 11:32:31.677 INFO [http-nio-37495-exec-3] org.apache.webbeans.config.BeansDeployer.validateInjectionPoints All injection points were validated successfully.
12-Apr-2026 11:32:31.679 INFO [http-nio-37495-exec-3] org.apache.openejb.util.OptionsLog.info Using 'tomee.mp.scan=all'
12-Apr-2026 11:32:31.726 INFO [http-nio-37495-exec-3] org.apache.openejb.cdi.OpenEJBLifecycle.startApplication OpenWebBeans Container has started, it took 968 ms.
12-Apr-2026 11:32:31.731 INFO [http-nio-37495-exec-3] org.apache.openejb.assembler.classic.ValidatorBuilder.getConfig Ignoring XML Configuration for validator org.apache.bval.jsr.ConfigurationImpl
12-Apr-2026 11:32:31.761 WARNING [http-nio-37495-exec-3] org.apache.batchee.container.services.ServicesManager.init You didn't specify org.apache.batchee.jmx.application and JMX is already registered, skipping
12-Apr-2026 11:32:31.762 INFO [http-nio-37495-exec-3] org.apache.openejb.assembler.classic.Assembler.createApplication Deployed Application(path=<https://ci-builds.apache.org/job/Tomee/job/master-build-full-tck/ws/tck/microprofile-tck/health/target/workdir/0/EnforceQualifierTest)>
12-Apr-2026 11:32:31.953 INFO [http-nio-37495-exec-3] org.apache.openejb.util.OptionsLog.info Using 'tomee.mp.scan=all'
12-Apr-2026 11:32:31.956 INFO [http-nio-37495-exec-3] org.apache.tomee.microprofile.openapi.MicroProfileOpenApiRegistration.onStartup Registering OpenAPI servlet on /openapi for application /EnforceQualifierTest
12-Apr-2026 11:32:31.996 INFO [http-nio-37495-exec-3] org.apache.jasper.servlet.TldScanner.scanJars At least one JAR was scanned for TLDs yet contained no TLDs. Enable debug logging for this logger for a complete list of JARs that were scanned but no TLDs were found in them. Skipping unneeded JARs during scanning can improve startup time and JSP compilation time.
12-Apr-2026 11:32:32.018 INFO [http-nio-37495-exec-3] org.apache.openejb.util.OptionsLog.info Using 'tomee.mp.scan=all'
12-Apr-2026 11:32:32.490 INFO [http-nio-37495-exec-3] org.apache.openejb.server.cxf.rs.CxfRsHttpListener.logApplication Application{path='http://localhost:37495/EnforceQualifierTest/', class=org.apache.openejb.server.rest.InternalApplication, resources=1, providers=5, invalids=0}
12-Apr-2026 11:32:32.491 INFO [http-nio-37495-exec-3] org.apache.openejb.server.cxf.rs.CxfRsHttpListener.logApplication Resource{clazz=org.apache.tomee.microprofile.health.MicroProfileHealthChecksEndpoint, discovered=false, singleton=false}
12-Apr-2026 11:32:32.492 INFO [http-nio-37495-exec-3] org.apache.openejb.server.cxf.rs.CxfRsHttpListener.logApplication Provider{clazz=org.apache.tomee.microprofile.jwt.jaxrs.MPJWTSecurityAnnotationsInterceptorsFeature, discovered=true, singleton=false}
12-Apr-2026 11:32:32.492 INFO [http-nio-37495-exec-3] org.apache.openejb.server.cxf.rs.CxfRsHttpListener.logApplication Provider{clazz=org.apache.tomee.microprofile.jwt.bval.ValidationInterceptorsFeature, discovered=true, singleton=false}
12-Apr-2026 11:32:32.492 INFO [http-nio-37495-exec-3] org.apache.openejb.server.cxf.rs.CxfRsHttpListener.logApplication Provider{clazz=io.smallrye.opentelemetry.implementation.rest.OpenTelemetryClientFilter, discovered=true, singleton=false}
12-Apr-2026 11:32:32.492 INFO [http-nio-37495-exec-3] org.apache.openejb.server.cxf.rs.CxfRsHttpListener.logApplication Provider{clazz=org.apache.tomee.microprofile.opentelemetry.MPOpenTelemetryFilterRegistration, discovered=true, singleton=false}
12-Apr-2026 11:32:32.492 INFO [http-nio-37495-exec-3] org.apache.openejb.server.cxf.rs.CxfRsHttpListener.logApplication Provider{clazz=org.apache.tomee.microprofile.jwt.MPJWTFilter$MPJWTExceptionMapper, discovered=true, singleton=false}
12-Apr-2026 11:32:32.705 INFO [http-nio-37495-exec-3] org.apache.openejb.util.OptionsLog.info Using 'tomee.mp.scan=all'
12-Apr-2026 11:32:32.879 INFO [http-nio-37495-exec-3] org.apache.openejb.util.OptionsLog.info Using 'tomee.mp.scan=all'
12-Apr-2026 11:32:32.893 INFO [http-nio-37495-exec-3] org.apache.openejb.util.OptionsLog.info Using 'tomee.mp.scan=all'
12-Apr-2026 11:32:32.909 INFO [http-nio-37495-exec-3] org.apache.openejb.util.OptionsLog.info Using 'tomee.mp.scan=all'
12-Apr-2026 11:32:32.918 INFO [http-nio-37495-exec-3] org.apache.openejb.server.cxf.rs.CxfRsHttpListener.deployApplication Using readers:
12-Apr-2026 11:32:32.918 INFO [http-nio-37495-exec-3] org.apache.openejb.server.cxf.rs.CxfRsHttpListener.deployApplication      org.apache.cxf.jaxrs.provider.EntityPartProvider@228b5927
12-Apr-2026 11:32:32.918 INFO [http-nio-37495-exec-3] org.apache.openejb.server.cxf.rs.CxfRsHttpListener.deployApplication      org.apache.cxf.jaxrs.provider.PrimitiveTextProvider@57185fd7
12-Apr-2026 11:32:32.918 INFO [http-nio-37495-exec-3] org.apache.openejb.server.cxf.rs.CxfRsHttpListener.deployApplication      org.apache.cxf.jaxrs.provider.FormEncodingProvider@650e0cf8
12-Apr-2026 11:32:32.919 INFO [http-nio-37495-exec-3] org.apache.openejb.server.cxf.rs.CxfRsHttpListener.deployApplication      org.apache.cxf.jaxrs.provider.MultipartProvider@50738fb7
12-Apr-2026 11:32:32.919 INFO [http-nio-37495-exec-3] org.apache.openejb.server.cxf.rs.CxfRsHttpListener.deployApplication      org.apache.cxf.jaxrs.provider.SourceProvider@56fef936
12-Apr-2026 11:32:32.919 INFO [http-nio-37495-exec-3] org.apache.openejb.server.cxf.rs.CxfRsHttpListener.deployApplication      org.apache.cxf.jaxrs.provider.JAXBElementTypedProvider@2ec4c0af
12-Apr-2026 11:32:32.919 INFO [http-nio-37495-exec-3] org.apache.openejb.server.cxf.rs.CxfRsHttpListener.deployApplication      org.apache.cxf.jaxrs.provider.JAXBElementProvider@3b387043
12-Apr-2026 11:32:32.919 INFO [http-nio-37495-exec-3] org.apache.openejb.server.cxf.rs.CxfRsHttpListener.deployApplication      org.apache.openejb.server.cxf.rs.johnzon.TomEEJsonbProvider@23cae039
12-Apr-2026 11:32:32.919 INFO [http-nio-37495-exec-3] org.apache.openejb.server.cxf.rs.CxfRsHttpListener.deployApplication      org.apache.openejb.server.cxf.rs.johnzon.TomEEJsonpProvider@79302a63
12-Apr-2026 11:32:32.919 INFO [http-nio-37495-exec-3] org.apache.openejb.server.cxf.rs.CxfRsHttpListener.deployApplication      org.apache.cxf.jaxrs.provider.StringTextProvider@777a27c7
12-Apr-2026 11:32:32.919 INFO [http-nio-37495-exec-3] org.apache.openejb.server.cxf.rs.CxfRsHttpListener.deployApplication      org.apache.cxf.jaxrs.provider.BinaryDataProvider@7dc59d6b
12-Apr-2026 11:32:32.920 INFO [http-nio-37495-exec-3] org.apache.openejb.server.cxf.rs.CxfRsHttpListener.deployApplication      org.apache.cxf.jaxrs.provider.DataSourceProvider@683693e3
12-Apr-2026 11:32:32.920 INFO [http-nio-37495-exec-3] org.apache.openejb.server.cxf.rs.CxfRsHttpListener.deployApplication Using writers:
12-Apr-2026 11:32:32.920 INFO [http-nio-37495-exec-3] org.apache.openejb.server.cxf.rs.CxfRsHttpListener.deployApplication      org.apache.cxf.jaxrs.provider.EntityPartProvider@228b5927
12-Apr-2026 11:32:32.920 INFO [http-nio-37495-exec-3] org.apache.openejb.server.cxf.rs.CxfRsHttpListener.deployApplication      org.apache.cxf.jaxrs.provider.JAXBElementTypedProvider@2ec4c0af
12-Apr-2026 11:32:32.920 INFO [http-nio-37495-exec-3] org.apache.openejb.server.cxf.rs.CxfRsHttpListener.deployApplication      org.apache.johnzon.jaxrs.WadlDocumentMessageBodyWriter@102dcfb4
12-Apr-2026 11:32:32.920 INFO [http-nio-37495-exec-3] org.apache.openejb.server.cxf.rs.CxfRsHttpListener.deployApplication      org.apache.cxf.jaxrs.provider.StringTextProvider@777a27c7
12-Apr-2026 11:32:32.920 INFO [http-nio-37495-exec-3] org.apache.openejb.server.cxf.rs.CxfRsHttpListener.deployApplication      org.apache.cxf.jaxrs.nio.NioMessageBodyWriter@364f9669
12-Apr-2026 11:32:32.920 INFO [http-nio-37495-exec-3] org.apache.openejb.server.cxf.rs.CxfRsHttpListener.deployApplication      org.apache.cxf.jaxrs.provider.PrimitiveTextProvider@57185fd7
12-Apr-2026 11:32:32.921 INFO [http-nio-37495-exec-3] org.apache.openejb.server.cxf.rs.CxfRsHttpListener.deployApplication      org.apache.cxf.jaxrs.provider.FormEncodingProvider@650e0cf8
12-Apr-2026 11:32:32.921 INFO [http-nio-37495-exec-3] org.apache.openejb.server.cxf.rs.CxfRsHttpListener.deployApplication      org.apache.cxf.jaxrs.provider.MultipartProvider@50738fb7
12-Apr-2026 11:32:32.921 INFO [http-nio-37495-exec-3] org.apache.openejb.server.cxf.rs.CxfRsHttpListener.deployApplication      org.apache.cxf.jaxrs.provider.SourceProvider@56fef936
12-Apr-2026 11:32:32.921 INFO [http-nio-37495-exec-3] org.apache.openejb.server.cxf.rs.CxfRsHttpListener.deployApplication      org.apache.cxf.jaxrs.provider.JAXBElementProvider@3b387043
12-Apr-2026 11:32:32.921 INFO [http-nio-37495-exec-3] org.apache.openejb.server.cxf.rs.CxfRsHttpListener.deployApplication      org.apache.openejb.server.cxf.rs.johnzon.TomEEJsonbProvider@23cae039
12-Apr-2026 11:32:32.921 INFO [http-nio-37495-exec-3] org.apache.openejb.server.cxf.rs.CxfRsHttpListener.deployApplication      org.apache.openejb.server.cxf.rs.johnzon.TomEEJsonpProvider@79302a63
12-Apr-2026 11:32:32.921 INFO [http-nio-37495-exec-3] org.apache.openejb.server.cxf.rs.CxfRsHttpListener.deployApplication      org.apache.cxf.jaxrs.provider.BinaryDataProvider@7dc59d6b
12-Apr-2026 11:32:32.921 INFO [http-nio-37495-exec-3] org.apache.openejb.server.cxf.rs.CxfRsHttpListener.deployApplication      org.apache.cxf.jaxrs.provider.DataSourceProvider@683693e3
12-Apr-2026 11:32:32.922 INFO [http-nio-37495-exec-3] org.apache.openejb.server.cxf.rs.CxfRsHttpListener.deployApplication Using exception mappers:
12-Apr-2026 11:32:32.922 INFO [http-nio-37495-exec-3] org.apache.openejb.server.cxf.rs.CxfRsHttpListener.deployApplication      org.apache.cxf.jaxrs.impl.WebApplicationExceptionMapper@48f8c997
12-Apr-2026 11:32:32.922 INFO [http-nio-37495-exec-3] org.apache.openejb.server.cxf.rs.CxfRsHttpListener.deployApplication      org.apache.tomee.microprofile.jwt.MPJWTFilter$MPJWTExceptionMapper@3f419873
12-Apr-2026 11:32:32.922 INFO [http-nio-37495-exec-3] org.apache.openejb.server.cxf.rs.CxfRsHttpListener.deployApplication      org.apache.openejb.server.cxf.rs.EJBExceptionMapper@1e3372b0
12-Apr-2026 11:32:32.922 INFO [http-nio-37495-exec-3] org.apache.openejb.server.cxf.rs.CxfRsHttpListener.deployApplication      org.apache.cxf.jaxrs.validation.ValidationExceptionMapper@f994f01
12-Apr-2026 11:32:32.924 INFO [http-nio-37495-exec-3] org.apache.openejb.server.cxf.rs.CxfRsHttpListener.logEndpoints REST Application: http://localhost:37495/EnforceQualifierTest/               -> org.apache.openejb.server.rest.InternalApplication@139d959
12-Apr-2026 11:32:32.928 INFO [http-nio-37495-exec-3] org.apache.openejb.server.cxf.rs.CxfRsHttpListener.logEndpoints      Service URI: http://localhost:37495/EnforceQualifierTest/health         -> Pojo org.apache.tomee.microprofile.health.MicroProfileHealthChecksEndpoint
12-Apr-2026 11:32:32.928 INFO [http-nio-37495-exec-3] org.apache.openejb.server.cxf.rs.CxfRsHttpListener.logEndpoints               GET http://localhost:37495/EnforceQualifierTest/health         ->      Response getChecks()       
12-Apr-2026 11:32:32.929 INFO [http-nio-37495-exec-3] org.apache.openejb.server.cxf.rs.CxfRsHttpListener.logEndpoints               GET http://localhost:37495/EnforceQualifierTest/health/live    ->      Response getLiveChecks()   
12-Apr-2026 11:32:32.929 INFO [http-nio-37495-exec-3] org.apache.openejb.server.cxf.rs.CxfRsHttpListener.logEndpoints               GET http://localhost:37495/EnforceQualifierTest/health/ready   ->      Response getReadyChecks()  
12-Apr-2026 11:32:32.929 INFO [http-nio-37495-exec-3] org.apache.openejb.server.cxf.rs.CxfRsHttpListener.logEndpoints               GET http://localhost:37495/EnforceQualifierTest/health/started ->      Response getStartedChecks()
Apr 12, 2026 11:32:33 AM org.eclipse.microprofile.health.tck.TCKBase beforeMethod
INFO: Running test: EnforceQualifierTest#testFailureResponsePayload
{"status":"UP","checks":[]}
12-Apr-2026 11:32:33.666 INFO [http-nio-37495-exec-6] org.apache.openejb.assembler.classic.Assembler.destroyApplication Undeploying app: <https://ci-builds.apache.org/job/Tomee/job/master-build-full-tck/ws/tck/microprofile-tck/health/target/workdir/0/EnforceQualifierTest>
Apr 12, 2026 11:32:33 AM org.apache.openejb.client.EventLogger log
INFO: RemoteInitialContextCreated{providerUri=http://localhost:37495/tomee/ejb}
12-Apr-2026 11:32:33.850 INFO [main] jdk.internal.reflect.DelegatingMethodAccessorImpl.invoke A valid shutdown command was received via the shutdown port. Stopping the Server instance.
12-Apr-2026 11:32:33.851 INFO [main] jdk.internal.reflect.DelegatingMethodAccessorImpl.invoke Pausing ProtocolHandler ["http-nio-37495"]
12-Apr-2026 11:32:33.856 INFO [main] jdk.internal.reflect.DelegatingMethodAccessorImpl.invoke Stopping service [Catalina]
12-Apr-2026 11:32:33.858 INFO [main] jdk.internal.reflect.DelegatingMethodAccessorImpl.invoke Stopping ProtocolHandler ["http-nio-37495"]
12-Apr-2026 11:32:33.863 INFO [main] org.apache.openejb.server.SimpleServiceManager.stop Stopping server services
12-Apr-2026 11:32:33.870 INFO [main] org.apache.openejb.assembler.classic.Assembler.destroyApplication Undeploying app: openejb
Apr 12, 2026 11:32:33 AM org.apache.openejb.arquillian.common.TomEEContainer undeploy
INFO: cleaning <https://ci-builds.apache.org/job/Tomee/job/master-build-full-tck/ws/tck/microprofile-tck/health/target/workdir/0/EnforceQualifierTest.war>
Apr 12, 2026 11:32:33 AM org.apache.openejb.arquillian.common.TomEEContainer undeploy
INFO: cleaning <https://ci-builds.apache.org/job/Tomee/job/master-build-full-tck/ws/tck/microprofile-tck/health/target/workdir/0/EnforceQualifierTest>
12-Apr-2026 11:32:33.871 SEVERE [main] org.apache.openejb.core.singleton.SingletonInstanceManager.undeploy Unable to unregister MBean openejb.management:J2EEServer=openejb,J2EEApplication=<empty>,EJBModule=openejb,SingletonSessionBean=openejb/Deployer,name=openejb/Deployer,j2eeType=Invocations
12-Apr-2026 11:32:33.895 INFO [main] jdk.internal.reflect.DelegatingMethodAccessorImpl.invoke Destroying ProtocolHandler ["http-nio-37495"]
[INFO] Tests run: 1, Failures: 0, Errors: 0, Skipped: 0, Time elapsed: 10.35 s -- in org.eclipse.microprofile.health.tck.EnforceQualifierTest
[INFO] 
[INFO] Results:
[INFO] 
[INFO] Tests run: 28, Failures: 0, Errors: 0, Skipped: 0
[INFO] 
[JENKINS] Recording test results
[INFO] 
[INFO] --- jar:3.0.2:jar (default-jar) @ microprofile-health-tck ---
[INFO] Building jar: <https://ci-builds.apache.org/job/Tomee/job/master-build-full-tck/ws/tck/microprofile-tck/health/target/microprofile-health-tck-11.0.0-SNAPSHOT.jar>
[INFO] 
[INFO] --- install:3.0.0-M1:install (default-install) @ microprofile-health-tck ---
[INFO] Installing <https://ci-builds.apache.org/job/Tomee/job/master-build-full-tck/ws/tck/microprofile-tck/health/target/microprofile-health-tck-11.0.0-SNAPSHOT.jar> to /home/jenkins/.m2/repository/org/apache/tomee/microprofile-health-tck/11.0.0-SNAPSHOT/microprofile-health-tck-11.0.0-SNAPSHOT.jar
[INFO] Installing <https://ci-builds.apache.org/job/Tomee/job/master-build-full-tck/ws/tck/microprofile-tck/health/pom.xml> to /home/jenkins/.m2/repository/org/apache/tomee/microprofile-health-tck/11.0.0-SNAPSHOT/microprofile-health-tck-11.0.0-SNAPSHOT.pom
[INFO] 
[INFO] -----------< org.apache.tomee:microprofile-rest-client-tck >------------
[INFO] Building TomEE :: TCK :: MicroProfile Rest Client TCK 11.0.0-SNAPSHOT [19/31]
[INFO]   from microprofile-tck/rest-client/pom.xml
[INFO] --------------------------------[ jar ]---------------------------------
[INFO] Downloading from Apache Snapshots: https://repository.apache.org/content/repositories/snapshots/org/apache/cxf/cxf-rt-rs-mp-client/4.2.1-SNAPSHOT/maven-metadata.xml
[INFO] Downloading from apache-snapshots: https://repository.apache.org/content/groups/snapshots/org/apache/cxf/cxf-rt-rs-mp-client/4.2.1-SNAPSHOT/maven-metadata.xml
[INFO] Downloading from B_shibboleth: https://build.shibboleth.net/maven/releases/org/apache/cxf/cxf-rt-rs-mp-client/4.2.1-SNAPSHOT/maven-metadata.xml
[INFO] Downloaded from Apache Snapshots: https://repository.apache.org/content/repositories/snapshots/org/apache/cxf/cxf-rt-rs-mp-client/4.2.1-SNAPSHOT/maven-metadata.xml (1.7 kB at 3.1 kB/s)
[INFO] Downloaded from apache-snapshots: https://repository.apache.org/content/groups/snapshots/org/apache/cxf/cxf-rt-rs-mp-client/4.2.1-SNAPSHOT/maven-metadata.xml (1.7 kB at 2.3 kB/s)
[INFO] Downloading from Nexus: https://repository.apache.org/snapshots/org/apache/cxf/cxf-rt-rs-client/4.2.1-SNAPSHOT/maven-metadata.xml
[INFO] Downloaded from Nexus: https://repository.apache.org/snapshots/org/apache/cxf/cxf-rt-rs-client/4.2.1-SNAPSHOT/maven-metadata.xml (1.6 kB at 4.6 kB/s)
[INFO] Downloading from Nexus: https://repository.apache.org/snapshots/org/apache/cxf/cxf-rt-rs-extension-providers/4.2.1-SNAPSHOT/maven-metadata.xml
[INFO] Downloaded from Nexus: https://repository.apache.org/snapshots/org/apache/cxf/cxf-rt-rs-extension-providers/4.2.1-SNAPSHOT/maven-metadata.xml (1.7 kB at 4.6 kB/s)
[INFO] 
[INFO] --- clean:3.5.0:clean (default-clean) @ microprofile-rest-client-tck ---
[INFO] Deleting <https://ci-builds.apache.org/job/Tomee/job/master-build-full-tck/ws/tck/microprofile-tck/rest-client/target>
[INFO] 
[INFO] --- enforcer:3.6.2:enforce (enforce-maven-version) @ microprofile-rest-client-tck ---
[INFO] 
[INFO] --- enforcer:3.6.2:enforce (enforce-java-version) @ microprofile-rest-client-tck ---
[INFO] 
[INFO] --- remote-resources:3.3.0:process (process-resource-bundles) @ microprofile-rest-client-tck ---
[INFO] Preparing remote bundle org.apache.apache.resources:apache-jar-resource-bundle:1.7
[INFO] Copying 3 resources from 1 bundle.
[INFO] 
[INFO] --- resources:3.4.0:resources (default-resources) @ microprofile-rest-client-tck ---
[INFO] skip non existing resourceDirectory <https://ci-builds.apache.org/job/Tomee/job/master-build-full-tck/ws/tck/microprofile-tck/rest-client/src/main/resources>
[INFO] Copying 3 resources from target/maven-shared-archive-resources to target/classes
[INFO] 
[INFO] --- compiler:3.15.0:compile (default-compile) @ microprofile-rest-client-tck ---
[INFO] No sources to compile
[INFO] 
[INFO] --- dependency-report:1.0.2:report (default) @ microprofile-rest-client-tck ---
[INFO] No dependencies to report
[INFO] 
[INFO] --- bundle:6.0.2:manifest (bundle-manifest) @ microprofile-rest-client-tck ---
[INFO] No MANIFEST.MF file found, generating manifest.
[WARNING] Manifest org.apache.tomee:microprofile-rest-client-tck:jar:11.0.0-SNAPSHOT : Unused Export-Package instructions: [org.apache.tomee*] 
[INFO] Writing manifest: <https://ci-builds.apache.org/job/Tomee/job/master-build-full-tck/ws/tck/microprofile-tck/rest-client/target/classes/META-INF/MANIFEST.MF>
[INFO] 
[INFO] --- wiremock:7.3.0:run (start-wiremock) @ microprofile-rest-client-tck ---
[INFO] Starting WireMock with following params: --root-dir=<https://ci-builds.apache.org/job/Tomee/job/master-build-full-tck/ws/tck/microprofile-tck/rest-client/target/classes> --port=8765 --disable-banner=true
com.github.tomakehurst.wiremock.common.FatalStartupException: java.io.IOException: Failed to bind to /0.0.0.0:8765
No mail will be sent out, as 'TomEE » master-build-full-tck » TomEE :: TCK :: JAX-RS TCK :: Tests Embedded #494' does not have a result yet. Please make sure you set a proper result in case of pipeline/build scripts.
No mail will be sent out, as 'TomEE » master-build-full-tck » TomEE :: TCK :: JAX-RS TCK :: Tests #494' does not have a result yet. Please make sure you set a proper result in case of pipeline/build scripts.
No mail will be sent out, as 'TomEE » master-build-full-tck » TomEE :: TCK :: JAX-RS TCK #494' does not have a result yet. Please make sure you set a proper result in case of pipeline/build scripts.
No mail will be sent out, as 'TomEE » master-build-full-tck » TomEE :: TCK :: MicroProfile Telemetry Tracing TCK #494' does not have a result yet. Please make sure you set a proper result in case of pipeline/build scripts.
No mail will be sent out, as 'TomEE » master-build-full-tck » TomEE :: TCK :: MicroProfile Telemetry Logs TCK #494' does not have a result yet. Please make sure you set a proper result in case of pipeline/build scripts.
No mail will be sent out, as 'TomEE » master-build-full-tck » TomEE :: TCK :: MicroProfile Open API TCK #494' does not have a result yet. Please make sure you set a proper result in case of pipeline/build scripts.
No mail will be sent out, as 'TomEE » master-build-full-tck » TomEE :: TCK :: JAX-RS TCK :: Signature Test #494' does not have a result yet. Please make sure you set a proper result in case of pipeline/build scripts.
No mail will be sent out, as 'TomEE » master-build-full-tck » TomEE :: TCK :: MicroProfile Telemetry TCK #494' does not have a result yet. Please make sure you set a proper result in case of pipeline/build scripts.
No mail will be sent out, as 'TomEE » master-build-full-tck » TomEE :: TCK :: MicroProfile Telemetry Metrics TCK #494' does not have a result yet. Please make sure you set a proper result in case of pipeline/build scripts.
No mail will be sent out, as 'TomEE » master-build-full-tck » TomEE :: TCK :: Jakarta Data #494' does not have a result yet. Please make sure you set a proper result in case of pipeline/build scripts.
No mail will be sent out, as 'TomEE » master-build-full-tck » TomEE :: TCK :: Jakarta Data Signature Tests #494' does not have a result yet. Please make sure you set a proper result in case of pipeline/build scripts.
No mail will be sent out, as 'TomEE » master-build-full-tck » TomEE :: TCK :: MicroProfile Rest Client TCK #494' does not have a result yet. Please make sure you set a proper result in case of pipeline/build scripts.
No mail will be sent out, as 'TomEE » master-build-full-tck » TomEE :: TCK :: MicroProfile Fault Tolerance TCK #494' does not have a result yet. Please make sure you set a proper result in case of pipeline/build scripts.
Sending e-mails to: commits@tomee.apache.org
ERROR: Maven JVM terminated unexpectedly with exit code 1
INFO: Processing JUnit
INFO: [JUnit] - 28 test report file(s) were found with the pattern '**/target/surefire-reports/TEST-*.xml' relative to '<https://ci-builds.apache.org/job/Tomee/job/master-build-full-tck/ws/'> for the testing framework 'JUnit'.
[Checks API] No suitable checks publisher found.
INFO: Setting the build status to SUCCESS

Jenkins build is still unstable: TomEE » master-build-full-tck #493

Posted by Apache Jenkins Server <je...@builds.apache.org>.
See <https://ci-builds.apache.org/job/Tomee/job/master-build-full-tck/493/display/redirect?page=changes>


Jenkins build is still unstable: TomEE » master-build-full-tck #492

Posted by Apache Jenkins Server <je...@builds.apache.org>.
See <https://ci-builds.apache.org/job/Tomee/job/master-build-full-tck/492/display/redirect?page=changes>


Jenkins build is still unstable: TomEE » master-build-full-tck #491

Posted by Apache Jenkins Server <je...@builds.apache.org>.
See <https://ci-builds.apache.org/job/Tomee/job/master-build-full-tck/491/display/redirect?page=changes>


Jenkins build is unstable: TomEE » master-build-full-tck #490

Posted by Apache Jenkins Server <je...@builds.apache.org>.
See <https://ci-builds.apache.org/job/Tomee/job/master-build-full-tck/490/display/redirect?page=changes>