You are viewing a plain text version of this content. The canonical link for it is here.
Posted to builds@beam.apache.org by Apache Jenkins Server <je...@builds.apache.org> on 2023/12/11 06:31:22 UTC

Build failed in Jenkins: beam_PostCommit_Python311 #988

See <https://ci-beam.apache.org/job/beam_PostCommit_Python311/988/display/redirect>

Changes:


------------------------------------------
[...truncated 13.12 MB...]
    raise self
grpc._channel._MultiThreadedRendezvous: <_MultiThreadedRendezvous of RPC that terminated with:
	status = StatusCode.UNAVAILABLE
	details = "Socket closed"
	debug_error_string = "UNKNOWN:Error received from peer ipv6:%5B::1%5D:41567 {created_time:"2023-12-11T05:12:10.056742587+00:00", grpc_status:14, grpc_message:"Socket closed"}"
>
Exception in thread read_grpc_client_inputs:
Traceback (most recent call last):
  File "/usr/lib/python3.11/threading.py", line 1038, in _bootstrap_inner
    for work_request in self._control_stub.Control(get_responses()):
  File "<https://ci-beam.apache.org/job/beam_PostCommit_Python311/ws/src/build/gradleenv/-1720702906/lib/python3.11/site-packages/grpc/_channel.py",> line 540, in __next__
    self.run()
  File "/usr/lib/python3.11/threading.py", line 975, in run
    for response in responses:
    return self._next()
  File "<https://ci-beam.apache.org/job/beam_PostCommit_Python311/ws/src/build/gradleenv/-1720702906/lib/python3.11/site-packages/grpc/_channel.py",> line 540, in __next__
           ^^^^^^^^^^^^
    self._target(*self._args, **self._kwargs)
  File "<https://ci-beam.apache.org/job/beam_PostCommit_Python311/ws/src/build/gradleenv/-1720702906/lib/python3.11/site-packages/grpc/_channel.py",> line 966, in _next
  File "<https://ci-beam.apache.org/job/beam_PostCommit_Python311/ws/src/sdks/python/apache_beam/runners/worker/data_plane.py",> line 686, in <lambda>
    return self._next()
           ^^^^^^^^^^^^
    raise self
  File "<https://ci-beam.apache.org/job/beam_PostCommit_Python311/ws/src/build/gradleenv/-1720702906/lib/python3.11/site-packages/grpc/_channel.py",> line 966, in _next
    target=lambda: self._read_inputs(elements_iterator),
grpc._channel._MultiThreadedRendezvous: <_MultiThreadedRendezvous of RPC that terminated with:
	status = StatusCode.UNAVAILABLE
	details = "Socket closed"
	debug_error_string = "UNKNOWN:Error received from peer ipv6:%5B::1%5D:42561 {grpc_message:"Socket closed", grpc_status:14, created_time:"2023-12-11T05:12:10.056744848+00:00"}"
>
                   ^^^^^^^^^^^^^^^^^^^^^^^^^^^^^^^^^^^^
    raise self
  File "<https://ci-beam.apache.org/job/beam_PostCommit_Python311/ws/src/sdks/python/apache_beam/runners/worker/data_plane.py",> line 669, in _read_inputs
grpc._channel._MultiThreadedRendezvous: <_MultiThreadedRendezvous of RPC that terminated with:
	status = StatusCode.UNAVAILABLE
	details = "Socket closed"
	debug_error_string = "UNKNOWN:Error received from peer ipv6:%5B::1%5D:43079 {created_time:"2023-12-11T05:12:10.056750404+00:00", grpc_status:14, grpc_message:"Socket closed"}"
>
    for elements in elements_iterator:
  File "<https://ci-beam.apache.org/job/beam_PostCommit_Python311/ws/src/build/gradleenv/-1720702906/lib/python3.11/site-packages/grpc/_channel.py",> line 540, in __next__
    return self._next()
           ^^^^^^^^^^^^
  File "<https://ci-beam.apache.org/job/beam_PostCommit_Python311/ws/src/build/gradleenv/-1720702906/lib/python3.11/site-packages/grpc/_channel.py",> line 966, in _next
    raise self
grpc._channel._MultiThreadedRendezvous: <_MultiThreadedRendezvous of RPC that terminated with:
	status = StatusCode.UNAVAILABLE
	details = "Socket closed"
	debug_error_string = "UNKNOWN:Error received from peer ipv6:%5B::1%5D:41567 {created_time:"2023-12-11T05:12:10.056742587+00:00", grpc_status:14, grpc_message:"Socket closed"}"
>

> Task :sdks:python:test-suites:dataflow:py311:postCommitIT

[gw1] PASSED apache_beam/io/gcp/bigquery_read_it_test.py::ReadTests::test_table_schema_retrieve 
apache_beam/io/gcp/bigquery_read_it_test.py::ReadTests::test_table_schema_retrieve_specifying_only_table 
[gw6] PASSED apache_beam/io/gcp/big_query_query_to_table_it_test.py::BigQueryQueryToTableIT::test_big_query_new_types_avro 
apache_beam/io/gcp/big_query_query_to_table_it_test.py::BigQueryQueryToTableIT::test_big_query_standard_sql 
[gw7] PASSED apache_beam/ml/inference/sklearn_inference_it_test.py::SklearnInference::test_sklearn_mnist_classification 
apache_beam/ml/inference/sklearn_inference_it_test.py::SklearnInference::test_sklearn_mnist_classification_large_model 
[gw4] PASSED apache_beam/io/gcp/bigquery_write_it_test.py::BigQueryWriteIntegrationTests::test_big_query_write_new_types 
apache_beam/io/gcp/bigquery_write_it_test.py::BigQueryWriteIntegrationTests::test_big_query_write_schema_autodetect 
[gw4] SKIPPED apache_beam/io/gcp/bigquery_write_it_test.py::BigQueryWriteIntegrationTests::test_big_query_write_schema_autodetect 
apache_beam/io/gcp/bigquery_write_it_test.py::BigQueryWriteIntegrationTests::test_big_query_write_without_schema 
[gw0] PASSED apache_beam/io/gcp/bigquery_io_read_it_test.py::BigqueryIOReadIT::test_bigquery_read_1M_python 
apache_beam/io/gcp/bigquery_io_read_it_test.py::BigqueryIOReadIT::test_bigquery_read_custom_1M_python 
[gw2] PASSED apache_beam/dataframe/io_it_test.py::ReadUsingReadGbqTests::test_ReadGbq_export_with_project 
apache_beam/dataframe/io_it_test.py::ReadUsingReadGbqTests::test_ReadGbq_with_computation 
[gw7] PASSED apache_beam/ml/inference/sklearn_inference_it_test.py::SklearnInference::test_sklearn_mnist_classification_large_model 
apache_beam/ml/inference/sklearn_inference_it_test.py::SklearnInference::test_sklearn_regression 
[gw7] SKIPPED apache_beam/ml/inference/sklearn_inference_it_test.py::SklearnInference::test_sklearn_regression 
apache_beam/io/gcp/healthcare/dicomio_integration_test.py::DICOMIoIntegrationTest::test_dicom_search_instances 
[gw1] PASSED apache_beam/io/gcp/bigquery_read_it_test.py::ReadTests::test_table_schema_retrieve_specifying_only_table 
apache_beam/io/gcp/bigquery_read_it_test.py::ReadTests::test_table_schema_retrieve_with_direct_read 
[gw6] PASSED apache_beam/io/gcp/big_query_query_to_table_it_test.py::BigQueryQueryToTableIT::test_big_query_standard_sql 
apache_beam/examples/dataframe/taxiride_it_test.py::TaxirideIT::test_aggregation 
[gw4] PASSED apache_beam/io/gcp/bigquery_write_it_test.py::BigQueryWriteIntegrationTests::test_big_query_write_without_schema 
apache_beam/ml/gcp/cloud_dlp_it_test.py::CloudDLPIT::test_deidentification 
[gw0] PASSED apache_beam/io/gcp/bigquery_io_read_it_test.py::BigqueryIOReadIT::test_bigquery_read_custom_1M_python 
apache_beam/io/gcp/gcsio_integration_test.py::GcsIOIntegrationTest::test_batch_copy_and_delete 
[gw0] PASSED apache_beam/io/gcp/gcsio_integration_test.py::GcsIOIntegrationTest::test_batch_copy_and_delete 
apache_beam/io/gcp/gcsio_integration_test.py::GcsIOIntegrationTest::test_copy 
[gw0] PASSED apache_beam/io/gcp/gcsio_integration_test.py::GcsIOIntegrationTest::test_copy 
apache_beam/examples/complete/autocomplete_test.py::AutocompleteTest::test_autocomplete_it 
[gw3] PASSED apache_beam/io/gcp/bigquery_json_it_test.py::BigQueryJsonIT::test_streaming_inserts 
apache_beam/examples/wordcount_it_test.py::WordCountIT::test_wordcount_impersonation_it 
[gw2] PASSED apache_beam/dataframe/io_it_test.py::ReadUsingReadGbqTests::test_ReadGbq_with_computation 
apache_beam/io/gcp/pubsub_integration_test.py::PubSubIntegrationTest::test_streaming_data_only 
[gw7] PASSED apache_beam/io/gcp/healthcare/dicomio_integration_test.py::DICOMIoIntegrationTest::test_dicom_search_instances 
apache_beam/io/gcp/healthcare/dicomio_integration_test.py::DICOMIoIntegrationTest::test_dicom_store_instance_from_gcs 
[gw5] PASSED apache_beam/io/gcp/bigquery_test.py::PubSubBigQueryIT::test_file_loads 
apache_beam/io/gcp/bigquery_test.py::PubSubBigQueryIT::test_streaming_inserts 
[gw1] PASSED apache_beam/io/gcp/bigquery_read_it_test.py::ReadTests::test_table_schema_retrieve_with_direct_read 
apache_beam/io/gcp/bigquery_read_it_test.py::ReadUsingStorageApiTests::test_iobase_source 
[gw6] PASSED apache_beam/examples/dataframe/taxiride_it_test.py::TaxirideIT::test_aggregation 
apache_beam/examples/dataframe/taxiride_it_test.py::TaxirideIT::test_enrich 
[gw4] PASSED apache_beam/ml/gcp/cloud_dlp_it_test.py::CloudDLPIT::test_deidentification 
apache_beam/ml/gcp/cloud_dlp_it_test.py::CloudDLPIT::test_inspection 
[gw0] PASSED apache_beam/examples/complete/autocomplete_test.py::AutocompleteTest::test_autocomplete_it 
apache_beam/examples/complete/game/game_stats_it_test.py::GameStatsIT::test_game_stats_it 
[gw3] PASSED apache_beam/examples/wordcount_it_test.py::WordCountIT::test_wordcount_impersonation_it 
apache_beam/examples/wordcount_it_test.py::WordCountIT::test_wordcount_it 
[gw7] PASSED apache_beam/io/gcp/healthcare/dicomio_integration_test.py::DICOMIoIntegrationTest::test_dicom_store_instance_from_gcs 
apache_beam/examples/fastavro_it_test.py::FastavroIT::test_avro_it 
[gw1] PASSED apache_beam/io/gcp/bigquery_read_it_test.py::ReadUsingStorageApiTests::test_iobase_source 
apache_beam/io/gcp/bigquery_read_it_test.py::ReadUsingStorageApiTests::test_iobase_source_with_column_selection 
[gw4] PASSED apache_beam/ml/gcp/cloud_dlp_it_test.py::CloudDLPIT::test_inspection 
apache_beam/examples/streaming_wordcount_it_test.py::StreamingWordCountIT::test_streaming_wordcount_it 
[gw3] PASSED apache_beam/examples/wordcount_it_test.py::WordCountIT::test_wordcount_it 
apache_beam/examples/complete/game/leader_board_it_test.py::LeaderBoardIT::test_leader_board_it 
[gw1] PASSED apache_beam/io/gcp/bigquery_read_it_test.py::ReadUsingStorageApiTests::test_iobase_source_with_column_selection 
apache_beam/io/gcp/bigquery_read_it_test.py::ReadUsingStorageApiTests::test_iobase_source_with_column_selection_and_row_restriction 
[gw2] PASSED apache_beam/io/gcp/pubsub_integration_test.py::PubSubIntegrationTest::test_streaming_data_only 
apache_beam/io/gcp/pubsub_integration_test.py::PubSubIntegrationTest::test_streaming_with_attributes 
[gw1] PASSED apache_beam/io/gcp/bigquery_read_it_test.py::ReadUsingStorageApiTests::test_iobase_source_with_column_selection_and_row_restriction 
apache_beam/io/gcp/bigquery_read_it_test.py::ReadUsingStorageApiTests::test_iobase_source_with_column_selection_and_row_restriction_rows 
[gw7] PASSED apache_beam/examples/fastavro_it_test.py::FastavroIT::test_avro_it 
apache_beam/examples/complete/juliaset/juliaset/juliaset_test_it.py::JuliaSetTestIT::test_run_example_with_setup_file <https://ci-beam.apache.org/job/beam_PostCommit_Python311/ws/src/build/gradleenv/2050596099/bin/python3.11>: No module named build
warning: sdist: standard file not found: should have one of README, README.rst, README.txt, README.md

warning: check: missing required meta-data: url

warning: check: missing meta-data: either (author and author_email) or (maintainer and maintainer_email) should be supplied


[gw5] PASSED apache_beam/io/gcp/bigquery_test.py::PubSubBigQueryIT::test_streaming_inserts 
apache_beam/io/gcp/bigquery_test.py::BigQueryFileLoadsIntegrationTests::test_avro_file_load 
[gw0] PASSED apache_beam/examples/complete/game/game_stats_it_test.py::GameStatsIT::test_game_stats_it 
apache_beam/examples/complete/game/hourly_team_score_it_test.py::HourlyTeamScoreIT::test_hourly_team_score_it 
[gw1] PASSED apache_beam/io/gcp/bigquery_read_it_test.py::ReadUsingStorageApiTests::test_iobase_source_with_column_selection_and_row_restriction_rows 
apache_beam/io/gcp/bigquery_read_it_test.py::ReadUsingStorageApiTests::test_iobase_source_with_native_datetime 
[gw6] PASSED apache_beam/examples/dataframe/taxiride_it_test.py::TaxirideIT::test_enrich 
apache_beam/examples/streaming_wordcount_debugging_it_test.py::StreamingWordcountDebuggingIT::test_streaming_wordcount_debugging_it 
[gw6] SKIPPED apache_beam/examples/streaming_wordcount_debugging_it_test.py::StreamingWordcountDebuggingIT::test_streaming_wordcount_debugging_it 
apache_beam/examples/cookbook/datastore_wordcount_it_test.py::DatastoreWordCountIT::test_datastore_wordcount_it 
[gw4] PASSED apache_beam/examples/streaming_wordcount_it_test.py::StreamingWordCountIT::test_streaming_wordcount_it 
apache_beam/examples/dataframe/flight_delays_it_test.py::FlightDelaysTest::test_flight_delays 
[gw2] PASSED apache_beam/io/gcp/pubsub_integration_test.py::PubSubIntegrationTest::test_streaming_with_attributes 
apache_beam/examples/complete/game/user_score_it_test.py::UserScoreIT::test_user_score_it 
[gw3] PASSED apache_beam/examples/complete/game/leader_board_it_test.py::LeaderBoardIT::test_leader_board_it 
apache_beam/io/fileio_test.py::MatchIntegrationTest::test_transform_on_gcs 
[gw7] PASSED apache_beam/examples/complete/juliaset/juliaset/juliaset_test_it.py::JuliaSetTestIT::test_run_example_with_setup_file 
apache_beam/io/parquetio_it_test.py::TestParquetIT::test_parquetio_it 
[gw5] PASSED apache_beam/io/gcp/bigquery_test.py::BigQueryFileLoadsIntegrationTests::test_avro_file_load 
apache_beam/examples/cookbook/bigquery_tornadoes_it_test.py::BigqueryTornadoesIT::test_bigquery_tornadoes_it 
[gw1] PASSED apache_beam/io/gcp/bigquery_read_it_test.py::ReadUsingStorageApiTests::test_iobase_source_with_native_datetime 
apache_beam/io/gcp/bigquery_read_it_test.py::ReadUsingStorageApiTests::test_iobase_source_with_query 
[gw4] PASSED apache_beam/examples/dataframe/flight_delays_it_test.py::FlightDelaysTest::test_flight_delays 
apache_beam/io/gcp/datastore/v1new/datastore_write_it_test.py::DatastoreWriteIT::test_datastore_write_limit 
[gw6] PASSED apache_beam/examples/cookbook/datastore_wordcount_it_test.py::DatastoreWordCountIT::test_datastore_wordcount_it 
apache_beam/runners/dataflow/dataflow_exercise_metrics_pipeline_test.py::ExerciseMetricsPipelineTest::test_metrics_it 
[gw6] SKIPPED apache_beam/runners/dataflow/dataflow_exercise_metrics_pipeline_test.py::ExerciseMetricsPipelineTest::test_metrics_it 
apache_beam/transforms/external_it_test.py::ExternalTransformIT::test_job_python_from_python_it 
[gw3] PASSED apache_beam/io/fileio_test.py::MatchIntegrationTest::test_transform_on_gcs 
apache_beam/ml/gcp/naturallanguageml_test_it.py::NaturalLanguageMlTestIT::test_analyzing_syntax 
[gw3] SKIPPED apache_beam/ml/gcp/naturallanguageml_test_it.py::NaturalLanguageMlTestIT::test_analyzing_syntax 
[gw7] PASSED apache_beam/io/parquetio_it_test.py::TestParquetIT::test_parquetio_it 
apache_beam/ml/gcp/visionml_test_it.py::VisionMlTestIT::test_text_detection_with_language_hint 
[gw5] PASSED apache_beam/examples/cookbook/bigquery_tornadoes_it_test.py::BigqueryTornadoesIT::test_bigquery_tornadoes_it 
apache_beam/ml/inference/base_test.py::RunInferenceBaseTest::test_run_inference_with_side_inputin_streaming 
[gw5] SKIPPED apache_beam/ml/inference/base_test.py::RunInferenceBaseTest::test_run_inference_with_side_inputin_streaming 
[gw1] PASSED apache_beam/io/gcp/bigquery_read_it_test.py::ReadUsingStorageApiTests::test_iobase_source_with_query 
apache_beam/io/gcp/bigquery_read_it_test.py::ReadUsingStorageApiTests::test_iobase_source_with_query_and_filters 
[gw0] PASSED apache_beam/examples/complete/game/hourly_team_score_it_test.py::HourlyTeamScoreIT::test_hourly_team_score_it 
apache_beam/examples/inference/tfx_bsl/tfx_bsl_inference_it_test.py::TFXRunInferenceTests::test_tfx_run_inference_mobilenetv2 
[gw0] SKIPPED apache_beam/examples/inference/tfx_bsl/tfx_bsl_inference_it_test.py::TFXRunInferenceTests::test_tfx_run_inference_mobilenetv2 
apache_beam/ml/inference/onnx_inference_it_test.py::OnnxInference::test_onnx_run_inference_roberta_sentiment_classification 
[gw0] SKIPPED apache_beam/ml/inference/onnx_inference_it_test.py::OnnxInference::test_onnx_run_inference_roberta_sentiment_classification 
[gw6] PASSED apache_beam/transforms/external_it_test.py::ExternalTransformIT::test_job_python_from_python_it 
[gw7] PASSED apache_beam/ml/gcp/visionml_test_it.py::VisionMlTestIT::test_text_detection_with_language_hint 
[gw2] PASSED apache_beam/examples/complete/game/user_score_it_test.py::UserScoreIT::test_user_score_it 
apache_beam/ml/gcp/videointelligenceml_test_it.py::VideoIntelligenceMlTestIT::test_label_detection_with_video_context 
[gw2] SKIPPED apache_beam/ml/gcp/videointelligenceml_test_it.py::VideoIntelligenceMlTestIT::test_label_detection_with_video_context 
[gw1] PASSED apache_beam/io/gcp/bigquery_read_it_test.py::ReadUsingStorageApiTests::test_iobase_source_with_query_and_filters 
apache_beam/io/gcp/bigquery_read_it_test.py::ReadUsingStorageApiTests::test_iobase_source_with_row_restriction 
[gw1] PASSED apache_beam/io/gcp/bigquery_read_it_test.py::ReadUsingStorageApiTests::test_iobase_source_with_row_restriction 
apache_beam/io/gcp/bigquery_read_it_test.py::ReadUsingStorageApiTests::test_iobase_source_with_very_selective_filters 
[gw1] PASSED apache_beam/io/gcp/bigquery_read_it_test.py::ReadUsingStorageApiTests::test_iobase_source_with_very_selective_filters 
apache_beam/io/gcp/bigquery_read_it_test.py::ReadNewTypesTests::test_iobase_source 
[gw1] PASSED apache_beam/io/gcp/bigquery_read_it_test.py::ReadNewTypesTests::test_iobase_source 
apache_beam/io/gcp/bigquery_read_it_test.py::ReadNewTypesTests::test_native_source 
[gw4] PASSED apache_beam/io/gcp/datastore/v1new/datastore_write_it_test.py::DatastoreWriteIT::test_datastore_write_limit 
apache_beam/transforms/periodicsequence_it_test.py::PeriodicSequenceIT::test_periodicsequence_outputs_valid_watermarks_it 
[gw4] SKIPPED apache_beam/transforms/periodicsequence_it_test.py::PeriodicSequenceIT::test_periodicsequence_outputs_valid_watermarks_it 
[gw1] PASSED apache_beam/io/gcp/bigquery_read_it_test.py::ReadNewTypesTests::test_native_source 
apache_beam/io/gcp/bigquery_read_it_test.py::ReadAllBQTests::test_read_queries 
[gw1] PASSED apache_beam/io/gcp/bigquery_read_it_test.py::ReadAllBQTests::test_read_queries 
apache_beam/io/gcp/bigquery_read_it_test.py::ReadInteractiveRunnerTests::test_read_in_interactive_runner 
[gw1] PASSED apache_beam/io/gcp/bigquery_read_it_test.py::ReadInteractiveRunnerTests::test_read_in_interactive_runner 

=============================== warnings summary ===============================
apache_beam/io/gcp/bigquery.py:2603
  <https://ci-beam.apache.org/job/beam_PostCommit_Python311/ws/src/sdks/python/apache_beam/io/gcp/bigquery.py>:2603: DeprecationWarning: invalid escape sequence '\#'
    """Read data from BigQuery.

apache_beam/io/gcp/bigquery_read_it_test.py::ReadTests::test_native_source
  <https://ci-beam.apache.org/job/beam_PostCommit_Python311/ws/src/sdks/python/apache_beam/io/gcp/bigquery_read_it_test.py>:170: BeamDeprecationWarning: BigQuerySource is deprecated since 2.25.0. Use ReadFromBigQuery instead.
    beam.io.BigQuerySource(query=self.query, use_standard_sql=True)))

apache_beam/io/gcp/bigquery_test.py::PubSubBigQueryIT::test_file_loads
apache_beam/io/gcp/bigquery_test.py::PubSubBigQueryIT::test_streaming_inserts
apache_beam/examples/complete/game/game_stats_it_test.py::GameStatsIT::test_game_stats_it
apache_beam/examples/complete/game/leader_board_it_test.py::LeaderBoardIT::test_leader_board_it
apache_beam/examples/complete/game/hourly_team_score_it_test.py::HourlyTeamScoreIT::test_hourly_team_score_it
  <https://ci-beam.apache.org/job/beam_PostCommit_Python311/ws/src/sdks/python/apache_beam/io/gcp/tests/utils.py>:63: PendingDeprecationWarning: Client.dataset is deprecated and will be removed in a future version. Use a string like 'my_project.my_dataset' or a cloud.google.bigquery.DatasetReference object, instead.
    dataset_ref = client.dataset(unique_dataset_name, project=project)

apache_beam/examples/dataframe/flight_delays_it_test.py::FlightDelaysTest::test_flight_delays
  <https://ci-beam.apache.org/job/beam_PostCommit_Python311/ws/src/sdks/python/apache_beam/examples/dataframe/flight_delays.py>:47: FutureWarning: The default value of numeric_only in DataFrame.mean is deprecated. In a future version, it will default to False. In addition, specifying 'numeric_only=None' is deprecated. Select only valid columns or specify the value of numeric_only to silence this warning.
    return airline_df[at_top_airports].mean()

apache_beam/examples/cookbook/bigquery_tornadoes_it_test.py::BigqueryTornadoesIT::test_bigquery_tornadoes_it
  <https://ci-beam.apache.org/job/beam_PostCommit_Python311/ws/src/sdks/python/apache_beam/io/gcp/tests/utils.py>:100: PendingDeprecationWarning: Client.dataset is deprecated and will be removed in a future version. Use a string like 'my_project.my_dataset' or a cloud.google.bigquery.DatasetReference object, instead.
    table_ref = client.dataset(dataset_id).table(table_id)

apache_beam/io/gcp/bigquery_read_it_test.py::ReadNewTypesTests::test_native_source
  <https://ci-beam.apache.org/job/beam_PostCommit_Python311/ws/src/sdks/python/apache_beam/io/gcp/bigquery_read_it_test.py>:706: BeamDeprecationWarning: BigQuerySource is deprecated since 2.25.0. Use ReadFromBigQuery instead.
    beam.io.BigQuerySource(query=self.query, use_standard_sql=True)))

-- Docs: https://docs.pytest.org/en/stable/how-to/capture-warnings.html
- generated xml file: <https://ci-beam.apache.org/job/beam_PostCommit_Python311/ws/src/sdks/python/pytest_postCommitIT-df-py311.xml> -
=========== 82 passed, 51 skipped, 10 warnings in 5837.65s (1:37:17) ===========

FAILURE: Build failed with an exception.

* Where:
Script '<https://ci-beam.apache.org/job/beam_PostCommit_Python311/ws/src/sdks/python/test-suites/portable/common.gradle'> line: 326

* What went wrong:
Execution failed for task ':sdks:python:test-suites:portable:py311:postCommitPy311IT'.
> Process 'command 'sh'' finished with non-zero exit value 1

* Try:
> Run with --stacktrace option to get the stack trace.
> Run with --info or --debug option to get more log output.
> Get more help at https://help.gradle.org.

Deprecated Gradle features were used in this build, making it incompatible with Gradle 9.0.

You can use '--warning-mode all' to show the individual deprecation warnings and determine if they come from your own scripts or plugins.

For more on this, please refer to https://docs.gradle.org/8.4/userguide/command_line_interface.html#sec:command_line_warnings in the Gradle documentation.

BUILD FAILED in 1h 42m 58s
217 actionable tasks: 152 executed, 61 from cache, 4 up-to-date

Publishing build scan...
https://ge.apache.org/s/fzpe2xgiet3lu

Build step 'Invoke Gradle script' changed build result to FAILURE
Build step 'Invoke Gradle script' marked build as failure

---------------------------------------------------------------------
To unsubscribe, e-mail: builds-unsubscribe@beam.apache.org
For additional commands, e-mail: builds-help@beam.apache.org


Jenkins build is back to normal : beam_PostCommit_Python311 #999

Posted by Apache Jenkins Server <je...@builds.apache.org>.
See <https://ci-beam.apache.org/job/beam_PostCommit_Python311/999/display/redirect>


---------------------------------------------------------------------
To unsubscribe, e-mail: builds-unsubscribe@beam.apache.org
For additional commands, e-mail: builds-help@beam.apache.org


Build failed in Jenkins: beam_PostCommit_Python311 #998

Posted by Apache Jenkins Server <je...@builds.apache.org>.
See <https://ci-beam.apache.org/job/beam_PostCommit_Python311/998/display/redirect>

Changes:


------------------------------------------
[...truncated 9.40 MB...]
	status = StatusCode.UNAVAILABLE
	details = "Socket closed"
	debug_error_string = "UNKNOWN:Error received from peer ipv6:%5B::1%5D:40499 {created_time:"2023-12-13T17:18:28.855327959+00:00", grpc_status:14, grpc_message:"Socket closed"}"
>
Exception in thread read_grpc_client_inputs:
Traceback (most recent call last):
  File "/usr/lib/python3.11/threading.py", line 1038, in _bootstrap_inner
    self.run()
  File "/usr/lib/python3.11/threading.py", line 975, in run
    self.run()
  File "/usr/lib/python3.11/threading.py", line 975, in run
    self.run()
  File "/usr/lib/python3.11/threading.py", line 975, in run
    self._target(*self._args, **self._kwargs)
    self._target(*self._args, **self._kwargs)
  File "<https://ci-beam.apache.org/job/beam_PostCommit_Python311/ws/src/sdks/python/apache_beam/runners/worker/sdk_worker.py",> line 265, in run
    self._target(*self._args, **self._kwargs)
  File "<https://ci-beam.apache.org/job/beam_PostCommit_Python311/ws/src/sdks/python/apache_beam/runners/worker/data_plane.py",> line 686, in <lambda>
  File "<https://ci-beam.apache.org/job/beam_PostCommit_Python311/ws/src/sdks/python/apache_beam/runners/worker/sdk_worker.py",> line 1049, in pull_responses
    for work_request in self._control_stub.Control(get_responses()):
    target=lambda: self._read_inputs(elements_iterator),
  File "<https://ci-beam.apache.org/job/beam_PostCommit_Python311/ws/src/build/gradleenv/-1720702906/lib/python3.11/site-packages/grpc/_channel.py",> line 540, in __next__
    for response in responses:
                   ^^^^^^^^^^^^^^^^^^^^^^^^^^^^^^^^^^^^
  File "<https://ci-beam.apache.org/job/beam_PostCommit_Python311/ws/src/sdks/python/apache_beam/runners/worker/data_plane.py",> line 669, in _read_inputs
  File "<https://ci-beam.apache.org/job/beam_PostCommit_Python311/ws/src/build/gradleenv/-1720702906/lib/python3.11/site-packages/grpc/_channel.py",> line 540, in __next__
    return self._next()
    for elements in elements_iterator:
           ^^^^^^^^^^^^
    return self._next()
  File "<https://ci-beam.apache.org/job/beam_PostCommit_Python311/ws/src/build/gradleenv/-1720702906/lib/python3.11/site-packages/grpc/_channel.py",> line 966, in _next
           ^^^^^^^^^^^^
  File "<https://ci-beam.apache.org/job/beam_PostCommit_Python311/ws/src/build/gradleenv/-1720702906/lib/python3.11/site-packages/grpc/_channel.py",> line 540, in __next__
    raise self
  File "<https://ci-beam.apache.org/job/beam_PostCommit_Python311/ws/src/build/gradleenv/-1720702906/lib/python3.11/site-packages/grpc/_channel.py",> line 966, in _next
grpc._channel._MultiThreadedRendezvous: <_MultiThreadedRendezvous of RPC that terminated with:
	status = StatusCode.UNAVAILABLE
	details = "Socket closed"
	debug_error_string = "UNKNOWN:Error received from peer ipv6:%5B::1%5D:36005 {grpc_message:"Socket closed", grpc_status:14, created_time:"2023-12-13T17:18:28.855379624+00:00"}"
>
    return self._next()
           ^^^^^^^^^^^^
  File "<https://ci-beam.apache.org/job/beam_PostCommit_Python311/ws/src/build/gradleenv/-1720702906/lib/python3.11/site-packages/grpc/_channel.py",> line 966, in _next
    raise self
    raise self
grpc._channel._MultiThreadedRendezvous: <_MultiThreadedRendezvous of RPC that terminated with:
	status = StatusCode.UNAVAILABLE
	details = "Socket closed"
	debug_error_string = "UNKNOWN:Error received from peer ipv6:%5B::1%5D:41471 {grpc_message:"Socket closed", grpc_status:14, created_time:"2023-12-13T17:18:28.855356109+00:00"}"
>
grpc._channel._MultiThreadedRendezvous: <_MultiThreadedRendezvous of RPC that terminated with:
	status = StatusCode.UNAVAILABLE
	details = "Socket closed"
	debug_error_string = "UNKNOWN:Error received from peer ipv6:%5B::1%5D:40499 {created_time:"2023-12-13T17:18:28.855327959+00:00", grpc_status:14, grpc_message:"Socket closed"}"
>

> Task :sdks:python:test-suites:dataflow:py311:postCommitIT

[gw1] PASSED apache_beam/io/gcp/bigquery_io_read_it_test.py::BigqueryIOReadIT::test_bigquery_read_1M_python 
apache_beam/io/gcp/bigquery_io_read_it_test.py::BigqueryIOReadIT::test_bigquery_read_custom_1M_python 
[gw0] PASSED apache_beam/io/gcp/bigquery_read_it_test.py::ReadTests::test_table_schema_retrieve_specifying_only_table 
apache_beam/io/gcp/bigquery_read_it_test.py::ReadTests::test_table_schema_retrieve_with_direct_read 
[gw4] PASSED apache_beam/dataframe/io_it_test.py::ReadUsingReadGbqTests::test_ReadGbq_export_with_project 
apache_beam/dataframe/io_it_test.py::ReadUsingReadGbqTests::test_ReadGbq_with_computation 
[gw2] PASSED apache_beam/io/gcp/bigquery_write_it_test.py::BigQueryWriteIntegrationTests::test_big_query_write_new_types 
apache_beam/io/gcp/bigquery_write_it_test.py::BigQueryWriteIntegrationTests::test_big_query_write_schema_autodetect 
[gw2] SKIPPED apache_beam/io/gcp/bigquery_write_it_test.py::BigQueryWriteIntegrationTests::test_big_query_write_schema_autodetect 
apache_beam/io/gcp/bigquery_write_it_test.py::BigQueryWriteIntegrationTests::test_big_query_write_without_schema 
[gw3] PASSED apache_beam/ml/inference/sklearn_inference_it_test.py::SklearnInference::test_sklearn_mnist_classification_large_model 
apache_beam/ml/inference/sklearn_inference_it_test.py::SklearnInference::test_sklearn_regression 
[gw3] SKIPPED apache_beam/ml/inference/sklearn_inference_it_test.py::SklearnInference::test_sklearn_regression 
apache_beam/io/gcp/healthcare/dicomio_integration_test.py::DICOMIoIntegrationTest::test_dicom_search_instances 
[gw6] PASSED apache_beam/io/gcp/big_query_query_to_table_it_test.py::BigQueryQueryToTableIT::test_big_query_standard_sql 
apache_beam/examples/dataframe/taxiride_it_test.py::TaxirideIT::test_aggregation 
[gw1] PASSED apache_beam/io/gcp/bigquery_io_read_it_test.py::BigqueryIOReadIT::test_bigquery_read_custom_1M_python 
apache_beam/io/gcp/gcsio_integration_test.py::GcsIOIntegrationTest::test_batch_copy_and_delete 
[gw4] PASSED apache_beam/dataframe/io_it_test.py::ReadUsingReadGbqTests::test_ReadGbq_with_computation 
apache_beam/io/gcp/pubsub_integration_test.py::PubSubIntegrationTest::test_streaming_data_only 
[gw1] PASSED apache_beam/io/gcp/gcsio_integration_test.py::GcsIOIntegrationTest::test_batch_copy_and_delete 
apache_beam/io/gcp/gcsio_integration_test.py::GcsIOIntegrationTest::test_copy 
[gw1] PASSED apache_beam/io/gcp/gcsio_integration_test.py::GcsIOIntegrationTest::test_copy 
apache_beam/examples/streaming_wordcount_it_test.py::StreamingWordCountIT::test_streaming_wordcount_it 
[gw7] PASSED apache_beam/io/gcp/bigquery_json_it_test.py::BigQueryJsonIT::test_streaming_inserts 
apache_beam/examples/wordcount_it_test.py::WordCountIT::test_wordcount_impersonation_it 
[gw0] PASSED apache_beam/io/gcp/bigquery_read_it_test.py::ReadTests::test_table_schema_retrieve_with_direct_read 
apache_beam/io/gcp/bigquery_read_it_test.py::ReadUsingStorageApiTests::test_iobase_source 
[gw2] PASSED apache_beam/io/gcp/bigquery_write_it_test.py::BigQueryWriteIntegrationTests::test_big_query_write_without_schema 
apache_beam/ml/gcp/cloud_dlp_it_test.py::CloudDLPIT::test_deidentification 
[gw5] PASSED apache_beam/io/gcp/bigquery_test.py::PubSubBigQueryIT::test_file_loads 
apache_beam/io/gcp/bigquery_test.py::PubSubBigQueryIT::test_streaming_inserts 
[gw3] PASSED apache_beam/io/gcp/healthcare/dicomio_integration_test.py::DICOMIoIntegrationTest::test_dicom_search_instances 
apache_beam/io/gcp/healthcare/dicomio_integration_test.py::DICOMIoIntegrationTest::test_dicom_store_instance_from_gcs 
[gw2] PASSED apache_beam/ml/gcp/cloud_dlp_it_test.py::CloudDLPIT::test_deidentification 
apache_beam/ml/gcp/cloud_dlp_it_test.py::CloudDLPIT::test_inspection 
[gw0] PASSED apache_beam/io/gcp/bigquery_read_it_test.py::ReadUsingStorageApiTests::test_iobase_source 
apache_beam/io/gcp/bigquery_read_it_test.py::ReadUsingStorageApiTests::test_iobase_source_with_column_selection 
[gw7] PASSED apache_beam/examples/wordcount_it_test.py::WordCountIT::test_wordcount_impersonation_it 
apache_beam/examples/wordcount_it_test.py::WordCountIT::test_wordcount_it 
[gw6] PASSED apache_beam/examples/dataframe/taxiride_it_test.py::TaxirideIT::test_aggregation 
apache_beam/examples/dataframe/taxiride_it_test.py::TaxirideIT::test_enrich 
[gw3] PASSED apache_beam/io/gcp/healthcare/dicomio_integration_test.py::DICOMIoIntegrationTest::test_dicom_store_instance_from_gcs 
apache_beam/examples/fastavro_it_test.py::FastavroIT::test_avro_it 
[gw2] PASSED apache_beam/ml/gcp/cloud_dlp_it_test.py::CloudDLPIT::test_inspection 
apache_beam/examples/complete/game/user_score_it_test.py::UserScoreIT::test_user_score_it 
[gw0] PASSED apache_beam/io/gcp/bigquery_read_it_test.py::ReadUsingStorageApiTests::test_iobase_source_with_column_selection 
apache_beam/io/gcp/bigquery_read_it_test.py::ReadUsingStorageApiTests::test_iobase_source_with_column_selection_and_row_restriction 
[gw7] PASSED apache_beam/examples/wordcount_it_test.py::WordCountIT::test_wordcount_it 
apache_beam/examples/complete/game/leader_board_it_test.py::LeaderBoardIT::test_leader_board_it 
[gw4] PASSED apache_beam/io/gcp/pubsub_integration_test.py::PubSubIntegrationTest::test_streaming_data_only 
apache_beam/io/gcp/pubsub_integration_test.py::PubSubIntegrationTest::test_streaming_with_attributes 
[gw1] PASSED apache_beam/examples/streaming_wordcount_it_test.py::StreamingWordCountIT::test_streaming_wordcount_it 
apache_beam/examples/complete/game/game_stats_it_test.py::GameStatsIT::test_game_stats_it 
[gw0] PASSED apache_beam/io/gcp/bigquery_read_it_test.py::ReadUsingStorageApiTests::test_iobase_source_with_column_selection_and_row_restriction 
apache_beam/io/gcp/bigquery_read_it_test.py::ReadUsingStorageApiTests::test_iobase_source_with_column_selection_and_row_restriction_rows 
[gw5] PASSED apache_beam/io/gcp/bigquery_test.py::PubSubBigQueryIT::test_streaming_inserts 
apache_beam/io/gcp/bigquery_test.py::BigQueryFileLoadsIntegrationTests::test_avro_file_load 
[gw3] PASSED apache_beam/examples/fastavro_it_test.py::FastavroIT::test_avro_it 
apache_beam/examples/cookbook/bigquery_tornadoes_it_test.py::BigqueryTornadoesIT::test_bigquery_tornadoes_it 
[gw2] PASSED apache_beam/examples/complete/game/user_score_it_test.py::UserScoreIT::test_user_score_it 
apache_beam/examples/cookbook/datastore_wordcount_it_test.py::DatastoreWordCountIT::test_datastore_wordcount_it 
[gw0] PASSED apache_beam/io/gcp/bigquery_read_it_test.py::ReadUsingStorageApiTests::test_iobase_source_with_column_selection_and_row_restriction_rows 
apache_beam/io/gcp/bigquery_read_it_test.py::ReadUsingStorageApiTests::test_iobase_source_with_native_datetime 
[gw4] PASSED apache_beam/io/gcp/pubsub_integration_test.py::PubSubIntegrationTest::test_streaming_with_attributes 
apache_beam/examples/complete/autocomplete_test.py::AutocompleteTest::test_autocomplete_it 
[gw7] PASSED apache_beam/examples/complete/game/leader_board_it_test.py::LeaderBoardIT::test_leader_board_it 
apache_beam/examples/dataframe/flight_delays_it_test.py::FlightDelaysTest::test_flight_delays 
[gw6] PASSED apache_beam/examples/dataframe/taxiride_it_test.py::TaxirideIT::test_enrich 
apache_beam/examples/streaming_wordcount_debugging_it_test.py::StreamingWordcountDebuggingIT::test_streaming_wordcount_debugging_it 
[gw6] SKIPPED apache_beam/examples/streaming_wordcount_debugging_it_test.py::StreamingWordcountDebuggingIT::test_streaming_wordcount_debugging_it 
apache_beam/examples/inference/tfx_bsl/tfx_bsl_inference_it_test.py::TFXRunInferenceTests::test_tfx_run_inference_mobilenetv2 
[gw6] SKIPPED apache_beam/examples/inference/tfx_bsl/tfx_bsl_inference_it_test.py::TFXRunInferenceTests::test_tfx_run_inference_mobilenetv2 
apache_beam/transforms/periodicsequence_it_test.py::PeriodicSequenceIT::test_periodicsequence_outputs_valid_watermarks_it 
[gw6] SKIPPED apache_beam/transforms/periodicsequence_it_test.py::PeriodicSequenceIT::test_periodicsequence_outputs_valid_watermarks_it 
[gw3] PASSED apache_beam/examples/cookbook/bigquery_tornadoes_it_test.py::BigqueryTornadoesIT::test_bigquery_tornadoes_it 
apache_beam/io/fileio_test.py::MatchIntegrationTest::test_transform_on_gcs 
[gw5] PASSED apache_beam/io/gcp/bigquery_test.py::BigQueryFileLoadsIntegrationTests::test_avro_file_load 
apache_beam/examples/complete/juliaset/juliaset/juliaset_test_it.py::JuliaSetTestIT::test_run_example_with_setup_file <https://ci-beam.apache.org/job/beam_PostCommit_Python311/ws/src/build/gradleenv/2050596099/bin/python3.11>: No module named build
warning: sdist: standard file not found: should have one of README, README.rst, README.txt, README.md

warning: check: missing required meta-data: url

warning: check: missing meta-data: either (author and author_email) or (maintainer and maintainer_email) should be supplied


[gw0] PASSED apache_beam/io/gcp/bigquery_read_it_test.py::ReadUsingStorageApiTests::test_iobase_source_with_native_datetime 
apache_beam/io/gcp/bigquery_read_it_test.py::ReadUsingStorageApiTests::test_iobase_source_with_query 
[gw1] PASSED apache_beam/examples/complete/game/game_stats_it_test.py::GameStatsIT::test_game_stats_it 
apache_beam/examples/complete/game/hourly_team_score_it_test.py::HourlyTeamScoreIT::test_hourly_team_score_it 
[gw2] PASSED apache_beam/examples/cookbook/datastore_wordcount_it_test.py::DatastoreWordCountIT::test_datastore_wordcount_it 
apache_beam/io/parquetio_it_test.py::TestParquetIT::test_parquetio_it 
[gw4] PASSED apache_beam/examples/complete/autocomplete_test.py::AutocompleteTest::test_autocomplete_it 
apache_beam/ml/gcp/naturallanguageml_test_it.py::NaturalLanguageMlTestIT::test_analyzing_syntax 
[gw4] SKIPPED apache_beam/ml/gcp/naturallanguageml_test_it.py::NaturalLanguageMlTestIT::test_analyzing_syntax 
apache_beam/runners/dataflow/dataflow_exercise_metrics_pipeline_test.py::ExerciseMetricsPipelineTest::test_metrics_it 
[gw4] SKIPPED apache_beam/runners/dataflow/dataflow_exercise_metrics_pipeline_test.py::ExerciseMetricsPipelineTest::test_metrics_it 
[gw3] PASSED apache_beam/io/fileio_test.py::MatchIntegrationTest::test_transform_on_gcs 
apache_beam/ml/inference/base_test.py::RunInferenceBaseTest::test_run_inference_with_side_inputin_streaming 
[gw3] SKIPPED apache_beam/ml/inference/base_test.py::RunInferenceBaseTest::test_run_inference_with_side_inputin_streaming 
[gw7] PASSED apache_beam/examples/dataframe/flight_delays_it_test.py::FlightDelaysTest::test_flight_delays 
apache_beam/io/gcp/datastore/v1new/datastore_write_it_test.py::DatastoreWriteIT::test_datastore_write_limit 
[gw5] PASSED apache_beam/examples/complete/juliaset/juliaset/juliaset_test_it.py::JuliaSetTestIT::test_run_example_with_setup_file 
apache_beam/ml/gcp/visionml_test_it.py::VisionMlTestIT::test_text_detection_with_language_hint 
[gw0] PASSED apache_beam/io/gcp/bigquery_read_it_test.py::ReadUsingStorageApiTests::test_iobase_source_with_query 
apache_beam/io/gcp/bigquery_read_it_test.py::ReadUsingStorageApiTests::test_iobase_source_with_query_and_filters 
[gw2] PASSED apache_beam/io/parquetio_it_test.py::TestParquetIT::test_parquetio_it 
apache_beam/ml/inference/onnx_inference_it_test.py::OnnxInference::test_onnx_run_inference_roberta_sentiment_classification 
[gw2] SKIPPED apache_beam/ml/inference/onnx_inference_it_test.py::OnnxInference::test_onnx_run_inference_roberta_sentiment_classification 
[gw5] PASSED apache_beam/ml/gcp/visionml_test_it.py::VisionMlTestIT::test_text_detection_with_language_hint 
[gw0] PASSED apache_beam/io/gcp/bigquery_read_it_test.py::ReadUsingStorageApiTests::test_iobase_source_with_query_and_filters 
apache_beam/io/gcp/bigquery_read_it_test.py::ReadUsingStorageApiTests::test_iobase_source_with_row_restriction 
[gw1] PASSED apache_beam/examples/complete/game/hourly_team_score_it_test.py::HourlyTeamScoreIT::test_hourly_team_score_it 
apache_beam/ml/gcp/videointelligenceml_test_it.py::VideoIntelligenceMlTestIT::test_label_detection_with_video_context 
[gw1] SKIPPED apache_beam/ml/gcp/videointelligenceml_test_it.py::VideoIntelligenceMlTestIT::test_label_detection_with_video_context 
[gw0] PASSED apache_beam/io/gcp/bigquery_read_it_test.py::ReadUsingStorageApiTests::test_iobase_source_with_row_restriction 
apache_beam/io/gcp/bigquery_read_it_test.py::ReadUsingStorageApiTests::test_iobase_source_with_very_selective_filters 
[gw0] PASSED apache_beam/io/gcp/bigquery_read_it_test.py::ReadUsingStorageApiTests::test_iobase_source_with_very_selective_filters 
apache_beam/io/gcp/bigquery_read_it_test.py::ReadNewTypesTests::test_iobase_source 
[gw0] PASSED apache_beam/io/gcp/bigquery_read_it_test.py::ReadNewTypesTests::test_iobase_source 
apache_beam/io/gcp/bigquery_read_it_test.py::ReadNewTypesTests::test_native_source 
[gw7] PASSED apache_beam/io/gcp/datastore/v1new/datastore_write_it_test.py::DatastoreWriteIT::test_datastore_write_limit 
apache_beam/transforms/external_it_test.py::ExternalTransformIT::test_job_python_from_python_it 
[gw0] PASSED apache_beam/io/gcp/bigquery_read_it_test.py::ReadNewTypesTests::test_native_source 
apache_beam/io/gcp/bigquery_read_it_test.py::ReadAllBQTests::test_read_queries 
[gw7] PASSED apache_beam/transforms/external_it_test.py::ExternalTransformIT::test_job_python_from_python_it 
[gw0] PASSED apache_beam/io/gcp/bigquery_read_it_test.py::ReadAllBQTests::test_read_queries 
apache_beam/io/gcp/bigquery_read_it_test.py::ReadInteractiveRunnerTests::test_read_in_interactive_runner 
[gw0] PASSED apache_beam/io/gcp/bigquery_read_it_test.py::ReadInteractiveRunnerTests::test_read_in_interactive_runner 

=============================== warnings summary ===============================
apache_beam/io/gcp/bigquery.py:2603
  <https://ci-beam.apache.org/job/beam_PostCommit_Python311/ws/src/sdks/python/apache_beam/io/gcp/bigquery.py>:2603: DeprecationWarning: invalid escape sequence '\#'
    """Read data from BigQuery.

apache_beam/io/gcp/bigquery_read_it_test.py::ReadTests::test_native_source
  <https://ci-beam.apache.org/job/beam_PostCommit_Python311/ws/src/sdks/python/apache_beam/io/gcp/bigquery_read_it_test.py>:170: BeamDeprecationWarning: BigQuerySource is deprecated since 2.25.0. Use ReadFromBigQuery instead.
    beam.io.BigQuerySource(query=self.query, use_standard_sql=True)))

apache_beam/io/gcp/bigquery_test.py::PubSubBigQueryIT::test_file_loads
apache_beam/io/gcp/bigquery_test.py::PubSubBigQueryIT::test_streaming_inserts
apache_beam/examples/complete/game/leader_board_it_test.py::LeaderBoardIT::test_leader_board_it
apache_beam/examples/complete/game/game_stats_it_test.py::GameStatsIT::test_game_stats_it
apache_beam/examples/complete/game/hourly_team_score_it_test.py::HourlyTeamScoreIT::test_hourly_team_score_it
  <https://ci-beam.apache.org/job/beam_PostCommit_Python311/ws/src/sdks/python/apache_beam/io/gcp/tests/utils.py>:63: PendingDeprecationWarning: Client.dataset is deprecated and will be removed in a future version. Use a string like 'my_project.my_dataset' or a cloud.google.bigquery.DatasetReference object, instead.
    dataset_ref = client.dataset(unique_dataset_name, project=project)

apache_beam/examples/cookbook/bigquery_tornadoes_it_test.py::BigqueryTornadoesIT::test_bigquery_tornadoes_it
  <https://ci-beam.apache.org/job/beam_PostCommit_Python311/ws/src/sdks/python/apache_beam/io/gcp/tests/utils.py>:100: PendingDeprecationWarning: Client.dataset is deprecated and will be removed in a future version. Use a string like 'my_project.my_dataset' or a cloud.google.bigquery.DatasetReference object, instead.
    table_ref = client.dataset(dataset_id).table(table_id)

apache_beam/examples/dataframe/flight_delays_it_test.py::FlightDelaysTest::test_flight_delays
  <https://ci-beam.apache.org/job/beam_PostCommit_Python311/ws/src/sdks/python/apache_beam/examples/dataframe/flight_delays.py>:47: FutureWarning: The default value of numeric_only in DataFrame.mean is deprecated. In a future version, it will default to False. In addition, specifying 'numeric_only=None' is deprecated. Select only valid columns or specify the value of numeric_only to silence this warning.
    return airline_df[at_top_airports].mean()

apache_beam/io/gcp/bigquery_read_it_test.py::ReadNewTypesTests::test_native_source
  <https://ci-beam.apache.org/job/beam_PostCommit_Python311/ws/src/sdks/python/apache_beam/io/gcp/bigquery_read_it_test.py>:706: BeamDeprecationWarning: BigQuerySource is deprecated since 2.25.0. Use ReadFromBigQuery instead.
    beam.io.BigQuerySource(query=self.query, use_standard_sql=True)))

-- Docs: https://docs.pytest.org/en/stable/how-to/capture-warnings.html
- generated xml file: <https://ci-beam.apache.org/job/beam_PostCommit_Python311/ws/src/sdks/python/pytest_postCommitIT-df-py311.xml> -
=========== 82 passed, 50 skipped, 10 warnings in 6105.54s (1:41:45) ===========

FAILURE: Build failed with an exception.

* Where:
Script '<https://ci-beam.apache.org/job/beam_PostCommit_Python311/ws/src/sdks/python/test-suites/portable/common.gradle'> line: 326

* What went wrong:
Execution failed for task ':sdks:python:test-suites:portable:py311:postCommitPy311IT'.
> Process 'command 'sh'' finished with non-zero exit value 1

* Try:
> Run with --stacktrace option to get the stack trace.
> Run with --info or --debug option to get more log output.
> Get more help at https://help.gradle.org.

Deprecated Gradle features were used in this build, making it incompatible with Gradle 9.0.

You can use '--warning-mode all' to show the individual deprecation warnings and determine if they come from your own scripts or plugins.

For more on this, please refer to https://docs.gradle.org/8.4/userguide/command_line_interface.html#sec:command_line_warnings in the Gradle documentation.

BUILD FAILED in 1h 49m 5s
217 actionable tasks: 158 executed, 55 from cache, 4 up-to-date

Publishing build scan...
https://ge.apache.org/s/hurqf34onuq7e

Build step 'Invoke Gradle script' changed build result to FAILURE
Build step 'Invoke Gradle script' marked build as failure

---------------------------------------------------------------------
To unsubscribe, e-mail: builds-unsubscribe@beam.apache.org
For additional commands, e-mail: builds-help@beam.apache.org


Build failed in Jenkins: beam_PostCommit_Python311 #997

Posted by Apache Jenkins Server <je...@builds.apache.org>.
See <https://ci-beam.apache.org/job/beam_PostCommit_Python311/997/display/redirect>

Changes:


------------------------------------------
[...truncated 13.12 MB...]
  File "<https://ci-beam.apache.org/job/beam_PostCommit_Python311/ws/src/build/gradleenv/-1720702906/lib/python3.11/site-packages/grpc/_channel.py",> line 966, in _next
ERROR:apache_beam.runners.worker.data_plane:Failed to read inputs in the data plane.
Traceback (most recent call last):
  File "<https://ci-beam.apache.org/job/beam_PostCommit_Python311/ws/src/sdks/python/apache_beam/runners/worker/data_plane.py",> line 669, in _read_inputs
    for elements in elements_iterator:
  File "<https://ci-beam.apache.org/job/beam_PostCommit_Python311/ws/src/build/gradleenv/-1720702906/lib/python3.11/site-packages/grpc/_channel.py",> line 540, in __next__
    return self._next()
           ^^^^^^^^^^^^
  File "<https://ci-beam.apache.org/job/beam_PostCommit_Python311/ws/src/build/gradleenv/-1720702906/lib/python3.11/site-packages/grpc/_channel.py",> line 966, in _next
    raise self
grpc._channel._MultiThreadedRendezvous: <_MultiThreadedRendezvous of RPC that terminated with:
	status = StatusCode.UNAVAILABLE
	details = "recvmsg:Connection reset by peer"
	debug_error_string = "UNKNOWN:Error received from peer ipv6:%5B::1%5D:35387 {created_time:"2023-12-13T11:14:25.172877203+00:00", grpc_status:14, grpc_message:"recvmsg:Connection reset by peer"}"
>
Exception in thread read_grpc_client_inputs:
Traceback (most recent call last):
  File "/usr/lib/python3.11/threading.py", line 1038, in _bootstrap_inner
    self.run()
    raise self
    self._target(*self._args, **self._kwargs)
  File "/usr/lib/python3.11/threading.py", line 975, in run
  File "<https://ci-beam.apache.org/job/beam_PostCommit_Python311/ws/src/sdks/python/apache_beam/runners/worker/sdk_worker.py",> line 1042, in pull_responses
grpc._channel._MultiThreadedRendezvous: <_MultiThreadedRendezvous of RPC that terminated with:
	status = StatusCode.UNAVAILABLE
	details = "recvmsg:Connection reset by peer"
	debug_error_string = "UNKNOWN:Error received from peer ipv6:%5B::1%5D:40745 {grpc_message:"recvmsg:Connection reset by peer", grpc_status:14, created_time:"2023-12-13T11:14:25.172899685+00:00"}"
>
    self._target(*self._args, **self._kwargs)
    for response in responses:
  File "<https://ci-beam.apache.org/job/beam_PostCommit_Python311/ws/src/sdks/python/apache_beam/runners/worker/data_plane.py",> line 686, in <lambda>
  File "<https://ci-beam.apache.org/job/beam_PostCommit_Python311/ws/src/build/gradleenv/-1720702906/lib/python3.11/site-packages/grpc/_channel.py",> line 540, in __next__
    target=lambda: self._read_inputs(elements_iterator),
                   ^^^^^^^^^^^^^^^^^^^^^^^^^^^^^^^^^^^^
    return self._next()
  File "<https://ci-beam.apache.org/job/beam_PostCommit_Python311/ws/src/sdks/python/apache_beam/runners/worker/data_plane.py",> line 669, in _read_inputs
           ^^^^^^^^^^^^
  File "<https://ci-beam.apache.org/job/beam_PostCommit_Python311/ws/src/build/gradleenv/-1720702906/lib/python3.11/site-packages/grpc/_channel.py",> line 966, in _next
    raise self
grpc._channel._MultiThreadedRendezvous: <_MultiThreadedRendezvous of RPC that terminated with:
	status = StatusCode.UNAVAILABLE
	details = "Socket closed"
	debug_error_string = "UNKNOWN:Error received from peer ipv6:%5B::1%5D:35417 {grpc_message:"Socket closed", grpc_status:14, created_time:"2023-12-13T11:14:25.172868442+00:00"}"
>
    for elements in elements_iterator:
  File "<https://ci-beam.apache.org/job/beam_PostCommit_Python311/ws/src/build/gradleenv/-1720702906/lib/python3.11/site-packages/grpc/_channel.py",> line 540, in __next__
    return self._next()
           ^^^^^^^^^^^^
  File "<https://ci-beam.apache.org/job/beam_PostCommit_Python311/ws/src/build/gradleenv/-1720702906/lib/python3.11/site-packages/grpc/_channel.py",> line 966, in _next
    raise self
grpc._channel._MultiThreadedRendezvous: <_MultiThreadedRendezvous of RPC that terminated with:
	status = StatusCode.UNAVAILABLE
	details = "recvmsg:Connection reset by peer"
	debug_error_string = "UNKNOWN:Error received from peer ipv6:%5B::1%5D:35387 {created_time:"2023-12-13T11:14:25.172877203+00:00", grpc_status:14, grpc_message:"recvmsg:Connection reset by peer"}"
>

> Task :sdks:python:test-suites:dataflow:py311:postCommitIT

[gw1] PASSED apache_beam/io/gcp/bigquery_io_read_it_test.py::BigqueryIOReadIT::test_bigquery_read_1M_python 
apache_beam/io/gcp/bigquery_io_read_it_test.py::BigqueryIOReadIT::test_bigquery_read_custom_1M_python 
[gw3] PASSED apache_beam/dataframe/io_it_test.py::ReadUsingReadGbqTests::test_ReadGbq_export_with_project 
apache_beam/dataframe/io_it_test.py::ReadUsingReadGbqTests::test_ReadGbq_with_computation 
[gw4] PASSED apache_beam/io/gcp/bigquery_write_it_test.py::BigQueryWriteIntegrationTests::test_big_query_write_new_types 
apache_beam/io/gcp/bigquery_write_it_test.py::BigQueryWriteIntegrationTests::test_big_query_write_schema_autodetect 
[gw4] SKIPPED apache_beam/io/gcp/bigquery_write_it_test.py::BigQueryWriteIntegrationTests::test_big_query_write_schema_autodetect 
apache_beam/io/gcp/bigquery_write_it_test.py::BigQueryWriteIntegrationTests::test_big_query_write_without_schema 
[gw0] PASSED apache_beam/io/gcp/bigquery_read_it_test.py::ReadTests::test_table_schema_retrieve_specifying_only_table 
apache_beam/io/gcp/bigquery_read_it_test.py::ReadTests::test_table_schema_retrieve_with_direct_read 
[gw6] PASSED apache_beam/io/gcp/big_query_query_to_table_it_test.py::BigQueryQueryToTableIT::test_big_query_standard_sql 
apache_beam/examples/dataframe/taxiride_it_test.py::TaxirideIT::test_aggregation 
[gw2] PASSED apache_beam/ml/inference/sklearn_inference_it_test.py::SklearnInference::test_sklearn_mnist_classification_large_model 
apache_beam/ml/inference/sklearn_inference_it_test.py::SklearnInference::test_sklearn_regression 
[gw2] SKIPPED apache_beam/ml/inference/sklearn_inference_it_test.py::SklearnInference::test_sklearn_regression 
apache_beam/io/gcp/healthcare/dicomio_integration_test.py::DICOMIoIntegrationTest::test_dicom_search_instances 
[gw1] PASSED apache_beam/io/gcp/bigquery_io_read_it_test.py::BigqueryIOReadIT::test_bigquery_read_custom_1M_python 
apache_beam/io/gcp/gcsio_integration_test.py::GcsIOIntegrationTest::test_batch_copy_and_delete 
[gw1] PASSED apache_beam/io/gcp/gcsio_integration_test.py::GcsIOIntegrationTest::test_batch_copy_and_delete 
apache_beam/io/gcp/gcsio_integration_test.py::GcsIOIntegrationTest::test_copy 
[gw1] PASSED apache_beam/io/gcp/gcsio_integration_test.py::GcsIOIntegrationTest::test_copy 
apache_beam/examples/streaming_wordcount_it_test.py::StreamingWordCountIT::test_streaming_wordcount_it 
[gw3] PASSED apache_beam/dataframe/io_it_test.py::ReadUsingReadGbqTests::test_ReadGbq_with_computation 
apache_beam/io/gcp/pubsub_integration_test.py::PubSubIntegrationTest::test_streaming_data_only 
[gw5] PASSED apache_beam/io/gcp/bigquery_json_it_test.py::BigQueryJsonIT::test_streaming_inserts 
apache_beam/examples/wordcount_it_test.py::WordCountIT::test_wordcount_impersonation_it 
[gw4] PASSED apache_beam/io/gcp/bigquery_write_it_test.py::BigQueryWriteIntegrationTests::test_big_query_write_without_schema 
apache_beam/ml/gcp/cloud_dlp_it_test.py::CloudDLPIT::test_deidentification 
[gw0] PASSED apache_beam/io/gcp/bigquery_read_it_test.py::ReadTests::test_table_schema_retrieve_with_direct_read 
apache_beam/io/gcp/bigquery_read_it_test.py::ReadUsingStorageApiTests::test_iobase_source 
[gw7] PASSED apache_beam/io/gcp/bigquery_test.py::PubSubBigQueryIT::test_file_loads 
apache_beam/io/gcp/bigquery_test.py::PubSubBigQueryIT::test_streaming_inserts 
[gw2] PASSED apache_beam/io/gcp/healthcare/dicomio_integration_test.py::DICOMIoIntegrationTest::test_dicom_search_instances 
apache_beam/io/gcp/healthcare/dicomio_integration_test.py::DICOMIoIntegrationTest::test_dicom_store_instance_from_gcs 
[gw6] PASSED apache_beam/examples/dataframe/taxiride_it_test.py::TaxirideIT::test_aggregation 
apache_beam/examples/dataframe/taxiride_it_test.py::TaxirideIT::test_enrich 
[gw4] PASSED apache_beam/ml/gcp/cloud_dlp_it_test.py::CloudDLPIT::test_deidentification 
apache_beam/ml/gcp/cloud_dlp_it_test.py::CloudDLPIT::test_inspection 
[gw5] PASSED apache_beam/examples/wordcount_it_test.py::WordCountIT::test_wordcount_impersonation_it 
apache_beam/examples/wordcount_it_test.py::WordCountIT::test_wordcount_it 
[gw0] PASSED apache_beam/io/gcp/bigquery_read_it_test.py::ReadUsingStorageApiTests::test_iobase_source 
apache_beam/io/gcp/bigquery_read_it_test.py::ReadUsingStorageApiTests::test_iobase_source_with_column_selection 
[gw2] PASSED apache_beam/io/gcp/healthcare/dicomio_integration_test.py::DICOMIoIntegrationTest::test_dicom_store_instance_from_gcs 
apache_beam/examples/streaming_wordcount_debugging_it_test.py::StreamingWordcountDebuggingIT::test_streaming_wordcount_debugging_it 
[gw2] SKIPPED apache_beam/examples/streaming_wordcount_debugging_it_test.py::StreamingWordcountDebuggingIT::test_streaming_wordcount_debugging_it 
apache_beam/examples/cookbook/bigquery_tornadoes_it_test.py::BigqueryTornadoesIT::test_bigquery_tornadoes_it 
[gw4] PASSED apache_beam/ml/gcp/cloud_dlp_it_test.py::CloudDLPIT::test_inspection 
apache_beam/examples/complete/game/user_score_it_test.py::UserScoreIT::test_user_score_it 
[gw3] PASSED apache_beam/io/gcp/pubsub_integration_test.py::PubSubIntegrationTest::test_streaming_data_only 
apache_beam/io/gcp/pubsub_integration_test.py::PubSubIntegrationTest::test_streaming_with_attributes 
[gw0] PASSED apache_beam/io/gcp/bigquery_read_it_test.py::ReadUsingStorageApiTests::test_iobase_source_with_column_selection 
apache_beam/io/gcp/bigquery_read_it_test.py::ReadUsingStorageApiTests::test_iobase_source_with_column_selection_and_row_restriction 
[gw5] PASSED apache_beam/examples/wordcount_it_test.py::WordCountIT::test_wordcount_it 
apache_beam/examples/complete/game/leader_board_it_test.py::LeaderBoardIT::test_leader_board_it 
[gw1] PASSED apache_beam/examples/streaming_wordcount_it_test.py::StreamingWordCountIT::test_streaming_wordcount_it 
apache_beam/examples/complete/autocomplete_test.py::AutocompleteTest::test_autocomplete_it 
[gw2] PASSED apache_beam/examples/cookbook/bigquery_tornadoes_it_test.py::BigqueryTornadoesIT::test_bigquery_tornadoes_it 
apache_beam/io/fileio_test.py::MatchIntegrationTest::test_transform_on_gcs 
[gw0] PASSED apache_beam/io/gcp/bigquery_read_it_test.py::ReadUsingStorageApiTests::test_iobase_source_with_column_selection_and_row_restriction 
apache_beam/io/gcp/bigquery_read_it_test.py::ReadUsingStorageApiTests::test_iobase_source_with_column_selection_and_row_restriction_rows 
[gw1] PASSED apache_beam/examples/complete/autocomplete_test.py::AutocompleteTest::test_autocomplete_it 
apache_beam/examples/complete/game/game_stats_it_test.py::GameStatsIT::test_game_stats_it 
[gw2] PASSED apache_beam/io/fileio_test.py::MatchIntegrationTest::test_transform_on_gcs 
apache_beam/io/parquetio_it_test.py::TestParquetIT::test_parquetio_it 
[gw7] PASSED apache_beam/io/gcp/bigquery_test.py::PubSubBigQueryIT::test_streaming_inserts 
apache_beam/io/gcp/bigquery_test.py::BigQueryFileLoadsIntegrationTests::test_avro_file_load 
[gw0] PASSED apache_beam/io/gcp/bigquery_read_it_test.py::ReadUsingStorageApiTests::test_iobase_source_with_column_selection_and_row_restriction_rows 
apache_beam/io/gcp/bigquery_read_it_test.py::ReadUsingStorageApiTests::test_iobase_source_with_native_datetime 
[gw4] PASSED apache_beam/examples/complete/game/user_score_it_test.py::UserScoreIT::test_user_score_it 
apache_beam/examples/dataframe/flight_delays_it_test.py::FlightDelaysTest::test_flight_delays 
[gw3] PASSED apache_beam/io/gcp/pubsub_integration_test.py::PubSubIntegrationTest::test_streaming_with_attributes 
apache_beam/examples/complete/game/hourly_team_score_it_test.py::HourlyTeamScoreIT::test_hourly_team_score_it 
[gw2] PASSED apache_beam/io/parquetio_it_test.py::TestParquetIT::test_parquetio_it 
apache_beam/ml/inference/base_test.py::RunInferenceBaseTest::test_run_inference_with_side_inputin_streaming 
[gw2] SKIPPED apache_beam/ml/inference/base_test.py::RunInferenceBaseTest::test_run_inference_with_side_inputin_streaming 
apache_beam/runners/dataflow/dataflow_exercise_metrics_pipeline_test.py::ExerciseMetricsPipelineTest::test_metrics_it 
[gw2] SKIPPED apache_beam/runners/dataflow/dataflow_exercise_metrics_pipeline_test.py::ExerciseMetricsPipelineTest::test_metrics_it 
[gw6] PASSED apache_beam/examples/dataframe/taxiride_it_test.py::TaxirideIT::test_enrich 
apache_beam/examples/fastavro_it_test.py::FastavroIT::test_avro_it 
[gw7] PASSED apache_beam/io/gcp/bigquery_test.py::BigQueryFileLoadsIntegrationTests::test_avro_file_load 
apache_beam/examples/complete/juliaset/juliaset/juliaset_test_it.py::JuliaSetTestIT::test_run_example_with_setup_file 
[gw5] PASSED apache_beam/examples/complete/game/leader_board_it_test.py::LeaderBoardIT::test_leader_board_it 
apache_beam/examples/inference/tfx_bsl/tfx_bsl_inference_it_test.py::TFXRunInferenceTests::test_tfx_run_inference_mobilenetv2 
[gw5] SKIPPED apache_beam/examples/inference/tfx_bsl/tfx_bsl_inference_it_test.py::TFXRunInferenceTests::test_tfx_run_inference_mobilenetv2 
apache_beam/ml/gcp/videointelligenceml_test_it.py::VideoIntelligenceMlTestIT::test_label_detection_with_video_context 
[gw5] SKIPPED apache_beam/ml/gcp/videointelligenceml_test_it.py::VideoIntelligenceMlTestIT::test_label_detection_with_video_context <https://ci-beam.apache.org/job/beam_PostCommit_Python311/ws/src/build/gradleenv/2050596099/bin/python3.11>: No module named build
warning: sdist: standard file not found: should have one of README, README.rst, README.txt, README.md

warning: check: missing required meta-data: url

warning: check: missing meta-data: either (author and author_email) or (maintainer and maintainer_email) should be supplied


[gw0] PASSED apache_beam/io/gcp/bigquery_read_it_test.py::ReadUsingStorageApiTests::test_iobase_source_with_native_datetime 
apache_beam/io/gcp/bigquery_read_it_test.py::ReadUsingStorageApiTests::test_iobase_source_with_query 
[gw4] PASSED apache_beam/examples/dataframe/flight_delays_it_test.py::FlightDelaysTest::test_flight_delays 
apache_beam/io/gcp/datastore/v1new/datastore_write_it_test.py::DatastoreWriteIT::test_datastore_write_limit 
[gw7] PASSED apache_beam/examples/complete/juliaset/juliaset/juliaset_test_it.py::JuliaSetTestIT::test_run_example_with_setup_file 
apache_beam/transforms/external_it_test.py::ExternalTransformIT::test_job_python_from_python_it 
[gw0] PASSED apache_beam/io/gcp/bigquery_read_it_test.py::ReadUsingStorageApiTests::test_iobase_source_with_query 
apache_beam/io/gcp/bigquery_read_it_test.py::ReadUsingStorageApiTests::test_iobase_source_with_query_and_filters 
[gw1] PASSED apache_beam/examples/complete/game/game_stats_it_test.py::GameStatsIT::test_game_stats_it 
apache_beam/ml/gcp/visionml_test_it.py::VisionMlTestIT::test_text_detection_with_language_hint 
[gw3] PASSED apache_beam/examples/complete/game/hourly_team_score_it_test.py::HourlyTeamScoreIT::test_hourly_team_score_it 
apache_beam/ml/gcp/naturallanguageml_test_it.py::NaturalLanguageMlTestIT::test_analyzing_syntax 
[gw3] SKIPPED apache_beam/ml/gcp/naturallanguageml_test_it.py::NaturalLanguageMlTestIT::test_analyzing_syntax 
[gw6] PASSED apache_beam/examples/fastavro_it_test.py::FastavroIT::test_avro_it 
apache_beam/examples/cookbook/datastore_wordcount_it_test.py::DatastoreWordCountIT::test_datastore_wordcount_it 
[gw7] PASSED apache_beam/transforms/external_it_test.py::ExternalTransformIT::test_job_python_from_python_it 
[gw1] PASSED apache_beam/ml/gcp/visionml_test_it.py::VisionMlTestIT::test_text_detection_with_language_hint 
apache_beam/ml/inference/onnx_inference_it_test.py::OnnxInference::test_onnx_run_inference_roberta_sentiment_classification 
[gw1] SKIPPED apache_beam/ml/inference/onnx_inference_it_test.py::OnnxInference::test_onnx_run_inference_roberta_sentiment_classification 
[gw0] PASSED apache_beam/io/gcp/bigquery_read_it_test.py::ReadUsingStorageApiTests::test_iobase_source_with_query_and_filters 
apache_beam/io/gcp/bigquery_read_it_test.py::ReadUsingStorageApiTests::test_iobase_source_with_row_restriction 
[gw6] PASSED apache_beam/examples/cookbook/datastore_wordcount_it_test.py::DatastoreWordCountIT::test_datastore_wordcount_it 
[gw0] PASSED apache_beam/io/gcp/bigquery_read_it_test.py::ReadUsingStorageApiTests::test_iobase_source_with_row_restriction 
apache_beam/io/gcp/bigquery_read_it_test.py::ReadUsingStorageApiTests::test_iobase_source_with_very_selective_filters 
[gw0] PASSED apache_beam/io/gcp/bigquery_read_it_test.py::ReadUsingStorageApiTests::test_iobase_source_with_very_selective_filters 
apache_beam/io/gcp/bigquery_read_it_test.py::ReadNewTypesTests::test_iobase_source 
[gw0] PASSED apache_beam/io/gcp/bigquery_read_it_test.py::ReadNewTypesTests::test_iobase_source 
apache_beam/io/gcp/bigquery_read_it_test.py::ReadNewTypesTests::test_native_source 
[gw4] PASSED apache_beam/io/gcp/datastore/v1new/datastore_write_it_test.py::DatastoreWriteIT::test_datastore_write_limit 
apache_beam/transforms/periodicsequence_it_test.py::PeriodicSequenceIT::test_periodicsequence_outputs_valid_watermarks_it 
[gw4] SKIPPED apache_beam/transforms/periodicsequence_it_test.py::PeriodicSequenceIT::test_periodicsequence_outputs_valid_watermarks_it 
[gw0] PASSED apache_beam/io/gcp/bigquery_read_it_test.py::ReadNewTypesTests::test_native_source 
apache_beam/io/gcp/bigquery_read_it_test.py::ReadAllBQTests::test_read_queries 
[gw0] PASSED apache_beam/io/gcp/bigquery_read_it_test.py::ReadAllBQTests::test_read_queries 
apache_beam/io/gcp/bigquery_read_it_test.py::ReadInteractiveRunnerTests::test_read_in_interactive_runner 
[gw0] PASSED apache_beam/io/gcp/bigquery_read_it_test.py::ReadInteractiveRunnerTests::test_read_in_interactive_runner 

=============================== warnings summary ===============================
apache_beam/io/gcp/bigquery.py:2603
  <https://ci-beam.apache.org/job/beam_PostCommit_Python311/ws/src/sdks/python/apache_beam/io/gcp/bigquery.py>:2603: DeprecationWarning: invalid escape sequence '\#'
    """Read data from BigQuery.

apache_beam/io/gcp/bigquery_read_it_test.py::ReadTests::test_native_source
  <https://ci-beam.apache.org/job/beam_PostCommit_Python311/ws/src/sdks/python/apache_beam/io/gcp/bigquery_read_it_test.py>:170: BeamDeprecationWarning: BigQuerySource is deprecated since 2.25.0. Use ReadFromBigQuery instead.
    beam.io.BigQuerySource(query=self.query, use_standard_sql=True)))

apache_beam/io/gcp/bigquery_test.py::PubSubBigQueryIT::test_file_loads
apache_beam/io/gcp/bigquery_test.py::PubSubBigQueryIT::test_streaming_inserts
apache_beam/examples/complete/game/leader_board_it_test.py::LeaderBoardIT::test_leader_board_it
apache_beam/examples/complete/game/game_stats_it_test.py::GameStatsIT::test_game_stats_it
apache_beam/examples/complete/game/hourly_team_score_it_test.py::HourlyTeamScoreIT::test_hourly_team_score_it
  <https://ci-beam.apache.org/job/beam_PostCommit_Python311/ws/src/sdks/python/apache_beam/io/gcp/tests/utils.py>:63: PendingDeprecationWarning: Client.dataset is deprecated and will be removed in a future version. Use a string like 'my_project.my_dataset' or a cloud.google.bigquery.DatasetReference object, instead.
    dataset_ref = client.dataset(unique_dataset_name, project=project)

apache_beam/examples/cookbook/bigquery_tornadoes_it_test.py::BigqueryTornadoesIT::test_bigquery_tornadoes_it
  <https://ci-beam.apache.org/job/beam_PostCommit_Python311/ws/src/sdks/python/apache_beam/io/gcp/tests/utils.py>:100: PendingDeprecationWarning: Client.dataset is deprecated and will be removed in a future version. Use a string like 'my_project.my_dataset' or a cloud.google.bigquery.DatasetReference object, instead.
    table_ref = client.dataset(dataset_id).table(table_id)

apache_beam/examples/dataframe/flight_delays_it_test.py::FlightDelaysTest::test_flight_delays
  <https://ci-beam.apache.org/job/beam_PostCommit_Python311/ws/src/sdks/python/apache_beam/examples/dataframe/flight_delays.py>:47: FutureWarning: The default value of numeric_only in DataFrame.mean is deprecated. In a future version, it will default to False. In addition, specifying 'numeric_only=None' is deprecated. Select only valid columns or specify the value of numeric_only to silence this warning.
    return airline_df[at_top_airports].mean()

apache_beam/io/gcp/bigquery_read_it_test.py::ReadNewTypesTests::test_native_source
  <https://ci-beam.apache.org/job/beam_PostCommit_Python311/ws/src/sdks/python/apache_beam/io/gcp/bigquery_read_it_test.py>:706: BeamDeprecationWarning: BigQuerySource is deprecated since 2.25.0. Use ReadFromBigQuery instead.
    beam.io.BigQuerySource(query=self.query, use_standard_sql=True)))

-- Docs: https://docs.pytest.org/en/stable/how-to/capture-warnings.html
- generated xml file: <https://ci-beam.apache.org/job/beam_PostCommit_Python311/ws/src/sdks/python/pytest_postCommitIT-df-py311.xml> -
=========== 82 passed, 50 skipped, 10 warnings in 5970.00s (1:39:29) ===========

FAILURE: Build failed with an exception.

* Where:
Script '<https://ci-beam.apache.org/job/beam_PostCommit_Python311/ws/src/sdks/python/test-suites/portable/common.gradle'> line: 326

* What went wrong:
Execution failed for task ':sdks:python:test-suites:portable:py311:postCommitPy311IT'.
> Process 'command 'sh'' finished with non-zero exit value 1

* Try:
> Run with --stacktrace option to get the stack trace.
> Run with --info or --debug option to get more log output.
> Get more help at https://help.gradle.org.

Deprecated Gradle features were used in this build, making it incompatible with Gradle 9.0.

You can use '--warning-mode all' to show the individual deprecation warnings and determine if they come from your own scripts or plugins.

For more on this, please refer to https://docs.gradle.org/8.4/userguide/command_line_interface.html#sec:command_line_warnings in the Gradle documentation.

BUILD FAILED in 1h 45m 18s
217 actionable tasks: 152 executed, 61 from cache, 4 up-to-date

Publishing build scan...
https://ge.apache.org/s/knsei3qe5umf4

Build step 'Invoke Gradle script' changed build result to FAILURE
Build step 'Invoke Gradle script' marked build as failure

---------------------------------------------------------------------
To unsubscribe, e-mail: builds-unsubscribe@beam.apache.org
For additional commands, e-mail: builds-help@beam.apache.org


Build failed in Jenkins: beam_PostCommit_Python311 #996

Posted by Apache Jenkins Server <je...@builds.apache.org>.
See <https://ci-beam.apache.org/job/beam_PostCommit_Python311/996/display/redirect>

Changes:


------------------------------------------
[...truncated 13.01 MB...]
  File "<https://ci-beam.apache.org/job/beam_PostCommit_Python311/ws/src/build/gradleenv/-1720702906/lib/python3.11/site-packages/grpc/_channel.py",> line 966, in _next
    raise self
grpc._channel._MultiThreadedRendezvous: <_MultiThreadedRendezvous of RPC that terminated with:
	status = StatusCode.UNAVAILABLE
	details = "Socket closed"
	debug_error_string = "UNKNOWN:Error received from peer ipv6:%5B::1%5D:44319 {created_time:"2023-12-13T05:13:15.613234658+00:00", grpc_status:14, grpc_message:"Socket closed"}"
>
  File "/usr/lib/python3.11/threading.py", line 975, in run
Exception in thread read_grpc_client_inputs:
    self._target(*self._args, **self._kwargs)
Traceback (most recent call last):
  File "<https://ci-beam.apache.org/job/beam_PostCommit_Python311/ws/src/sdks/python/apache_beam/runners/worker/sdk_worker.py",> line 1042, in pull_responses
  File "/usr/lib/python3.11/threading.py", line 1038, in _bootstrap_inner
    self._target(*self._args, **self._kwargs)
    for response in responses:
  File "<https://ci-beam.apache.org/job/beam_PostCommit_Python311/ws/src/build/gradleenv/-1720702906/lib/python3.11/site-packages/grpc/_channel.py",> line 540, in __next__
  File "<https://ci-beam.apache.org/job/beam_PostCommit_Python311/ws/src/sdks/python/apache_beam/runners/worker/sdk_worker.py",> line 265, in run
    self.run()
    return self._next()
  File "/usr/lib/python3.11/threading.py", line 975, in run
    for work_request in self._control_stub.Control(get_responses()):
           ^^^^^^^^^^^^
  File "<https://ci-beam.apache.org/job/beam_PostCommit_Python311/ws/src/build/gradleenv/-1720702906/lib/python3.11/site-packages/grpc/_channel.py",> line 966, in _next
  File "<https://ci-beam.apache.org/job/beam_PostCommit_Python311/ws/src/build/gradleenv/-1720702906/lib/python3.11/site-packages/grpc/_channel.py",> line 540, in __next__
    self._target(*self._args, **self._kwargs)
    raise self
  File "<https://ci-beam.apache.org/job/beam_PostCommit_Python311/ws/src/sdks/python/apache_beam/runners/worker/data_plane.py",> line 686, in <lambda>
grpc._channel._MultiThreadedRendezvous: <_MultiThreadedRendezvous of RPC that terminated with:
	status = StatusCode.UNAVAILABLE
	details = "Socket closed"
	debug_error_string = "UNKNOWN:Error received from peer ipv6:%5B::1%5D:43387 {created_time:"2023-12-13T05:13:15.613249982+00:00", grpc_status:14, grpc_message:"Socket closed"}"
>
    return self._next()
           ^^^^^^^^^^^^
    target=lambda: self._read_inputs(elements_iterator),
  File "<https://ci-beam.apache.org/job/beam_PostCommit_Python311/ws/src/build/gradleenv/-1720702906/lib/python3.11/site-packages/grpc/_channel.py",> line 966, in _next
                   ^^^^^^^^^^^^^^^^^^^^^^^^^^^^^^^^^^^^
  File "<https://ci-beam.apache.org/job/beam_PostCommit_Python311/ws/src/sdks/python/apache_beam/runners/worker/data_plane.py",> line 669, in _read_inputs
    for elements in elements_iterator:
    raise self
grpc._channel._MultiThreadedRendezvous: <_MultiThreadedRendezvous of RPC that terminated with:
	status = StatusCode.UNAVAILABLE
	details = "Socket closed"
	debug_error_string = "UNKNOWN:Error received from peer ipv6:%5B::1%5D:34755 {grpc_message:"Socket closed", grpc_status:14, created_time:"2023-12-13T05:13:15.613247166+00:00"}"
>
  File "<https://ci-beam.apache.org/job/beam_PostCommit_Python311/ws/src/build/gradleenv/-1720702906/lib/python3.11/site-packages/grpc/_channel.py",> line 540, in __next__
    return self._next()
           ^^^^^^^^^^^^
  File "<https://ci-beam.apache.org/job/beam_PostCommit_Python311/ws/src/build/gradleenv/-1720702906/lib/python3.11/site-packages/grpc/_channel.py",> line 966, in _next
    raise self
grpc._channel._MultiThreadedRendezvous: <_MultiThreadedRendezvous of RPC that terminated with:
	status = StatusCode.UNAVAILABLE
	details = "Socket closed"
	debug_error_string = "UNKNOWN:Error received from peer ipv6:%5B::1%5D:44319 {created_time:"2023-12-13T05:13:15.613234658+00:00", grpc_status:14, grpc_message:"Socket closed"}"
>

> Task :sdks:python:test-suites:dataflow:py311:postCommitIT

[gw2] PASSED apache_beam/io/gcp/big_query_query_to_table_it_test.py::BigQueryQueryToTableIT::test_big_query_new_types_avro 
apache_beam/io/gcp/big_query_query_to_table_it_test.py::BigQueryQueryToTableIT::test_big_query_standard_sql 
[gw4] PASSED apache_beam/ml/inference/sklearn_inference_it_test.py::SklearnInference::test_sklearn_mnist_classification 
apache_beam/ml/inference/sklearn_inference_it_test.py::SklearnInference::test_sklearn_mnist_classification_large_model 
[gw1] PASSED apache_beam/dataframe/io_it_test.py::ReadUsingReadGbqTests::test_ReadGbq_export_with_project 
apache_beam/dataframe/io_it_test.py::ReadUsingReadGbqTests::test_ReadGbq_with_computation 
[gw7] PASSED apache_beam/io/gcp/bigquery_io_read_it_test.py::BigqueryIOReadIT::test_bigquery_read_1M_python 
apache_beam/io/gcp/bigquery_io_read_it_test.py::BigqueryIOReadIT::test_bigquery_read_custom_1M_python 
[gw5] PASSED apache_beam/io/gcp/bigquery_write_it_test.py::BigQueryWriteIntegrationTests::test_big_query_write_new_types 
apache_beam/io/gcp/bigquery_write_it_test.py::BigQueryWriteIntegrationTests::test_big_query_write_schema_autodetect 
[gw5] SKIPPED apache_beam/io/gcp/bigquery_write_it_test.py::BigQueryWriteIntegrationTests::test_big_query_write_schema_autodetect 
apache_beam/io/gcp/bigquery_write_it_test.py::BigQueryWriteIntegrationTests::test_big_query_write_without_schema 
[gw0] PASSED apache_beam/io/gcp/bigquery_read_it_test.py::ReadTests::test_table_schema_retrieve_specifying_only_table 
apache_beam/io/gcp/bigquery_read_it_test.py::ReadTests::test_table_schema_retrieve_with_direct_read 
[gw2] PASSED apache_beam/io/gcp/big_query_query_to_table_it_test.py::BigQueryQueryToTableIT::test_big_query_standard_sql 
apache_beam/examples/dataframe/taxiride_it_test.py::TaxirideIT::test_aggregation 
[gw4] PASSED apache_beam/ml/inference/sklearn_inference_it_test.py::SklearnInference::test_sklearn_mnist_classification_large_model 
apache_beam/ml/inference/sklearn_inference_it_test.py::SklearnInference::test_sklearn_regression 
[gw4] SKIPPED apache_beam/ml/inference/sklearn_inference_it_test.py::SklearnInference::test_sklearn_regression 
apache_beam/io/gcp/healthcare/dicomio_integration_test.py::DICOMIoIntegrationTest::test_dicom_search_instances 
[gw1] PASSED apache_beam/dataframe/io_it_test.py::ReadUsingReadGbqTests::test_ReadGbq_with_computation 
apache_beam/io/gcp/pubsub_integration_test.py::PubSubIntegrationTest::test_streaming_data_only 
[gw7] PASSED apache_beam/io/gcp/bigquery_io_read_it_test.py::BigqueryIOReadIT::test_bigquery_read_custom_1M_python 
apache_beam/io/gcp/gcsio_integration_test.py::GcsIOIntegrationTest::test_batch_copy_and_delete 
[gw7] PASSED apache_beam/io/gcp/gcsio_integration_test.py::GcsIOIntegrationTest::test_batch_copy_and_delete 
apache_beam/io/gcp/gcsio_integration_test.py::GcsIOIntegrationTest::test_copy 
[gw7] PASSED apache_beam/io/gcp/gcsio_integration_test.py::GcsIOIntegrationTest::test_copy 
apache_beam/examples/complete/autocomplete_test.py::AutocompleteTest::test_autocomplete_it 
[gw0] PASSED apache_beam/io/gcp/bigquery_read_it_test.py::ReadTests::test_table_schema_retrieve_with_direct_read 
apache_beam/io/gcp/bigquery_read_it_test.py::ReadUsingStorageApiTests::test_iobase_source 
[gw5] PASSED apache_beam/io/gcp/bigquery_write_it_test.py::BigQueryWriteIntegrationTests::test_big_query_write_without_schema 
apache_beam/ml/gcp/cloud_dlp_it_test.py::CloudDLPIT::test_deidentification 
[gw3] PASSED apache_beam/io/gcp/bigquery_json_it_test.py::BigQueryJsonIT::test_streaming_inserts 
apache_beam/examples/wordcount_it_test.py::WordCountIT::test_wordcount_impersonation_it 
[gw6] PASSED apache_beam/io/gcp/bigquery_test.py::PubSubBigQueryIT::test_file_loads 
apache_beam/io/gcp/bigquery_test.py::PubSubBigQueryIT::test_streaming_inserts 
[gw4] PASSED apache_beam/io/gcp/healthcare/dicomio_integration_test.py::DICOMIoIntegrationTest::test_dicom_search_instances 
apache_beam/io/gcp/healthcare/dicomio_integration_test.py::DICOMIoIntegrationTest::test_dicom_store_instance_from_gcs 
[gw7] PASSED apache_beam/examples/complete/autocomplete_test.py::AutocompleteTest::test_autocomplete_it 
apache_beam/examples/complete/game/game_stats_it_test.py::GameStatsIT::test_game_stats_it 
[gw2] PASSED apache_beam/examples/dataframe/taxiride_it_test.py::TaxirideIT::test_aggregation 
apache_beam/examples/dataframe/taxiride_it_test.py::TaxirideIT::test_enrich 
[gw5] PASSED apache_beam/ml/gcp/cloud_dlp_it_test.py::CloudDLPIT::test_deidentification 
apache_beam/ml/gcp/cloud_dlp_it_test.py::CloudDLPIT::test_inspection 
[gw0] PASSED apache_beam/io/gcp/bigquery_read_it_test.py::ReadUsingStorageApiTests::test_iobase_source 
apache_beam/io/gcp/bigquery_read_it_test.py::ReadUsingStorageApiTests::test_iobase_source_with_column_selection 
[gw3] PASSED apache_beam/examples/wordcount_it_test.py::WordCountIT::test_wordcount_impersonation_it 
apache_beam/examples/wordcount_it_test.py::WordCountIT::test_wordcount_it 
[gw4] PASSED apache_beam/io/gcp/healthcare/dicomio_integration_test.py::DICOMIoIntegrationTest::test_dicom_store_instance_from_gcs 
apache_beam/examples/streaming_wordcount_debugging_it_test.py::StreamingWordcountDebuggingIT::test_streaming_wordcount_debugging_it 
[gw4] SKIPPED apache_beam/examples/streaming_wordcount_debugging_it_test.py::StreamingWordcountDebuggingIT::test_streaming_wordcount_debugging_it 
apache_beam/examples/cookbook/bigquery_tornadoes_it_test.py::BigqueryTornadoesIT::test_bigquery_tornadoes_it 
[gw5] PASSED apache_beam/ml/gcp/cloud_dlp_it_test.py::CloudDLPIT::test_inspection 
apache_beam/examples/complete/game/leader_board_it_test.py::LeaderBoardIT::test_leader_board_it 
[gw1] PASSED apache_beam/io/gcp/pubsub_integration_test.py::PubSubIntegrationTest::test_streaming_data_only 
apache_beam/io/gcp/pubsub_integration_test.py::PubSubIntegrationTest::test_streaming_with_attributes 
[gw0] PASSED apache_beam/io/gcp/bigquery_read_it_test.py::ReadUsingStorageApiTests::test_iobase_source_with_column_selection 
apache_beam/io/gcp/bigquery_read_it_test.py::ReadUsingStorageApiTests::test_iobase_source_with_column_selection_and_row_restriction 
[gw3] PASSED apache_beam/examples/wordcount_it_test.py::WordCountIT::test_wordcount_it 
apache_beam/examples/complete/game/user_score_it_test.py::UserScoreIT::test_user_score_it 
[gw4] PASSED apache_beam/examples/cookbook/bigquery_tornadoes_it_test.py::BigqueryTornadoesIT::test_bigquery_tornadoes_it 
apache_beam/io/parquetio_it_test.py::TestParquetIT::test_parquetio_it 
[gw0] PASSED apache_beam/io/gcp/bigquery_read_it_test.py::ReadUsingStorageApiTests::test_iobase_source_with_column_selection_and_row_restriction 
apache_beam/io/gcp/bigquery_read_it_test.py::ReadUsingStorageApiTests::test_iobase_source_with_column_selection_and_row_restriction_rows 
[gw6] PASSED apache_beam/io/gcp/bigquery_test.py::PubSubBigQueryIT::test_streaming_inserts 
apache_beam/io/gcp/bigquery_test.py::BigQueryFileLoadsIntegrationTests::test_avro_file_load 
[gw4] PASSED apache_beam/io/parquetio_it_test.py::TestParquetIT::test_parquetio_it 
apache_beam/io/gcp/datastore/v1new/datastore_write_it_test.py::DatastoreWriteIT::test_datastore_write_limit 
[gw7] PASSED apache_beam/examples/complete/game/game_stats_it_test.py::GameStatsIT::test_game_stats_it 
apache_beam/examples/complete/game/hourly_team_score_it_test.py::HourlyTeamScoreIT::test_hourly_team_score_it 
[gw0] PASSED apache_beam/io/gcp/bigquery_read_it_test.py::ReadUsingStorageApiTests::test_iobase_source_with_column_selection_and_row_restriction_rows 
apache_beam/io/gcp/bigquery_read_it_test.py::ReadUsingStorageApiTests::test_iobase_source_with_native_datetime 
[gw1] PASSED apache_beam/io/gcp/pubsub_integration_test.py::PubSubIntegrationTest::test_streaming_with_attributes 
apache_beam/examples/streaming_wordcount_it_test.py::StreamingWordCountIT::test_streaming_wordcount_it 
[gw3] PASSED apache_beam/examples/complete/game/user_score_it_test.py::UserScoreIT::test_user_score_it 
apache_beam/io/fileio_test.py::MatchIntegrationTest::test_transform_on_gcs 
[gw5] PASSED apache_beam/examples/complete/game/leader_board_it_test.py::LeaderBoardIT::test_leader_board_it 
apache_beam/examples/inference/tfx_bsl/tfx_bsl_inference_it_test.py::TFXRunInferenceTests::test_tfx_run_inference_mobilenetv2 
[gw5] SKIPPED apache_beam/examples/inference/tfx_bsl/tfx_bsl_inference_it_test.py::TFXRunInferenceTests::test_tfx_run_inference_mobilenetv2 
apache_beam/ml/gcp/naturallanguageml_test_it.py::NaturalLanguageMlTestIT::test_analyzing_syntax 
[gw5] SKIPPED apache_beam/ml/gcp/naturallanguageml_test_it.py::NaturalLanguageMlTestIT::test_analyzing_syntax 
[gw6] PASSED apache_beam/io/gcp/bigquery_test.py::BigQueryFileLoadsIntegrationTests::test_avro_file_load 
apache_beam/examples/complete/juliaset/juliaset/juliaset_test_it.py::JuliaSetTestIT::test_run_example_with_setup_file 
[gw2] PASSED apache_beam/examples/dataframe/taxiride_it_test.py::TaxirideIT::test_enrich 
apache_beam/examples/fastavro_it_test.py::FastavroIT::test_avro_it <https://ci-beam.apache.org/job/beam_PostCommit_Python311/ws/src/build/gradleenv/2050596099/bin/python3.11>: No module named build
warning: sdist: standard file not found: should have one of README, README.rst, README.txt, README.md

warning: check: missing required meta-data: url

warning: check: missing meta-data: either (author and author_email) or (maintainer and maintainer_email) should be supplied


[gw0] PASSED apache_beam/io/gcp/bigquery_read_it_test.py::ReadUsingStorageApiTests::test_iobase_source_with_native_datetime 
apache_beam/io/gcp/bigquery_read_it_test.py::ReadUsingStorageApiTests::test_iobase_source_with_query 
[gw3] PASSED apache_beam/io/fileio_test.py::MatchIntegrationTest::test_transform_on_gcs 
apache_beam/ml/gcp/visionml_test_it.py::VisionMlTestIT::test_text_detection_with_language_hint 
[gw7] PASSED apache_beam/examples/complete/game/hourly_team_score_it_test.py::HourlyTeamScoreIT::test_hourly_team_score_it 
apache_beam/examples/cookbook/datastore_wordcount_it_test.py::DatastoreWordCountIT::test_datastore_wordcount_it 
[gw6] PASSED apache_beam/examples/complete/juliaset/juliaset/juliaset_test_it.py::JuliaSetTestIT::test_run_example_with_setup_file 
apache_beam/ml/inference/onnx_inference_it_test.py::OnnxInference::test_onnx_run_inference_roberta_sentiment_classification 
[gw6] SKIPPED apache_beam/ml/inference/onnx_inference_it_test.py::OnnxInference::test_onnx_run_inference_roberta_sentiment_classification 
[gw0] PASSED apache_beam/io/gcp/bigquery_read_it_test.py::ReadUsingStorageApiTests::test_iobase_source_with_query 
apache_beam/io/gcp/bigquery_read_it_test.py::ReadUsingStorageApiTests::test_iobase_source_with_query_and_filters 
[gw3] PASSED apache_beam/ml/gcp/visionml_test_it.py::VisionMlTestIT::test_text_detection_with_language_hint 
[gw1] PASSED apache_beam/examples/streaming_wordcount_it_test.py::StreamingWordCountIT::test_streaming_wordcount_it 
apache_beam/ml/gcp/videointelligenceml_test_it.py::VideoIntelligenceMlTestIT::test_label_detection_with_video_context 
[gw1] SKIPPED apache_beam/ml/gcp/videointelligenceml_test_it.py::VideoIntelligenceMlTestIT::test_label_detection_with_video_context 
apache_beam/transforms/periodicsequence_it_test.py::PeriodicSequenceIT::test_periodicsequence_outputs_valid_watermarks_it 
[gw1] SKIPPED apache_beam/transforms/periodicsequence_it_test.py::PeriodicSequenceIT::test_periodicsequence_outputs_valid_watermarks_it 
[gw2] PASSED apache_beam/examples/fastavro_it_test.py::FastavroIT::test_avro_it 
apache_beam/examples/dataframe/flight_delays_it_test.py::FlightDelaysTest::test_flight_delays 
[gw7] PASSED apache_beam/examples/cookbook/datastore_wordcount_it_test.py::DatastoreWordCountIT::test_datastore_wordcount_it 
apache_beam/transforms/external_it_test.py::ExternalTransformIT::test_job_python_from_python_it 
[gw0] PASSED apache_beam/io/gcp/bigquery_read_it_test.py::ReadUsingStorageApiTests::test_iobase_source_with_query_and_filters 
apache_beam/io/gcp/bigquery_read_it_test.py::ReadUsingStorageApiTests::test_iobase_source_with_row_restriction 
[gw2] PASSED apache_beam/examples/dataframe/flight_delays_it_test.py::FlightDelaysTest::test_flight_delays 
[gw7] PASSED apache_beam/transforms/external_it_test.py::ExternalTransformIT::test_job_python_from_python_it 
[gw0] PASSED apache_beam/io/gcp/bigquery_read_it_test.py::ReadUsingStorageApiTests::test_iobase_source_with_row_restriction 
apache_beam/io/gcp/bigquery_read_it_test.py::ReadUsingStorageApiTests::test_iobase_source_with_very_selective_filters 
[gw4] PASSED apache_beam/io/gcp/datastore/v1new/datastore_write_it_test.py::DatastoreWriteIT::test_datastore_write_limit 
apache_beam/ml/inference/base_test.py::RunInferenceBaseTest::test_run_inference_with_side_inputin_streaming 
[gw4] SKIPPED apache_beam/ml/inference/base_test.py::RunInferenceBaseTest::test_run_inference_with_side_inputin_streaming 
apache_beam/runners/dataflow/dataflow_exercise_metrics_pipeline_test.py::ExerciseMetricsPipelineTest::test_metrics_it 
[gw4] SKIPPED apache_beam/runners/dataflow/dataflow_exercise_metrics_pipeline_test.py::ExerciseMetricsPipelineTest::test_metrics_it 
[gw0] PASSED apache_beam/io/gcp/bigquery_read_it_test.py::ReadUsingStorageApiTests::test_iobase_source_with_very_selective_filters 
apache_beam/io/gcp/bigquery_read_it_test.py::ReadNewTypesTests::test_iobase_source 
[gw0] PASSED apache_beam/io/gcp/bigquery_read_it_test.py::ReadNewTypesTests::test_iobase_source 
apache_beam/io/gcp/bigquery_read_it_test.py::ReadNewTypesTests::test_native_source 
[gw0] PASSED apache_beam/io/gcp/bigquery_read_it_test.py::ReadNewTypesTests::test_native_source 
apache_beam/io/gcp/bigquery_read_it_test.py::ReadAllBQTests::test_read_queries 
[gw0] PASSED apache_beam/io/gcp/bigquery_read_it_test.py::ReadAllBQTests::test_read_queries 
apache_beam/io/gcp/bigquery_read_it_test.py::ReadInteractiveRunnerTests::test_read_in_interactive_runner 
[gw0] PASSED apache_beam/io/gcp/bigquery_read_it_test.py::ReadInteractiveRunnerTests::test_read_in_interactive_runner 

=============================== warnings summary ===============================
apache_beam/io/gcp/bigquery_read_it_test.py::ReadTests::test_native_source
  <https://ci-beam.apache.org/job/beam_PostCommit_Python311/ws/src/sdks/python/apache_beam/io/gcp/bigquery_read_it_test.py>:170: BeamDeprecationWarning: BigQuerySource is deprecated since 2.25.0. Use ReadFromBigQuery instead.
    beam.io.BigQuerySource(query=self.query, use_standard_sql=True)))

apache_beam/io/gcp/bigquery_test.py::PubSubBigQueryIT::test_file_loads
apache_beam/io/gcp/bigquery_test.py::PubSubBigQueryIT::test_streaming_inserts
apache_beam/examples/complete/game/game_stats_it_test.py::GameStatsIT::test_game_stats_it
apache_beam/examples/complete/game/leader_board_it_test.py::LeaderBoardIT::test_leader_board_it
apache_beam/examples/complete/game/hourly_team_score_it_test.py::HourlyTeamScoreIT::test_hourly_team_score_it
  <https://ci-beam.apache.org/job/beam_PostCommit_Python311/ws/src/sdks/python/apache_beam/io/gcp/tests/utils.py>:63: PendingDeprecationWarning: Client.dataset is deprecated and will be removed in a future version. Use a string like 'my_project.my_dataset' or a cloud.google.bigquery.DatasetReference object, instead.
    dataset_ref = client.dataset(unique_dataset_name, project=project)

apache_beam/examples/cookbook/bigquery_tornadoes_it_test.py::BigqueryTornadoesIT::test_bigquery_tornadoes_it
  <https://ci-beam.apache.org/job/beam_PostCommit_Python311/ws/src/sdks/python/apache_beam/io/gcp/tests/utils.py>:100: PendingDeprecationWarning: Client.dataset is deprecated and will be removed in a future version. Use a string like 'my_project.my_dataset' or a cloud.google.bigquery.DatasetReference object, instead.
    table_ref = client.dataset(dataset_id).table(table_id)

apache_beam/examples/dataframe/flight_delays_it_test.py::FlightDelaysTest::test_flight_delays
  <https://ci-beam.apache.org/job/beam_PostCommit_Python311/ws/src/sdks/python/apache_beam/examples/dataframe/flight_delays.py>:47: FutureWarning: The default value of numeric_only in DataFrame.mean is deprecated. In a future version, it will default to False. In addition, specifying 'numeric_only=None' is deprecated. Select only valid columns or specify the value of numeric_only to silence this warning.
    return airline_df[at_top_airports].mean()

apache_beam/io/gcp/bigquery_read_it_test.py::ReadNewTypesTests::test_native_source
  <https://ci-beam.apache.org/job/beam_PostCommit_Python311/ws/src/sdks/python/apache_beam/io/gcp/bigquery_read_it_test.py>:706: BeamDeprecationWarning: BigQuerySource is deprecated since 2.25.0. Use ReadFromBigQuery instead.
    beam.io.BigQuerySource(query=self.query, use_standard_sql=True)))

-- Docs: https://docs.pytest.org/en/stable/how-to/capture-warnings.html
- generated xml file: <https://ci-beam.apache.org/job/beam_PostCommit_Python311/ws/src/sdks/python/pytest_postCommitIT-df-py311.xml> -
=========== 82 passed, 50 skipped, 9 warnings in 5974.31s (1:39:34) ============

FAILURE: Build failed with an exception.

* Where:
Script '<https://ci-beam.apache.org/job/beam_PostCommit_Python311/ws/src/sdks/python/test-suites/portable/common.gradle'> line: 326

* What went wrong:
Execution failed for task ':sdks:python:test-suites:portable:py311:postCommitPy311IT'.
> Process 'command 'sh'' finished with non-zero exit value 1

* Try:
> Run with --stacktrace option to get the stack trace.
> Run with --info or --debug option to get more log output.
> Get more help at https://help.gradle.org.

Deprecated Gradle features were used in this build, making it incompatible with Gradle 9.0.

You can use '--warning-mode all' to show the individual deprecation warnings and determine if they come from your own scripts or plugins.

For more on this, please refer to https://docs.gradle.org/8.4/userguide/command_line_interface.html#sec:command_line_warnings in the Gradle documentation.

BUILD FAILED in 1h 45m 31s
217 actionable tasks: 155 executed, 58 from cache, 4 up-to-date

Publishing build scan...
https://ge.apache.org/s/ofy2nl6z2mphe

Build step 'Invoke Gradle script' changed build result to FAILURE
Build step 'Invoke Gradle script' marked build as failure

---------------------------------------------------------------------
To unsubscribe, e-mail: builds-unsubscribe@beam.apache.org
For additional commands, e-mail: builds-help@beam.apache.org


Build failed in Jenkins: beam_PostCommit_Python311 #995

Posted by Apache Jenkins Server <je...@builds.apache.org>.
See <https://ci-beam.apache.org/job/beam_PostCommit_Python311/995/display/redirect>

Changes:


------------------------------------------
[...truncated 8.08 MB...]
  File "<https://ci-beam.apache.org/job/beam_PostCommit_Python311/ws/src/build/gradleenv/-1720702906/lib/python3.11/site-packages/grpc/_channel.py",> line 540, in __next__
    return self._next()
           ^^^^^^^^^^^^
  File "<https://ci-beam.apache.org/job/beam_PostCommit_Python311/ws/src/build/gradleenv/-1720702906/lib/python3.11/site-packages/grpc/_channel.py",> line 966, in _next
    raise self
grpc._channel._MultiThreadedRendezvous: <_MultiThreadedRendezvous of RPC that terminated with:
	status = StatusCode.UNAVAILABLE
	details = "recvmsg:Connection reset by peer"
	debug_error_string = "UNKNOWN:Error received from peer ipv6:%5B::1%5D:45539 {created_time:"2023-12-12T23:14:40.605688274+00:00", grpc_status:14, grpc_message:"recvmsg:Connection reset by peer"}"
>
    self._target(*self._args, **self._kwargs)
Exception in thread read_grpc_client_inputs:
    self._target(*self._args, **self._kwargs)
Traceback (most recent call last):
  File "<https://ci-beam.apache.org/job/beam_PostCommit_Python311/ws/src/sdks/python/apache_beam/runners/worker/sdk_worker.py",> line 1042, in pull_responses
  File "<https://ci-beam.apache.org/job/beam_PostCommit_Python311/ws/src/sdks/python/apache_beam/runners/worker/sdk_worker.py",> line 265, in run
  File "/usr/lib/python3.11/threading.py", line 1038, in _bootstrap_inner
    for response in responses:
  File "<https://ci-beam.apache.org/job/beam_PostCommit_Python311/ws/src/build/gradleenv/-1720702906/lib/python3.11/site-packages/grpc/_channel.py",> line 540, in __next__
    for work_request in self._control_stub.Control(get_responses()):
    self.run()
  File "<https://ci-beam.apache.org/job/beam_PostCommit_Python311/ws/src/build/gradleenv/-1720702906/lib/python3.11/site-packages/grpc/_channel.py",> line 540, in __next__
    return self._next()
  File "/usr/lib/python3.11/threading.py", line 975, in run
           ^^^^^^^^^^^^
    return self._next()
  File "<https://ci-beam.apache.org/job/beam_PostCommit_Python311/ws/src/build/gradleenv/-1720702906/lib/python3.11/site-packages/grpc/_channel.py",> line 966, in _next
    self._target(*self._args, **self._kwargs)
           ^^^^^^^^^^^^
  File "<https://ci-beam.apache.org/job/beam_PostCommit_Python311/ws/src/sdks/python/apache_beam/runners/worker/data_plane.py",> line 686, in <lambda>
  File "<https://ci-beam.apache.org/job/beam_PostCommit_Python311/ws/src/build/gradleenv/-1720702906/lib/python3.11/site-packages/grpc/_channel.py",> line 966, in _next
    raise self
    target=lambda: self._read_inputs(elements_iterator),
grpc._channel._MultiThreadedRendezvous: <_MultiThreadedRendezvous of RPC that terminated with:
	status = StatusCode.UNAVAILABLE
	details = "Socket closed"
	debug_error_string = "UNKNOWN:Error received from peer ipv6:%5B::1%5D:41743 {grpc_message:"Socket closed", grpc_status:14, created_time:"2023-12-12T23:14:40.605714329+00:00"}"
>
    raise self
                   ^^^^^^^^^^^^^^^^^^^^^^^^^^^^^^^^^^^^
grpc._channel._MultiThreadedRendezvous: <_MultiThreadedRendezvous of RPC that terminated with:
	status = StatusCode.UNAVAILABLE
	details = "Socket closed"
	debug_error_string = "UNKNOWN:Error received from peer ipv6:%5B::1%5D:41287 {created_time:"2023-12-12T23:14:40.605709949+00:00", grpc_status:14, grpc_message:"Socket closed"}"
>
  File "<https://ci-beam.apache.org/job/beam_PostCommit_Python311/ws/src/sdks/python/apache_beam/runners/worker/data_plane.py",> line 669, in _read_inputs
    for elements in elements_iterator:
  File "<https://ci-beam.apache.org/job/beam_PostCommit_Python311/ws/src/build/gradleenv/-1720702906/lib/python3.11/site-packages/grpc/_channel.py",> line 540, in __next__
    return self._next()
           ^^^^^^^^^^^^
  File "<https://ci-beam.apache.org/job/beam_PostCommit_Python311/ws/src/build/gradleenv/-1720702906/lib/python3.11/site-packages/grpc/_channel.py",> line 966, in _next
    raise self
grpc._channel._MultiThreadedRendezvous: <_MultiThreadedRendezvous of RPC that terminated with:
	status = StatusCode.UNAVAILABLE
	details = "recvmsg:Connection reset by peer"
	debug_error_string = "UNKNOWN:Error received from peer ipv6:%5B::1%5D:45539 {created_time:"2023-12-12T23:14:40.605688274+00:00", grpc_status:14, grpc_message:"recvmsg:Connection reset by peer"}"
>

> Task :sdks:python:test-suites:dataflow:py311:postCommitIT

[gw5] PASSED apache_beam/ml/inference/sklearn_inference_it_test.py::SklearnInference::test_sklearn_mnist_classification 
apache_beam/ml/inference/sklearn_inference_it_test.py::SklearnInference::test_sklearn_mnist_classification_large_model 
[gw4] PASSED apache_beam/dataframe/io_it_test.py::ReadUsingReadGbqTests::test_ReadGbq_export_with_project 
apache_beam/dataframe/io_it_test.py::ReadUsingReadGbqTests::test_ReadGbq_with_computation 
[gw0] PASSED apache_beam/io/gcp/bigquery_read_it_test.py::ReadTests::test_table_schema_retrieve_specifying_only_table 
apache_beam/io/gcp/bigquery_read_it_test.py::ReadTests::test_table_schema_retrieve_with_direct_read 
[gw1] PASSED apache_beam/io/gcp/bigquery_write_it_test.py::BigQueryWriteIntegrationTests::test_big_query_write_new_types 
apache_beam/io/gcp/bigquery_write_it_test.py::BigQueryWriteIntegrationTests::test_big_query_write_schema_autodetect 
[gw1] SKIPPED apache_beam/io/gcp/bigquery_write_it_test.py::BigQueryWriteIntegrationTests::test_big_query_write_schema_autodetect 
apache_beam/io/gcp/bigquery_write_it_test.py::BigQueryWriteIntegrationTests::test_big_query_write_without_schema 
[gw7] PASSED apache_beam/io/gcp/big_query_query_to_table_it_test.py::BigQueryQueryToTableIT::test_big_query_standard_sql 
apache_beam/examples/dataframe/taxiride_it_test.py::TaxirideIT::test_aggregation 
[gw5] PASSED apache_beam/ml/inference/sklearn_inference_it_test.py::SklearnInference::test_sklearn_mnist_classification_large_model 
apache_beam/ml/inference/sklearn_inference_it_test.py::SklearnInference::test_sklearn_regression 
[gw5] SKIPPED apache_beam/ml/inference/sklearn_inference_it_test.py::SklearnInference::test_sklearn_regression 
apache_beam/ml/gcp/cloud_dlp_it_test.py::CloudDLPIT::test_deidentification 
[gw4] PASSED apache_beam/dataframe/io_it_test.py::ReadUsingReadGbqTests::test_ReadGbq_with_computation 
apache_beam/io/gcp/bigquery_io_read_it_test.py::BigqueryIOReadIT::test_bigquery_read_1M_python 
[gw3] PASSED apache_beam/io/gcp/bigquery_json_it_test.py::BigQueryJsonIT::test_streaming_inserts 
apache_beam/examples/wordcount_it_test.py::WordCountIT::test_wordcount_impersonation_it 
[gw0] PASSED apache_beam/io/gcp/bigquery_read_it_test.py::ReadTests::test_table_schema_retrieve_with_direct_read 
apache_beam/io/gcp/bigquery_read_it_test.py::ReadUsingStorageApiTests::test_iobase_source 
[gw2] PASSED apache_beam/io/gcp/pubsub_integration_test.py::PubSubIntegrationTest::test_streaming_data_only 
apache_beam/io/gcp/pubsub_integration_test.py::PubSubIntegrationTest::test_streaming_with_attributes 
[gw1] PASSED apache_beam/io/gcp/bigquery_write_it_test.py::BigQueryWriteIntegrationTests::test_big_query_write_without_schema 
apache_beam/examples/fastavro_it_test.py::FastavroIT::test_avro_it 
[gw6] PASSED apache_beam/io/gcp/bigquery_test.py::PubSubBigQueryIT::test_file_loads 
apache_beam/io/gcp/bigquery_test.py::PubSubBigQueryIT::test_streaming_inserts 
[gw5] PASSED apache_beam/ml/gcp/cloud_dlp_it_test.py::CloudDLPIT::test_deidentification 
apache_beam/ml/gcp/cloud_dlp_it_test.py::CloudDLPIT::test_inspection 
[gw4] PASSED apache_beam/io/gcp/bigquery_io_read_it_test.py::BigqueryIOReadIT::test_bigquery_read_1M_python 
apache_beam/io/gcp/bigquery_io_read_it_test.py::BigqueryIOReadIT::test_bigquery_read_custom_1M_python 
[gw7] PASSED apache_beam/examples/dataframe/taxiride_it_test.py::TaxirideIT::test_aggregation 
apache_beam/examples/dataframe/taxiride_it_test.py::TaxirideIT::test_enrich 
[gw3] PASSED apache_beam/examples/wordcount_it_test.py::WordCountIT::test_wordcount_impersonation_it 
apache_beam/examples/wordcount_it_test.py::WordCountIT::test_wordcount_it 
[gw0] PASSED apache_beam/io/gcp/bigquery_read_it_test.py::ReadUsingStorageApiTests::test_iobase_source 
apache_beam/io/gcp/bigquery_read_it_test.py::ReadUsingStorageApiTests::test_iobase_source_with_column_selection 
[gw5] PASSED apache_beam/ml/gcp/cloud_dlp_it_test.py::CloudDLPIT::test_inspection 
apache_beam/examples/complete/autocomplete_test.py::AutocompleteTest::test_autocomplete_it 
[gw4] PASSED apache_beam/io/gcp/bigquery_io_read_it_test.py::BigqueryIOReadIT::test_bigquery_read_custom_1M_python 
apache_beam/examples/complete/game/game_stats_it_test.py::GameStatsIT::test_game_stats_it 
[gw3] PASSED apache_beam/examples/wordcount_it_test.py::WordCountIT::test_wordcount_it 
apache_beam/examples/complete/game/hourly_team_score_it_test.py::HourlyTeamScoreIT::test_hourly_team_score_it 
[gw0] PASSED apache_beam/io/gcp/bigquery_read_it_test.py::ReadUsingStorageApiTests::test_iobase_source_with_column_selection 
apache_beam/io/gcp/bigquery_read_it_test.py::ReadUsingStorageApiTests::test_iobase_source_with_column_selection_and_row_restriction 
[gw2] PASSED apache_beam/io/gcp/pubsub_integration_test.py::PubSubIntegrationTest::test_streaming_with_attributes 
apache_beam/io/gcp/healthcare/dicomio_integration_test.py::DICOMIoIntegrationTest::test_dicom_search_instances 
[gw1] PASSED apache_beam/examples/fastavro_it_test.py::FastavroIT::test_avro_it 
apache_beam/examples/streaming_wordcount_debugging_it_test.py::StreamingWordcountDebuggingIT::test_streaming_wordcount_debugging_it 
[gw1] SKIPPED apache_beam/examples/streaming_wordcount_debugging_it_test.py::StreamingWordcountDebuggingIT::test_streaming_wordcount_debugging_it 
apache_beam/examples/complete/game/leader_board_it_test.py::LeaderBoardIT::test_leader_board_it 
[gw5] PASSED apache_beam/examples/complete/autocomplete_test.py::AutocompleteTest::test_autocomplete_it 
apache_beam/examples/complete/juliaset/juliaset/juliaset_test_it.py::JuliaSetTestIT::test_run_example_with_setup_file <https://ci-beam.apache.org/job/beam_PostCommit_Python311/ws/src/build/gradleenv/2050596099/bin/python3.11>: No module named build
warning: sdist: standard file not found: should have one of README, README.rst, README.txt, README.md

warning: check: missing required meta-data: url

warning: check: missing meta-data: either (author and author_email) or (maintainer and maintainer_email) should be supplied


[gw0] PASSED apache_beam/io/gcp/bigquery_read_it_test.py::ReadUsingStorageApiTests::test_iobase_source_with_column_selection_and_row_restriction 
apache_beam/io/gcp/bigquery_read_it_test.py::ReadUsingStorageApiTests::test_iobase_source_with_column_selection_and_row_restriction_rows 
[gw2] PASSED apache_beam/io/gcp/healthcare/dicomio_integration_test.py::DICOMIoIntegrationTest::test_dicom_search_instances 
apache_beam/io/gcp/healthcare/dicomio_integration_test.py::DICOMIoIntegrationTest::test_dicom_store_instance_from_gcs 
[gw6] PASSED apache_beam/io/gcp/bigquery_test.py::PubSubBigQueryIT::test_streaming_inserts 
apache_beam/io/gcp/bigquery_test.py::BigQueryFileLoadsIntegrationTests::test_avro_file_load 
[gw5] PASSED apache_beam/examples/complete/juliaset/juliaset/juliaset_test_it.py::JuliaSetTestIT::test_run_example_with_setup_file 
apache_beam/examples/inference/tfx_bsl/tfx_bsl_inference_it_test.py::TFXRunInferenceTests::test_tfx_run_inference_mobilenetv2 
[gw5] SKIPPED apache_beam/examples/inference/tfx_bsl/tfx_bsl_inference_it_test.py::TFXRunInferenceTests::test_tfx_run_inference_mobilenetv2 
apache_beam/ml/gcp/visionml_test_it.py::VisionMlTestIT::test_text_detection_with_language_hint 
[gw0] PASSED apache_beam/io/gcp/bigquery_read_it_test.py::ReadUsingStorageApiTests::test_iobase_source_with_column_selection_and_row_restriction_rows 
apache_beam/io/gcp/bigquery_read_it_test.py::ReadUsingStorageApiTests::test_iobase_source_with_native_datetime 
[gw2] PASSED apache_beam/io/gcp/healthcare/dicomio_integration_test.py::DICOMIoIntegrationTest::test_dicom_store_instance_from_gcs 
apache_beam/io/gcp/datastore/v1new/datastore_write_it_test.py::DatastoreWriteIT::test_datastore_write_limit 
[gw3] PASSED apache_beam/examples/complete/game/hourly_team_score_it_test.py::HourlyTeamScoreIT::test_hourly_team_score_it 
apache_beam/examples/dataframe/flight_delays_it_test.py::FlightDelaysTest::test_flight_delays 
[gw4] PASSED apache_beam/examples/complete/game/game_stats_it_test.py::GameStatsIT::test_game_stats_it 
apache_beam/examples/cookbook/bigquery_tornadoes_it_test.py::BigqueryTornadoesIT::test_bigquery_tornadoes_it 
[gw6] PASSED apache_beam/io/gcp/bigquery_test.py::BigQueryFileLoadsIntegrationTests::test_avro_file_load 
apache_beam/examples/complete/game/user_score_it_test.py::UserScoreIT::test_user_score_it 
[gw1] PASSED apache_beam/examples/complete/game/leader_board_it_test.py::LeaderBoardIT::test_leader_board_it 
apache_beam/ml/gcp/naturallanguageml_test_it.py::NaturalLanguageMlTestIT::test_analyzing_syntax 
[gw1] SKIPPED apache_beam/ml/gcp/naturallanguageml_test_it.py::NaturalLanguageMlTestIT::test_analyzing_syntax 
apache_beam/ml/gcp/videointelligenceml_test_it.py::VideoIntelligenceMlTestIT::test_label_detection_with_video_context 
[gw1] SKIPPED apache_beam/ml/gcp/videointelligenceml_test_it.py::VideoIntelligenceMlTestIT::test_label_detection_with_video_context 
[gw5] PASSED apache_beam/ml/gcp/visionml_test_it.py::VisionMlTestIT::test_text_detection_with_language_hint 
apache_beam/runners/dataflow/dataflow_exercise_metrics_pipeline_test.py::ExerciseMetricsPipelineTest::test_metrics_it 
[gw5] SKIPPED apache_beam/runners/dataflow/dataflow_exercise_metrics_pipeline_test.py::ExerciseMetricsPipelineTest::test_metrics_it 
apache_beam/transforms/external_it_test.py::ExternalTransformIT::test_job_python_from_python_it 
[gw0] PASSED apache_beam/io/gcp/bigquery_read_it_test.py::ReadUsingStorageApiTests::test_iobase_source_with_native_datetime 
apache_beam/io/gcp/bigquery_read_it_test.py::ReadUsingStorageApiTests::test_iobase_source_with_query 
[gw7] PASSED apache_beam/examples/dataframe/taxiride_it_test.py::TaxirideIT::test_enrich 
apache_beam/examples/streaming_wordcount_it_test.py::StreamingWordCountIT::test_streaming_wordcount_it 
[gw3] PASSED apache_beam/examples/dataframe/flight_delays_it_test.py::FlightDelaysTest::test_flight_delays 
apache_beam/io/parquetio_it_test.py::TestParquetIT::test_parquetio_it 
[gw4] PASSED apache_beam/examples/cookbook/bigquery_tornadoes_it_test.py::BigqueryTornadoesIT::test_bigquery_tornadoes_it 
apache_beam/io/fileio_test.py::MatchIntegrationTest::test_transform_on_gcs 
[gw5] PASSED apache_beam/transforms/external_it_test.py::ExternalTransformIT::test_job_python_from_python_it 
[gw0] PASSED apache_beam/io/gcp/bigquery_read_it_test.py::ReadUsingStorageApiTests::test_iobase_source_with_query 
apache_beam/io/gcp/bigquery_read_it_test.py::ReadUsingStorageApiTests::test_iobase_source_with_query_and_filters 
[gw3] PASSED apache_beam/io/parquetio_it_test.py::TestParquetIT::test_parquetio_it 
[gw4] PASSED apache_beam/io/fileio_test.py::MatchIntegrationTest::test_transform_on_gcs 
[gw6] PASSED apache_beam/examples/complete/game/user_score_it_test.py::UserScoreIT::test_user_score_it 
apache_beam/ml/inference/onnx_inference_it_test.py::OnnxInference::test_onnx_run_inference_roberta_sentiment_classification 
[gw6] SKIPPED apache_beam/ml/inference/onnx_inference_it_test.py::OnnxInference::test_onnx_run_inference_roberta_sentiment_classification 
[gw0] PASSED apache_beam/io/gcp/bigquery_read_it_test.py::ReadUsingStorageApiTests::test_iobase_source_with_query_and_filters 
apache_beam/io/gcp/bigquery_read_it_test.py::ReadUsingStorageApiTests::test_iobase_source_with_row_restriction 
[gw7] PASSED apache_beam/examples/streaming_wordcount_it_test.py::StreamingWordCountIT::test_streaming_wordcount_it 
apache_beam/examples/cookbook/datastore_wordcount_it_test.py::DatastoreWordCountIT::test_datastore_wordcount_it 
[gw0] PASSED apache_beam/io/gcp/bigquery_read_it_test.py::ReadUsingStorageApiTests::test_iobase_source_with_row_restriction 
apache_beam/io/gcp/bigquery_read_it_test.py::ReadUsingStorageApiTests::test_iobase_source_with_very_selective_filters 
[gw7] PASSED apache_beam/examples/cookbook/datastore_wordcount_it_test.py::DatastoreWordCountIT::test_datastore_wordcount_it 
[gw0] PASSED apache_beam/io/gcp/bigquery_read_it_test.py::ReadUsingStorageApiTests::test_iobase_source_with_very_selective_filters 
apache_beam/io/gcp/bigquery_read_it_test.py::ReadNewTypesTests::test_iobase_source 
[gw2] PASSED apache_beam/io/gcp/datastore/v1new/datastore_write_it_test.py::DatastoreWriteIT::test_datastore_write_limit 
apache_beam/ml/inference/base_test.py::RunInferenceBaseTest::test_run_inference_with_side_inputin_streaming 
[gw2] SKIPPED apache_beam/ml/inference/base_test.py::RunInferenceBaseTest::test_run_inference_with_side_inputin_streaming 
apache_beam/transforms/periodicsequence_it_test.py::PeriodicSequenceIT::test_periodicsequence_outputs_valid_watermarks_it 
[gw2] SKIPPED apache_beam/transforms/periodicsequence_it_test.py::PeriodicSequenceIT::test_periodicsequence_outputs_valid_watermarks_it 
[gw0] PASSED apache_beam/io/gcp/bigquery_read_it_test.py::ReadNewTypesTests::test_iobase_source 
apache_beam/io/gcp/bigquery_read_it_test.py::ReadNewTypesTests::test_native_source 
[gw0] PASSED apache_beam/io/gcp/bigquery_read_it_test.py::ReadNewTypesTests::test_native_source 
apache_beam/io/gcp/bigquery_read_it_test.py::ReadAllBQTests::test_read_queries 
[gw0] PASSED apache_beam/io/gcp/bigquery_read_it_test.py::ReadAllBQTests::test_read_queries 
apache_beam/io/gcp/bigquery_read_it_test.py::ReadInteractiveRunnerTests::test_read_in_interactive_runner 
[gw0] PASSED apache_beam/io/gcp/bigquery_read_it_test.py::ReadInteractiveRunnerTests::test_read_in_interactive_runner 

=============================== warnings summary ===============================
apache_beam/io/gcp/bigquery.py:2603
  <https://ci-beam.apache.org/job/beam_PostCommit_Python311/ws/src/sdks/python/apache_beam/io/gcp/bigquery.py>:2603: DeprecationWarning: invalid escape sequence '\#'
    """Read data from BigQuery.

apache_beam/io/gcp/bigquery_read_it_test.py::ReadTests::test_native_source
  <https://ci-beam.apache.org/job/beam_PostCommit_Python311/ws/src/sdks/python/apache_beam/io/gcp/bigquery_read_it_test.py>:170: BeamDeprecationWarning: BigQuerySource is deprecated since 2.25.0. Use ReadFromBigQuery instead.
    beam.io.BigQuerySource(query=self.query, use_standard_sql=True)))

apache_beam/io/gcp/bigquery_test.py::PubSubBigQueryIT::test_file_loads
apache_beam/io/gcp/bigquery_test.py::PubSubBigQueryIT::test_streaming_inserts
apache_beam/examples/complete/game/hourly_team_score_it_test.py::HourlyTeamScoreIT::test_hourly_team_score_it
apache_beam/examples/complete/game/game_stats_it_test.py::GameStatsIT::test_game_stats_it
apache_beam/examples/complete/game/leader_board_it_test.py::LeaderBoardIT::test_leader_board_it
  <https://ci-beam.apache.org/job/beam_PostCommit_Python311/ws/src/sdks/python/apache_beam/io/gcp/tests/utils.py>:63: PendingDeprecationWarning: Client.dataset is deprecated and will be removed in a future version. Use a string like 'my_project.my_dataset' or a cloud.google.bigquery.DatasetReference object, instead.
    dataset_ref = client.dataset(unique_dataset_name, project=project)

apache_beam/examples/dataframe/flight_delays_it_test.py::FlightDelaysTest::test_flight_delays
  <https://ci-beam.apache.org/job/beam_PostCommit_Python311/ws/src/sdks/python/apache_beam/examples/dataframe/flight_delays.py>:47: FutureWarning: The default value of numeric_only in DataFrame.mean is deprecated. In a future version, it will default to False. In addition, specifying 'numeric_only=None' is deprecated. Select only valid columns or specify the value of numeric_only to silence this warning.
    return airline_df[at_top_airports].mean()

apache_beam/examples/cookbook/bigquery_tornadoes_it_test.py::BigqueryTornadoesIT::test_bigquery_tornadoes_it
  <https://ci-beam.apache.org/job/beam_PostCommit_Python311/ws/src/sdks/python/apache_beam/io/gcp/tests/utils.py>:100: PendingDeprecationWarning: Client.dataset is deprecated and will be removed in a future version. Use a string like 'my_project.my_dataset' or a cloud.google.bigquery.DatasetReference object, instead.
    table_ref = client.dataset(dataset_id).table(table_id)

apache_beam/io/gcp/bigquery_read_it_test.py::ReadNewTypesTests::test_native_source
  <https://ci-beam.apache.org/job/beam_PostCommit_Python311/ws/src/sdks/python/apache_beam/io/gcp/bigquery_read_it_test.py>:706: BeamDeprecationWarning: BigQuerySource is deprecated since 2.25.0. Use ReadFromBigQuery instead.
    beam.io.BigQuerySource(query=self.query, use_standard_sql=True)))

-- Docs: https://docs.pytest.org/en/stable/how-to/capture-warnings.html
- generated xml file: <https://ci-beam.apache.org/job/beam_PostCommit_Python311/ws/src/sdks/python/pytest_postCommitIT-df-py311.xml> -
=========== 82 passed, 50 skipped, 10 warnings in 5966.82s (1:39:26) ===========

FAILURE: Build failed with an exception.

* Where:
Script '<https://ci-beam.apache.org/job/beam_PostCommit_Python311/ws/src/sdks/python/test-suites/portable/common.gradle'> line: 326

* What went wrong:
Execution failed for task ':sdks:python:test-suites:portable:py311:postCommitPy311IT'.
> Process 'command 'sh'' finished with non-zero exit value 1

* Try:
> Run with --stacktrace option to get the stack trace.
> Run with --info or --debug option to get more log output.
> Get more help at https://help.gradle.org.

Deprecated Gradle features were used in this build, making it incompatible with Gradle 9.0.

You can use '--warning-mode all' to show the individual deprecation warnings and determine if they come from your own scripts or plugins.

For more on this, please refer to https://docs.gradle.org/8.4/userguide/command_line_interface.html#sec:command_line_warnings in the Gradle documentation.

BUILD FAILED in 1h 45m 49s
217 actionable tasks: 152 executed, 61 from cache, 4 up-to-date

Publishing build scan...
https://ge.apache.org/s/qvip6oaompf5e

Build step 'Invoke Gradle script' changed build result to FAILURE
Build step 'Invoke Gradle script' marked build as failure

---------------------------------------------------------------------
To unsubscribe, e-mail: builds-unsubscribe@beam.apache.org
For additional commands, e-mail: builds-help@beam.apache.org


Build failed in Jenkins: beam_PostCommit_Python311 #994

Posted by Apache Jenkins Server <je...@builds.apache.org>.
See <https://ci-beam.apache.org/job/beam_PostCommit_Python311/994/display/redirect?page=changes>

Changes:

[noreply] Update to most recent dataflow python container (#29717)


------------------------------------------
[...truncated 13.18 MB...]
  File "<https://ci-beam.apache.org/job/beam_PostCommit_Python311/ws/src/sdks/python/apache_beam/runners/worker/sdk_worker.py",> line 1042, in pull_responses
  File "<https://ci-beam.apache.org/job/beam_PostCommit_Python311/ws/src/sdks/python/apache_beam/runners/worker/sdk_worker.py",> line 265, in run
ERROR:apache_beam.runners.worker.data_plane:Failed to read inputs in the data plane.
Traceback (most recent call last):
  File "<https://ci-beam.apache.org/job/beam_PostCommit_Python311/ws/src/sdks/python/apache_beam/runners/worker/data_plane.py",> line 669, in _read_inputs
    for elements in elements_iterator:
  File "<https://ci-beam.apache.org/job/beam_PostCommit_Python311/ws/src/build/gradleenv/-1720702906/lib/python3.11/site-packages/grpc/_channel.py",> line 540, in __next__
    return self._next()
           ^^^^^^^^^^^^
  File "<https://ci-beam.apache.org/job/beam_PostCommit_Python311/ws/src/build/gradleenv/-1720702906/lib/python3.11/site-packages/grpc/_channel.py",> line 966, in _next
    raise self
grpc._channel._MultiThreadedRendezvous: <_MultiThreadedRendezvous of RPC that terminated with:
	status = StatusCode.UNAVAILABLE
	details = "recvmsg:Connection reset by peer"
	debug_error_string = "UNKNOWN:Error received from peer ipv6:%5B::1%5D:35953 {grpc_message:"recvmsg:Connection reset by peer", grpc_status:14, created_time:"2023-12-12T17:18:14.87862911+00:00"}"
>
    for response in responses:
  File "<https://ci-beam.apache.org/job/beam_PostCommit_Python311/ws/src/build/gradleenv/-1720702906/lib/python3.11/site-packages/grpc/_channel.py",> line 540, in __next__
Exception in thread read_grpc_client_inputs:
    for work_request in self._control_stub.Control(get_responses()):
Traceback (most recent call last):
  File "<https://ci-beam.apache.org/job/beam_PostCommit_Python311/ws/src/build/gradleenv/-1720702906/lib/python3.11/site-packages/grpc/_channel.py",> line 540, in __next__
  File "/usr/lib/python3.11/threading.py", line 1038, in _bootstrap_inner
    return self._next()
    self.run()
           ^^^^^^^^^^^^
  File "/usr/lib/python3.11/threading.py", line 975, in run
  File "<https://ci-beam.apache.org/job/beam_PostCommit_Python311/ws/src/build/gradleenv/-1720702906/lib/python3.11/site-packages/grpc/_channel.py",> line 966, in _next
    return self._next()
           ^^^^^^^^^^^^
    self._target(*self._args, **self._kwargs)
  File "<https://ci-beam.apache.org/job/beam_PostCommit_Python311/ws/src/build/gradleenv/-1720702906/lib/python3.11/site-packages/grpc/_channel.py",> line 966, in _next
  File "<https://ci-beam.apache.org/job/beam_PostCommit_Python311/ws/src/sdks/python/apache_beam/runners/worker/data_plane.py",> line 686, in <lambda>
    raise self
grpc._channel._MultiThreadedRendezvous: <_MultiThreadedRendezvous of RPC that terminated with:
	status = StatusCode.UNAVAILABLE
	details = "recvmsg:Connection reset by peer"
	debug_error_string = "UNKNOWN:Error received from peer ipv6:%5B::1%5D:45113 {grpc_message:"recvmsg:Connection reset by peer", grpc_status:14, created_time:"2023-12-12T17:18:14.87869+00:00"}"
>
    target=lambda: self._read_inputs(elements_iterator),
                   ^^^^^^^^^^^^^^^^^^^^^^^^^^^^^^^^^^^^
  File "<https://ci-beam.apache.org/job/beam_PostCommit_Python311/ws/src/sdks/python/apache_beam/runners/worker/data_plane.py",> line 669, in _read_inputs
    for elements in elements_iterator:
    raise self
  File "<https://ci-beam.apache.org/job/beam_PostCommit_Python311/ws/src/build/gradleenv/-1720702906/lib/python3.11/site-packages/grpc/_channel.py",> line 540, in __next__
grpc._channel._MultiThreadedRendezvous: <_MultiThreadedRendezvous of RPC that terminated with:
	status = StatusCode.UNAVAILABLE
	details = "Socket closed"
	debug_error_string = "UNKNOWN:Error received from peer ipv6:%5B::1%5D:46171 {created_time:"2023-12-12T17:18:14.878692312+00:00", grpc_status:14, grpc_message:"Socket closed"}"
>
    return self._next()
           ^^^^^^^^^^^^
  File "<https://ci-beam.apache.org/job/beam_PostCommit_Python311/ws/src/build/gradleenv/-1720702906/lib/python3.11/site-packages/grpc/_channel.py",> line 966, in _next
    raise self
grpc._channel._MultiThreadedRendezvous: <_MultiThreadedRendezvous of RPC that terminated with:
	status = StatusCode.UNAVAILABLE
	details = "recvmsg:Connection reset by peer"
	debug_error_string = "UNKNOWN:Error received from peer ipv6:%5B::1%5D:35953 {grpc_message:"recvmsg:Connection reset by peer", grpc_status:14, created_time:"2023-12-12T17:18:14.87862911+00:00"}"
>

> Task :sdks:python:test-suites:dataflow:py311:postCommitIT

[gw2] PASSED apache_beam/dataframe/io_it_test.py::ReadUsingReadGbqTests::test_ReadGbq_export_with_project 
apache_beam/dataframe/io_it_test.py::ReadUsingReadGbqTests::test_ReadGbq_with_computation 
[gw0] PASSED apache_beam/io/gcp/bigquery_read_it_test.py::ReadTests::test_table_schema_retrieve_specifying_only_table 
apache_beam/io/gcp/bigquery_read_it_test.py::ReadTests::test_table_schema_retrieve_with_direct_read 
[gw3] PASSED apache_beam/io/gcp/bigquery_write_it_test.py::BigQueryWriteIntegrationTests::test_big_query_write_new_types 
apache_beam/io/gcp/bigquery_write_it_test.py::BigQueryWriteIntegrationTests::test_big_query_write_schema_autodetect 
[gw3] SKIPPED apache_beam/io/gcp/bigquery_write_it_test.py::BigQueryWriteIntegrationTests::test_big_query_write_schema_autodetect 
apache_beam/io/gcp/bigquery_write_it_test.py::BigQueryWriteIntegrationTests::test_big_query_write_without_schema 
[gw4] PASSED apache_beam/ml/inference/sklearn_inference_it_test.py::SklearnInference::test_sklearn_mnist_classification_large_model 
apache_beam/ml/inference/sklearn_inference_it_test.py::SklearnInference::test_sklearn_regression 
[gw4] SKIPPED apache_beam/ml/inference/sklearn_inference_it_test.py::SklearnInference::test_sklearn_regression 
apache_beam/ml/gcp/cloud_dlp_it_test.py::CloudDLPIT::test_deidentification 
[gw7] PASSED apache_beam/io/gcp/big_query_query_to_table_it_test.py::BigQueryQueryToTableIT::test_big_query_standard_sql 
apache_beam/examples/dataframe/taxiride_it_test.py::TaxirideIT::test_aggregation 
[gw2] PASSED apache_beam/dataframe/io_it_test.py::ReadUsingReadGbqTests::test_ReadGbq_with_computation 
apache_beam/io/gcp/bigquery_io_read_it_test.py::BigqueryIOReadIT::test_bigquery_read_1M_python 
[gw5] PASSED apache_beam/io/gcp/bigquery_json_it_test.py::BigQueryJsonIT::test_streaming_inserts 
apache_beam/examples/wordcount_it_test.py::WordCountIT::test_wordcount_impersonation_it 
[gw0] PASSED apache_beam/io/gcp/bigquery_read_it_test.py::ReadTests::test_table_schema_retrieve_with_direct_read 
apache_beam/io/gcp/bigquery_read_it_test.py::ReadUsingStorageApiTests::test_iobase_source 
[gw3] PASSED apache_beam/io/gcp/bigquery_write_it_test.py::BigQueryWriteIntegrationTests::test_big_query_write_without_schema 
apache_beam/examples/fastavro_it_test.py::FastavroIT::test_avro_it 
[gw1] PASSED apache_beam/io/gcp/pubsub_integration_test.py::PubSubIntegrationTest::test_streaming_data_only 
apache_beam/io/gcp/pubsub_integration_test.py::PubSubIntegrationTest::test_streaming_with_attributes 
[gw4] PASSED apache_beam/ml/gcp/cloud_dlp_it_test.py::CloudDLPIT::test_deidentification 
apache_beam/ml/gcp/cloud_dlp_it_test.py::CloudDLPIT::test_inspection 
[gw6] PASSED apache_beam/io/gcp/bigquery_test.py::PubSubBigQueryIT::test_file_loads 
apache_beam/io/gcp/bigquery_test.py::PubSubBigQueryIT::test_streaming_inserts 
[gw2] PASSED apache_beam/io/gcp/bigquery_io_read_it_test.py::BigqueryIOReadIT::test_bigquery_read_1M_python 
apache_beam/io/gcp/bigquery_io_read_it_test.py::BigqueryIOReadIT::test_bigquery_read_custom_1M_python 
[gw0] PASSED apache_beam/io/gcp/bigquery_read_it_test.py::ReadUsingStorageApiTests::test_iobase_source 
apache_beam/io/gcp/bigquery_read_it_test.py::ReadUsingStorageApiTests::test_iobase_source_with_column_selection 
[gw5] PASSED apache_beam/examples/wordcount_it_test.py::WordCountIT::test_wordcount_impersonation_it 
apache_beam/examples/wordcount_it_test.py::WordCountIT::test_wordcount_it 
[gw7] PASSED apache_beam/examples/dataframe/taxiride_it_test.py::TaxirideIT::test_aggregation 
apache_beam/examples/dataframe/taxiride_it_test.py::TaxirideIT::test_enrich 
[gw4] PASSED apache_beam/ml/gcp/cloud_dlp_it_test.py::CloudDLPIT::test_inspection 
apache_beam/examples/streaming_wordcount_it_test.py::StreamingWordCountIT::test_streaming_wordcount_it 
[gw0] PASSED apache_beam/io/gcp/bigquery_read_it_test.py::ReadUsingStorageApiTests::test_iobase_source_with_column_selection 
apache_beam/io/gcp/bigquery_read_it_test.py::ReadUsingStorageApiTests::test_iobase_source_with_column_selection_and_row_restriction 
[gw5] PASSED apache_beam/examples/wordcount_it_test.py::WordCountIT::test_wordcount_it 
apache_beam/examples/complete/game/hourly_team_score_it_test.py::HourlyTeamScoreIT::test_hourly_team_score_it 
[gw2] PASSED apache_beam/io/gcp/bigquery_io_read_it_test.py::BigqueryIOReadIT::test_bigquery_read_custom_1M_python 
apache_beam/examples/complete/game/game_stats_it_test.py::GameStatsIT::test_game_stats_it 
[gw1] PASSED apache_beam/io/gcp/pubsub_integration_test.py::PubSubIntegrationTest::test_streaming_with_attributes 
apache_beam/io/gcp/healthcare/dicomio_integration_test.py::DICOMIoIntegrationTest::test_dicom_search_instances 
[gw3] PASSED apache_beam/examples/fastavro_it_test.py::FastavroIT::test_avro_it 
apache_beam/examples/streaming_wordcount_debugging_it_test.py::StreamingWordcountDebuggingIT::test_streaming_wordcount_debugging_it 
[gw3] SKIPPED apache_beam/examples/streaming_wordcount_debugging_it_test.py::StreamingWordcountDebuggingIT::test_streaming_wordcount_debugging_it 
apache_beam/examples/complete/game/leader_board_it_test.py::LeaderBoardIT::test_leader_board_it 
[gw0] PASSED apache_beam/io/gcp/bigquery_read_it_test.py::ReadUsingStorageApiTests::test_iobase_source_with_column_selection_and_row_restriction 
apache_beam/io/gcp/bigquery_read_it_test.py::ReadUsingStorageApiTests::test_iobase_source_with_column_selection_and_row_restriction_rows 
[gw1] PASSED apache_beam/io/gcp/healthcare/dicomio_integration_test.py::DICOMIoIntegrationTest::test_dicom_search_instances 
apache_beam/io/gcp/healthcare/dicomio_integration_test.py::DICOMIoIntegrationTest::test_dicom_store_instance_from_gcs 
[gw4] PASSED apache_beam/examples/streaming_wordcount_it_test.py::StreamingWordCountIT::test_streaming_wordcount_it 
apache_beam/examples/complete/game/user_score_it_test.py::UserScoreIT::test_user_score_it 
[gw0] PASSED apache_beam/io/gcp/bigquery_read_it_test.py::ReadUsingStorageApiTests::test_iobase_source_with_column_selection_and_row_restriction_rows 
apache_beam/io/gcp/bigquery_read_it_test.py::ReadUsingStorageApiTests::test_iobase_source_with_native_datetime 
[gw6] PASSED apache_beam/io/gcp/bigquery_test.py::PubSubBigQueryIT::test_streaming_inserts 
apache_beam/io/gcp/bigquery_test.py::BigQueryFileLoadsIntegrationTests::test_avro_file_load 
[gw1] PASSED apache_beam/io/gcp/healthcare/dicomio_integration_test.py::DICOMIoIntegrationTest::test_dicom_store_instance_from_gcs 
apache_beam/io/gcp/datastore/v1new/datastore_write_it_test.py::DatastoreWriteIT::test_datastore_write_limit 
[gw5] PASSED apache_beam/examples/complete/game/hourly_team_score_it_test.py::HourlyTeamScoreIT::test_hourly_team_score_it 
apache_beam/examples/cookbook/datastore_wordcount_it_test.py::DatastoreWordCountIT::test_datastore_wordcount_it 
[gw2] PASSED apache_beam/examples/complete/game/game_stats_it_test.py::GameStatsIT::test_game_stats_it 
apache_beam/examples/cookbook/bigquery_tornadoes_it_test.py::BigqueryTornadoesIT::test_bigquery_tornadoes_it 
[gw7] PASSED apache_beam/examples/dataframe/taxiride_it_test.py::TaxirideIT::test_enrich 
apache_beam/examples/complete/autocomplete_test.py::AutocompleteTest::test_autocomplete_it 
[gw0] PASSED apache_beam/io/gcp/bigquery_read_it_test.py::ReadUsingStorageApiTests::test_iobase_source_with_native_datetime 
apache_beam/io/gcp/bigquery_read_it_test.py::ReadUsingStorageApiTests::test_iobase_source_with_query 
[gw3] PASSED apache_beam/examples/complete/game/leader_board_it_test.py::LeaderBoardIT::test_leader_board_it 
apache_beam/ml/gcp/naturallanguageml_test_it.py::NaturalLanguageMlTestIT::test_analyzing_syntax 
[gw3] SKIPPED apache_beam/ml/gcp/naturallanguageml_test_it.py::NaturalLanguageMlTestIT::test_analyzing_syntax 
apache_beam/ml/gcp/videointelligenceml_test_it.py::VideoIntelligenceMlTestIT::test_label_detection_with_video_context 
[gw3] SKIPPED apache_beam/ml/gcp/videointelligenceml_test_it.py::VideoIntelligenceMlTestIT::test_label_detection_with_video_context 
[gw6] PASSED apache_beam/io/gcp/bigquery_test.py::BigQueryFileLoadsIntegrationTests::test_avro_file_load 
apache_beam/examples/complete/juliaset/juliaset/juliaset_test_it.py::JuliaSetTestIT::test_run_example_with_setup_file <https://ci-beam.apache.org/job/beam_PostCommit_Python311/ws/src/build/gradleenv/2050596099/bin/python3.11>: No module named build
warning: sdist: standard file not found: should have one of README, README.rst, README.txt, README.md

warning: check: missing required meta-data: url

warning: check: missing meta-data: either (author and author_email) or (maintainer and maintainer_email) should be supplied


[gw5] PASSED apache_beam/examples/cookbook/datastore_wordcount_it_test.py::DatastoreWordCountIT::test_datastore_wordcount_it 
apache_beam/io/fileio_test.py::MatchIntegrationTest::test_transform_on_gcs 
[gw7] PASSED apache_beam/examples/complete/autocomplete_test.py::AutocompleteTest::test_autocomplete_it 
apache_beam/examples/dataframe/flight_delays_it_test.py::FlightDelaysTest::test_flight_delays 
[gw0] PASSED apache_beam/io/gcp/bigquery_read_it_test.py::ReadUsingStorageApiTests::test_iobase_source_with_query 
apache_beam/io/gcp/bigquery_read_it_test.py::ReadUsingStorageApiTests::test_iobase_source_with_query_and_filters 
[gw2] PASSED apache_beam/examples/cookbook/bigquery_tornadoes_it_test.py::BigqueryTornadoesIT::test_bigquery_tornadoes_it 
apache_beam/io/parquetio_it_test.py::TestParquetIT::test_parquetio_it 
[gw4] PASSED apache_beam/examples/complete/game/user_score_it_test.py::UserScoreIT::test_user_score_it 
apache_beam/examples/inference/tfx_bsl/tfx_bsl_inference_it_test.py::TFXRunInferenceTests::test_tfx_run_inference_mobilenetv2 
[gw4] SKIPPED apache_beam/examples/inference/tfx_bsl/tfx_bsl_inference_it_test.py::TFXRunInferenceTests::test_tfx_run_inference_mobilenetv2 
apache_beam/ml/inference/base_test.py::RunInferenceBaseTest::test_run_inference_with_side_inputin_streaming 
[gw4] SKIPPED apache_beam/ml/inference/base_test.py::RunInferenceBaseTest::test_run_inference_with_side_inputin_streaming 
[gw6] PASSED apache_beam/examples/complete/juliaset/juliaset/juliaset_test_it.py::JuliaSetTestIT::test_run_example_with_setup_file 
apache_beam/ml/inference/onnx_inference_it_test.py::OnnxInference::test_onnx_run_inference_roberta_sentiment_classification 
[gw6] SKIPPED apache_beam/ml/inference/onnx_inference_it_test.py::OnnxInference::test_onnx_run_inference_roberta_sentiment_classification 
[gw5] PASSED apache_beam/io/fileio_test.py::MatchIntegrationTest::test_transform_on_gcs 
apache_beam/transforms/external_it_test.py::ExternalTransformIT::test_job_python_from_python_it 
[gw2] PASSED apache_beam/io/parquetio_it_test.py::TestParquetIT::test_parquetio_it 
apache_beam/transforms/periodicsequence_it_test.py::PeriodicSequenceIT::test_periodicsequence_outputs_valid_watermarks_it 
[gw2] SKIPPED apache_beam/transforms/periodicsequence_it_test.py::PeriodicSequenceIT::test_periodicsequence_outputs_valid_watermarks_it 
[gw0] PASSED apache_beam/io/gcp/bigquery_read_it_test.py::ReadUsingStorageApiTests::test_iobase_source_with_query_and_filters 
apache_beam/io/gcp/bigquery_read_it_test.py::ReadUsingStorageApiTests::test_iobase_source_with_row_restriction 
[gw7] PASSED apache_beam/examples/dataframe/flight_delays_it_test.py::FlightDelaysTest::test_flight_delays 
[gw5] PASSED apache_beam/transforms/external_it_test.py::ExternalTransformIT::test_job_python_from_python_it 
[gw0] PASSED apache_beam/io/gcp/bigquery_read_it_test.py::ReadUsingStorageApiTests::test_iobase_source_with_row_restriction 
apache_beam/io/gcp/bigquery_read_it_test.py::ReadUsingStorageApiTests::test_iobase_source_with_very_selective_filters 
[gw0] PASSED apache_beam/io/gcp/bigquery_read_it_test.py::ReadUsingStorageApiTests::test_iobase_source_with_very_selective_filters 
apache_beam/io/gcp/bigquery_read_it_test.py::ReadNewTypesTests::test_iobase_source 
[gw1] PASSED apache_beam/io/gcp/datastore/v1new/datastore_write_it_test.py::DatastoreWriteIT::test_datastore_write_limit 
apache_beam/ml/gcp/visionml_test_it.py::VisionMlTestIT::test_text_detection_with_language_hint 
[gw0] PASSED apache_beam/io/gcp/bigquery_read_it_test.py::ReadNewTypesTests::test_iobase_source 
apache_beam/io/gcp/bigquery_read_it_test.py::ReadNewTypesTests::test_native_source 
[gw1] PASSED apache_beam/ml/gcp/visionml_test_it.py::VisionMlTestIT::test_text_detection_with_language_hint 
apache_beam/runners/dataflow/dataflow_exercise_metrics_pipeline_test.py::ExerciseMetricsPipelineTest::test_metrics_it 
[gw1] SKIPPED apache_beam/runners/dataflow/dataflow_exercise_metrics_pipeline_test.py::ExerciseMetricsPipelineTest::test_metrics_it 
[gw0] PASSED apache_beam/io/gcp/bigquery_read_it_test.py::ReadNewTypesTests::test_native_source 
apache_beam/io/gcp/bigquery_read_it_test.py::ReadAllBQTests::test_read_queries 
[gw0] PASSED apache_beam/io/gcp/bigquery_read_it_test.py::ReadAllBQTests::test_read_queries 
apache_beam/io/gcp/bigquery_read_it_test.py::ReadInteractiveRunnerTests::test_read_in_interactive_runner 
[gw0] PASSED apache_beam/io/gcp/bigquery_read_it_test.py::ReadInteractiveRunnerTests::test_read_in_interactive_runner 

=============================== warnings summary ===============================
apache_beam/io/gcp/bigquery.py:2603
  <https://ci-beam.apache.org/job/beam_PostCommit_Python311/ws/src/sdks/python/apache_beam/io/gcp/bigquery.py>:2603: DeprecationWarning: invalid escape sequence '\#'
    """Read data from BigQuery.

apache_beam/io/gcp/bigquery_read_it_test.py::ReadTests::test_native_source
  <https://ci-beam.apache.org/job/beam_PostCommit_Python311/ws/src/sdks/python/apache_beam/io/gcp/bigquery_read_it_test.py>:170: BeamDeprecationWarning: BigQuerySource is deprecated since 2.25.0. Use ReadFromBigQuery instead.
    beam.io.BigQuerySource(query=self.query, use_standard_sql=True)))

apache_beam/io/gcp/bigquery_test.py::PubSubBigQueryIT::test_file_loads
apache_beam/io/gcp/bigquery_test.py::PubSubBigQueryIT::test_streaming_inserts
apache_beam/examples/complete/game/hourly_team_score_it_test.py::HourlyTeamScoreIT::test_hourly_team_score_it
apache_beam/examples/complete/game/game_stats_it_test.py::GameStatsIT::test_game_stats_it
apache_beam/examples/complete/game/leader_board_it_test.py::LeaderBoardIT::test_leader_board_it
  <https://ci-beam.apache.org/job/beam_PostCommit_Python311/ws/src/sdks/python/apache_beam/io/gcp/tests/utils.py>:63: PendingDeprecationWarning: Client.dataset is deprecated and will be removed in a future version. Use a string like 'my_project.my_dataset' or a cloud.google.bigquery.DatasetReference object, instead.
    dataset_ref = client.dataset(unique_dataset_name, project=project)

apache_beam/examples/cookbook/bigquery_tornadoes_it_test.py::BigqueryTornadoesIT::test_bigquery_tornadoes_it
  <https://ci-beam.apache.org/job/beam_PostCommit_Python311/ws/src/sdks/python/apache_beam/io/gcp/tests/utils.py>:100: PendingDeprecationWarning: Client.dataset is deprecated and will be removed in a future version. Use a string like 'my_project.my_dataset' or a cloud.google.bigquery.DatasetReference object, instead.
    table_ref = client.dataset(dataset_id).table(table_id)

apache_beam/examples/dataframe/flight_delays_it_test.py::FlightDelaysTest::test_flight_delays
  <https://ci-beam.apache.org/job/beam_PostCommit_Python311/ws/src/sdks/python/apache_beam/examples/dataframe/flight_delays.py>:47: FutureWarning: The default value of numeric_only in DataFrame.mean is deprecated. In a future version, it will default to False. In addition, specifying 'numeric_only=None' is deprecated. Select only valid columns or specify the value of numeric_only to silence this warning.
    return airline_df[at_top_airports].mean()

apache_beam/io/gcp/bigquery_read_it_test.py::ReadNewTypesTests::test_native_source
  <https://ci-beam.apache.org/job/beam_PostCommit_Python311/ws/src/sdks/python/apache_beam/io/gcp/bigquery_read_it_test.py>:706: BeamDeprecationWarning: BigQuerySource is deprecated since 2.25.0. Use ReadFromBigQuery instead.
    beam.io.BigQuerySource(query=self.query, use_standard_sql=True)))

-- Docs: https://docs.pytest.org/en/stable/how-to/capture-warnings.html
- generated xml file: <https://ci-beam.apache.org/job/beam_PostCommit_Python311/ws/src/sdks/python/pytest_postCommitIT-df-py311.xml> -
=========== 82 passed, 50 skipped, 10 warnings in 5910.08s (1:38:30) ===========

FAILURE: Build failed with an exception.

* Where:
Script '<https://ci-beam.apache.org/job/beam_PostCommit_Python311/ws/src/sdks/python/test-suites/portable/common.gradle'> line: 326

* What went wrong:
Execution failed for task ':sdks:python:test-suites:portable:py311:postCommitPy311IT'.
> Process 'command 'sh'' finished with non-zero exit value 1

* Try:
> Run with --stacktrace option to get the stack trace.
> Run with --info or --debug option to get more log output.
> Get more help at https://help.gradle.org.

Deprecated Gradle features were used in this build, making it incompatible with Gradle 9.0.

You can use '--warning-mode all' to show the individual deprecation warnings and determine if they come from your own scripts or plugins.

For more on this, please refer to https://docs.gradle.org/8.4/userguide/command_line_interface.html#sec:command_line_warnings in the Gradle documentation.

BUILD FAILED in 1h 46m 4s
217 actionable tasks: 152 executed, 61 from cache, 4 up-to-date

Publishing build scan...
https://ge.apache.org/s/mibip5s6zabco

Build step 'Invoke Gradle script' changed build result to FAILURE
Build step 'Invoke Gradle script' marked build as failure

---------------------------------------------------------------------
To unsubscribe, e-mail: builds-unsubscribe@beam.apache.org
For additional commands, e-mail: builds-help@beam.apache.org


Build failed in Jenkins: beam_PostCommit_Python311 #993

Posted by Apache Jenkins Server <je...@builds.apache.org>.
See <https://ci-beam.apache.org/job/beam_PostCommit_Python311/993/display/redirect>

Changes:


------------------------------------------
[...truncated 13.14 MB...]
    self.run()
  File "<https://ci-beam.apache.org/job/beam_PostCommit_Python311/ws/src/build/gradleenv/-1720702906/lib/python3.11/site-packages/grpc/_channel.py",> line 540, in __next__
  File "/usr/lib/python3.11/threading.py", line 975, in run
    for work_request in self._control_stub.Control(get_responses()):
    self._target(*self._args, **self._kwargs)
  File "<https://ci-beam.apache.org/job/beam_PostCommit_Python311/ws/src/build/gradleenv/-1720702906/lib/python3.11/site-packages/grpc/_channel.py",> line 540, in __next__
    return self._next()
  File "<https://ci-beam.apache.org/job/beam_PostCommit_Python311/ws/src/sdks/python/apache_beam/runners/worker/data_plane.py",> line 686, in <lambda>
    return self._next()
           ^^^^^^^^^^^^
  File "<https://ci-beam.apache.org/job/beam_PostCommit_Python311/ws/src/build/gradleenv/-1720702906/lib/python3.11/site-packages/grpc/_channel.py",> line 966, in _next
           ^^^^^^^^^^^^
    target=lambda: self._read_inputs(elements_iterator),
                   ^^^^^^^^^^^^^^^^^^^^^^^^^^^^^^^^^^^^
  File "<https://ci-beam.apache.org/job/beam_PostCommit_Python311/ws/src/sdks/python/apache_beam/runners/worker/data_plane.py",> line 669, in _read_inputs
  File "<https://ci-beam.apache.org/job/beam_PostCommit_Python311/ws/src/build/gradleenv/-1720702906/lib/python3.11/site-packages/grpc/_channel.py",> line 966, in _next
    raise self
    for elements in elements_iterator:
    raise self
  File "<https://ci-beam.apache.org/job/beam_PostCommit_Python311/ws/src/build/gradleenv/-1720702906/lib/python3.11/site-packages/grpc/_channel.py",> line 540, in __next__
grpc._channel._MultiThreadedRendezvous: <_MultiThreadedRendezvous of RPC that terminated with:
	status = StatusCode.UNAVAILABLE
	details = "Socket closed"
	debug_error_string = "UNKNOWN:Error received from peer ipv6:%5B::1%5D:40101 {created_time:"2023-12-12T11:15:15.179426055+00:00", grpc_status:14, grpc_message:"Socket closed"}"
>
    return self._next()
           ^^^^^^^^^^^^
  File "<https://ci-beam.apache.org/job/beam_PostCommit_Python311/ws/src/build/gradleenv/-1720702906/lib/python3.11/site-packages/grpc/_channel.py",> line 966, in _next
grpc._channel._MultiThreadedRendezvous: <_MultiThreadedRendezvous of RPC that terminated with:
	status = StatusCode.UNAVAILABLE
	details = "Socket closed"
	debug_error_string = "UNKNOWN:Error received from peer ipv6:%5B::1%5D:40195 {grpc_message:"Socket closed", grpc_status:14, created_time:"2023-12-12T11:15:15.179415426+00:00"}"
>
    raise self
grpc._channel._MultiThreadedRendezvous: <_MultiThreadedRendezvous of RPC that terminated with:
	status = StatusCode.UNAVAILABLE
	details = "Socket closed"
	debug_error_string = "UNKNOWN:Error received from peer ipv6:%5B::1%5D:34531 {grpc_message:"Socket closed", grpc_status:14, created_time:"2023-12-12T11:15:15.179368808+00:00"}"
>

> Task :sdks:python:test-suites:dataflow:py311:postCommitIT

[gw2] PASSED apache_beam/io/gcp/bigquery_write_it_test.py::BigQueryWriteIntegrationTests::test_big_query_write_insert_non_transient_api_call_error 
apache_beam/io/gcp/bigquery_write_it_test.py::BigQueryWriteIntegrationTests::test_big_query_write_new_types 
[gw1] PASSED apache_beam/ml/gcp/recommendations_ai_test_it.py::RecommendationAIIT::test_predict 
apache_beam/testing/test_stream_it_test.py::TestStreamIntegrationTests::test_basic_execution 
[gw1] SKIPPED apache_beam/testing/test_stream_it_test.py::TestStreamIntegrationTests::test_basic_execution 
apache_beam/testing/test_stream_it_test.py::TestStreamIntegrationTests::test_multiple_outputs 
[gw1] SKIPPED apache_beam/testing/test_stream_it_test.py::TestStreamIntegrationTests::test_multiple_outputs 
apache_beam/testing/test_stream_it_test.py::TestStreamIntegrationTests::test_multiple_outputs_with_watermark_advancement 
[gw1] SKIPPED apache_beam/testing/test_stream_it_test.py::TestStreamIntegrationTests::test_multiple_outputs_with_watermark_advancement 
apache_beam/io/gcp/bigquery_io_read_it_test.py::BigqueryIOReadIT::test_bigquery_read_1M_python 
[gw3] PASSED apache_beam/dataframe/io_it_test.py::ReadUsingReadGbqTests::test_ReadGbq_direct_read_with_project 
apache_beam/dataframe/io_it_test.py::ReadUsingReadGbqTests::test_ReadGbq_export_with_project 
[gw5] PASSED apache_beam/io/gcp/big_query_query_to_table_it_test.py::BigQueryQueryToTableIT::test_big_query_new_types_avro 
apache_beam/io/gcp/big_query_query_to_table_it_test.py::BigQueryQueryToTableIT::test_big_query_standard_sql 
[gw7] PASSED apache_beam/ml/inference/sklearn_inference_it_test.py::SklearnInference::test_sklearn_mnist_classification 
apache_beam/ml/inference/sklearn_inference_it_test.py::SklearnInference::test_sklearn_mnist_classification_large_model 
[gw0] PASSED apache_beam/io/gcp/bigquery_read_it_test.py::ReadTests::test_table_schema_retrieve_specifying_only_table 
apache_beam/io/gcp/bigquery_read_it_test.py::ReadTests::test_table_schema_retrieve_with_direct_read 
[gw1] PASSED apache_beam/io/gcp/bigquery_io_read_it_test.py::BigqueryIOReadIT::test_bigquery_read_1M_python 
apache_beam/io/gcp/bigquery_io_read_it_test.py::BigqueryIOReadIT::test_bigquery_read_custom_1M_python 
[gw3] PASSED apache_beam/dataframe/io_it_test.py::ReadUsingReadGbqTests::test_ReadGbq_export_with_project 
apache_beam/dataframe/io_it_test.py::ReadUsingReadGbqTests::test_ReadGbq_with_computation 
[gw2] PASSED apache_beam/io/gcp/bigquery_write_it_test.py::BigQueryWriteIntegrationTests::test_big_query_write_new_types 
apache_beam/io/gcp/bigquery_write_it_test.py::BigQueryWriteIntegrationTests::test_big_query_write_schema_autodetect 
[gw2] SKIPPED apache_beam/io/gcp/bigquery_write_it_test.py::BigQueryWriteIntegrationTests::test_big_query_write_schema_autodetect 
apache_beam/io/gcp/bigquery_write_it_test.py::BigQueryWriteIntegrationTests::test_big_query_write_without_schema 
[gw7] PASSED apache_beam/ml/inference/sklearn_inference_it_test.py::SklearnInference::test_sklearn_mnist_classification_large_model 
apache_beam/ml/inference/sklearn_inference_it_test.py::SklearnInference::test_sklearn_regression 
[gw7] SKIPPED apache_beam/ml/inference/sklearn_inference_it_test.py::SklearnInference::test_sklearn_regression 
apache_beam/io/gcp/healthcare/dicomio_integration_test.py::DICOMIoIntegrationTest::test_dicom_search_instances 
[gw5] PASSED apache_beam/io/gcp/big_query_query_to_table_it_test.py::BigQueryQueryToTableIT::test_big_query_standard_sql 
apache_beam/examples/dataframe/taxiride_it_test.py::TaxirideIT::test_aggregation 
[gw4] PASSED apache_beam/io/gcp/bigquery_json_it_test.py::BigQueryJsonIT::test_streaming_inserts 
apache_beam/examples/wordcount_it_test.py::WordCountIT::test_wordcount_impersonation_it 
[gw0] PASSED apache_beam/io/gcp/bigquery_read_it_test.py::ReadTests::test_table_schema_retrieve_with_direct_read 
apache_beam/io/gcp/bigquery_read_it_test.py::ReadUsingStorageApiTests::test_iobase_source 
[gw1] PASSED apache_beam/io/gcp/bigquery_io_read_it_test.py::BigqueryIOReadIT::test_bigquery_read_custom_1M_python 
apache_beam/io/gcp/gcsio_integration_test.py::GcsIOIntegrationTest::test_batch_copy_and_delete 
[gw1] PASSED apache_beam/io/gcp/gcsio_integration_test.py::GcsIOIntegrationTest::test_batch_copy_and_delete 
apache_beam/io/gcp/gcsio_integration_test.py::GcsIOIntegrationTest::test_copy 
[gw1] PASSED apache_beam/io/gcp/gcsio_integration_test.py::GcsIOIntegrationTest::test_copy 
apache_beam/examples/complete/autocomplete_test.py::AutocompleteTest::test_autocomplete_it 
[gw3] PASSED apache_beam/dataframe/io_it_test.py::ReadUsingReadGbqTests::test_ReadGbq_with_computation 
apache_beam/io/gcp/pubsub_integration_test.py::PubSubIntegrationTest::test_streaming_data_only 
[gw2] PASSED apache_beam/io/gcp/bigquery_write_it_test.py::BigQueryWriteIntegrationTests::test_big_query_write_without_schema 
apache_beam/ml/gcp/cloud_dlp_it_test.py::CloudDLPIT::test_deidentification 
[gw6] PASSED apache_beam/io/gcp/bigquery_test.py::PubSubBigQueryIT::test_file_loads 
apache_beam/io/gcp/bigquery_test.py::PubSubBigQueryIT::test_streaming_inserts 
[gw7] PASSED apache_beam/io/gcp/healthcare/dicomio_integration_test.py::DICOMIoIntegrationTest::test_dicom_search_instances 
apache_beam/io/gcp/healthcare/dicomio_integration_test.py::DICOMIoIntegrationTest::test_dicom_store_instance_from_gcs 
[gw4] PASSED apache_beam/examples/wordcount_it_test.py::WordCountIT::test_wordcount_impersonation_it 
apache_beam/examples/wordcount_it_test.py::WordCountIT::test_wordcount_it 
[gw5] PASSED apache_beam/examples/dataframe/taxiride_it_test.py::TaxirideIT::test_aggregation 
apache_beam/examples/dataframe/taxiride_it_test.py::TaxirideIT::test_enrich 
[gw0] PASSED apache_beam/io/gcp/bigquery_read_it_test.py::ReadUsingStorageApiTests::test_iobase_source 
apache_beam/io/gcp/bigquery_read_it_test.py::ReadUsingStorageApiTests::test_iobase_source_with_column_selection 
[gw2] PASSED apache_beam/ml/gcp/cloud_dlp_it_test.py::CloudDLPIT::test_deidentification 
apache_beam/ml/gcp/cloud_dlp_it_test.py::CloudDLPIT::test_inspection 
[gw1] PASSED apache_beam/examples/complete/autocomplete_test.py::AutocompleteTest::test_autocomplete_it 
apache_beam/examples/complete/game/game_stats_it_test.py::GameStatsIT::test_game_stats_it 
[gw7] PASSED apache_beam/io/gcp/healthcare/dicomio_integration_test.py::DICOMIoIntegrationTest::test_dicom_store_instance_from_gcs 
apache_beam/examples/fastavro_it_test.py::FastavroIT::test_avro_it 
[gw4] PASSED apache_beam/examples/wordcount_it_test.py::WordCountIT::test_wordcount_it 
apache_beam/examples/streaming_wordcount_it_test.py::StreamingWordCountIT::test_streaming_wordcount_it 
[gw0] PASSED apache_beam/io/gcp/bigquery_read_it_test.py::ReadUsingStorageApiTests::test_iobase_source_with_column_selection 
apache_beam/io/gcp/bigquery_read_it_test.py::ReadUsingStorageApiTests::test_iobase_source_with_column_selection_and_row_restriction 
[gw2] PASSED apache_beam/ml/gcp/cloud_dlp_it_test.py::CloudDLPIT::test_inspection 
apache_beam/examples/complete/game/user_score_it_test.py::UserScoreIT::test_user_score_it 
[gw3] PASSED apache_beam/io/gcp/pubsub_integration_test.py::PubSubIntegrationTest::test_streaming_data_only 
apache_beam/io/gcp/pubsub_integration_test.py::PubSubIntegrationTest::test_streaming_with_attributes 
[gw0] PASSED apache_beam/io/gcp/bigquery_read_it_test.py::ReadUsingStorageApiTests::test_iobase_source_with_column_selection_and_row_restriction 
apache_beam/io/gcp/bigquery_read_it_test.py::ReadUsingStorageApiTests::test_iobase_source_with_column_selection_and_row_restriction_rows 
[gw6] PASSED apache_beam/io/gcp/bigquery_test.py::PubSubBigQueryIT::test_streaming_inserts 
apache_beam/io/gcp/bigquery_test.py::BigQueryFileLoadsIntegrationTests::test_avro_file_load 
[gw7] PASSED apache_beam/examples/fastavro_it_test.py::FastavroIT::test_avro_it 
apache_beam/examples/cookbook/bigquery_tornadoes_it_test.py::BigqueryTornadoesIT::test_bigquery_tornadoes_it 
[gw0] PASSED apache_beam/io/gcp/bigquery_read_it_test.py::ReadUsingStorageApiTests::test_iobase_source_with_column_selection_and_row_restriction_rows 
apache_beam/io/gcp/bigquery_read_it_test.py::ReadUsingStorageApiTests::test_iobase_source_with_native_datetime 
[gw1] PASSED apache_beam/examples/complete/game/game_stats_it_test.py::GameStatsIT::test_game_stats_it 
apache_beam/examples/complete/game/hourly_team_score_it_test.py::HourlyTeamScoreIT::test_hourly_team_score_it 
[gw2] PASSED apache_beam/examples/complete/game/user_score_it_test.py::UserScoreIT::test_user_score_it 
apache_beam/examples/inference/tfx_bsl/tfx_bsl_inference_it_test.py::TFXRunInferenceTests::test_tfx_run_inference_mobilenetv2 
[gw2] SKIPPED apache_beam/examples/inference/tfx_bsl/tfx_bsl_inference_it_test.py::TFXRunInferenceTests::test_tfx_run_inference_mobilenetv2 
apache_beam/ml/gcp/naturallanguageml_test_it.py::NaturalLanguageMlTestIT::test_analyzing_syntax 
[gw2] SKIPPED apache_beam/ml/gcp/naturallanguageml_test_it.py::NaturalLanguageMlTestIT::test_analyzing_syntax 
apache_beam/runners/dataflow/dataflow_exercise_metrics_pipeline_test.py::ExerciseMetricsPipelineTest::test_metrics_it 
[gw2] SKIPPED apache_beam/runners/dataflow/dataflow_exercise_metrics_pipeline_test.py::ExerciseMetricsPipelineTest::test_metrics_it 
apache_beam/transforms/external_it_test.py::ExternalTransformIT::test_job_python_from_python_it 
[gw4] PASSED apache_beam/examples/streaming_wordcount_it_test.py::StreamingWordCountIT::test_streaming_wordcount_it 
apache_beam/examples/cookbook/datastore_wordcount_it_test.py::DatastoreWordCountIT::test_datastore_wordcount_it 
[gw3] PASSED apache_beam/io/gcp/pubsub_integration_test.py::PubSubIntegrationTest::test_streaming_with_attributes 
apache_beam/examples/complete/game/leader_board_it_test.py::LeaderBoardIT::test_leader_board_it 
[gw6] PASSED apache_beam/io/gcp/bigquery_test.py::BigQueryFileLoadsIntegrationTests::test_avro_file_load 
apache_beam/examples/complete/juliaset/juliaset/juliaset_test_it.py::JuliaSetTestIT::test_run_example_with_setup_file 
[gw5] PASSED apache_beam/examples/dataframe/taxiride_it_test.py::TaxirideIT::test_enrich 
apache_beam/examples/streaming_wordcount_debugging_it_test.py::StreamingWordcountDebuggingIT::test_streaming_wordcount_debugging_it 
[gw5] SKIPPED apache_beam/examples/streaming_wordcount_debugging_it_test.py::StreamingWordcountDebuggingIT::test_streaming_wordcount_debugging_it 
apache_beam/examples/dataframe/flight_delays_it_test.py::FlightDelaysTest::test_flight_delays <https://ci-beam.apache.org/job/beam_PostCommit_Python311/ws/src/build/gradleenv/2050596099/bin/python3.11>: No module named build
warning: sdist: standard file not found: should have one of README, README.rst, README.txt, README.md

warning: check: missing required meta-data: url

warning: check: missing meta-data: either (author and author_email) or (maintainer and maintainer_email) should be supplied


[gw7] PASSED apache_beam/examples/cookbook/bigquery_tornadoes_it_test.py::BigqueryTornadoesIT::test_bigquery_tornadoes_it 
apache_beam/io/parquetio_it_test.py::TestParquetIT::test_parquetio_it 
[gw0] PASSED apache_beam/io/gcp/bigquery_read_it_test.py::ReadUsingStorageApiTests::test_iobase_source_with_native_datetime 
apache_beam/io/gcp/bigquery_read_it_test.py::ReadUsingStorageApiTests::test_iobase_source_with_query 
[gw2] PASSED apache_beam/transforms/external_it_test.py::ExternalTransformIT::test_job_python_from_python_it 
apache_beam/transforms/periodicsequence_it_test.py::PeriodicSequenceIT::test_periodicsequence_outputs_valid_watermarks_it 
[gw2] SKIPPED apache_beam/transforms/periodicsequence_it_test.py::PeriodicSequenceIT::test_periodicsequence_outputs_valid_watermarks_it 
[gw4] PASSED apache_beam/examples/cookbook/datastore_wordcount_it_test.py::DatastoreWordCountIT::test_datastore_wordcount_it 
apache_beam/io/gcp/datastore/v1new/datastore_write_it_test.py::DatastoreWriteIT::test_datastore_write_limit 
[gw5] PASSED apache_beam/examples/dataframe/flight_delays_it_test.py::FlightDelaysTest::test_flight_delays 
[gw0] PASSED apache_beam/io/gcp/bigquery_read_it_test.py::ReadUsingStorageApiTests::test_iobase_source_with_query 
apache_beam/io/gcp/bigquery_read_it_test.py::ReadUsingStorageApiTests::test_iobase_source_with_query_and_filters 
[gw7] PASSED apache_beam/io/parquetio_it_test.py::TestParquetIT::test_parquetio_it 
apache_beam/ml/inference/base_test.py::RunInferenceBaseTest::test_run_inference_with_side_inputin_streaming 
[gw7] SKIPPED apache_beam/ml/inference/base_test.py::RunInferenceBaseTest::test_run_inference_with_side_inputin_streaming 
[gw6] PASSED apache_beam/examples/complete/juliaset/juliaset/juliaset_test_it.py::JuliaSetTestIT::test_run_example_with_setup_file 
apache_beam/ml/gcp/visionml_test_it.py::VisionMlTestIT::test_text_detection_with_language_hint 
[gw1] PASSED apache_beam/examples/complete/game/hourly_team_score_it_test.py::HourlyTeamScoreIT::test_hourly_team_score_it 
apache_beam/io/fileio_test.py::MatchIntegrationTest::test_transform_on_gcs 
[gw0] PASSED apache_beam/io/gcp/bigquery_read_it_test.py::ReadUsingStorageApiTests::test_iobase_source_with_query_and_filters 
apache_beam/io/gcp/bigquery_read_it_test.py::ReadUsingStorageApiTests::test_iobase_source_with_row_restriction 
[gw3] PASSED apache_beam/examples/complete/game/leader_board_it_test.py::LeaderBoardIT::test_leader_board_it 
apache_beam/ml/gcp/videointelligenceml_test_it.py::VideoIntelligenceMlTestIT::test_label_detection_with_video_context 
[gw3] SKIPPED apache_beam/ml/gcp/videointelligenceml_test_it.py::VideoIntelligenceMlTestIT::test_label_detection_with_video_context 
[gw6] PASSED apache_beam/ml/gcp/visionml_test_it.py::VisionMlTestIT::test_text_detection_with_language_hint 
[gw1] PASSED apache_beam/io/fileio_test.py::MatchIntegrationTest::test_transform_on_gcs 
apache_beam/ml/inference/onnx_inference_it_test.py::OnnxInference::test_onnx_run_inference_roberta_sentiment_classification 
[gw1] SKIPPED apache_beam/ml/inference/onnx_inference_it_test.py::OnnxInference::test_onnx_run_inference_roberta_sentiment_classification 
[gw0] PASSED apache_beam/io/gcp/bigquery_read_it_test.py::ReadUsingStorageApiTests::test_iobase_source_with_row_restriction 
apache_beam/io/gcp/bigquery_read_it_test.py::ReadUsingStorageApiTests::test_iobase_source_with_very_selective_filters 
[gw0] PASSED apache_beam/io/gcp/bigquery_read_it_test.py::ReadUsingStorageApiTests::test_iobase_source_with_very_selective_filters 
apache_beam/io/gcp/bigquery_read_it_test.py::ReadNewTypesTests::test_iobase_source 
[gw0] PASSED apache_beam/io/gcp/bigquery_read_it_test.py::ReadNewTypesTests::test_iobase_source 
apache_beam/io/gcp/bigquery_read_it_test.py::ReadNewTypesTests::test_native_source 
[gw4] PASSED apache_beam/io/gcp/datastore/v1new/datastore_write_it_test.py::DatastoreWriteIT::test_datastore_write_limit 
[gw0] PASSED apache_beam/io/gcp/bigquery_read_it_test.py::ReadNewTypesTests::test_native_source 
apache_beam/io/gcp/bigquery_read_it_test.py::ReadAllBQTests::test_read_queries 
[gw0] PASSED apache_beam/io/gcp/bigquery_read_it_test.py::ReadAllBQTests::test_read_queries 
apache_beam/io/gcp/bigquery_read_it_test.py::ReadInteractiveRunnerTests::test_read_in_interactive_runner 
[gw0] PASSED apache_beam/io/gcp/bigquery_read_it_test.py::ReadInteractiveRunnerTests::test_read_in_interactive_runner 

=============================== warnings summary ===============================
apache_beam/io/gcp/bigquery.py:2603
  <https://ci-beam.apache.org/job/beam_PostCommit_Python311/ws/src/sdks/python/apache_beam/io/gcp/bigquery.py>:2603: DeprecationWarning: invalid escape sequence '\#'
    """Read data from BigQuery.

apache_beam/io/gcp/bigquery_read_it_test.py::ReadTests::test_native_source
  <https://ci-beam.apache.org/job/beam_PostCommit_Python311/ws/src/sdks/python/apache_beam/io/gcp/bigquery_read_it_test.py>:170: BeamDeprecationWarning: BigQuerySource is deprecated since 2.25.0. Use ReadFromBigQuery instead.
    beam.io.BigQuerySource(query=self.query, use_standard_sql=True)))

apache_beam/io/gcp/bigquery_test.py::PubSubBigQueryIT::test_file_loads
apache_beam/io/gcp/bigquery_test.py::PubSubBigQueryIT::test_streaming_inserts
apache_beam/examples/complete/game/game_stats_it_test.py::GameStatsIT::test_game_stats_it
apache_beam/examples/complete/game/hourly_team_score_it_test.py::HourlyTeamScoreIT::test_hourly_team_score_it
apache_beam/examples/complete/game/leader_board_it_test.py::LeaderBoardIT::test_leader_board_it
  <https://ci-beam.apache.org/job/beam_PostCommit_Python311/ws/src/sdks/python/apache_beam/io/gcp/tests/utils.py>:63: PendingDeprecationWarning: Client.dataset is deprecated and will be removed in a future version. Use a string like 'my_project.my_dataset' or a cloud.google.bigquery.DatasetReference object, instead.
    dataset_ref = client.dataset(unique_dataset_name, project=project)

apache_beam/examples/cookbook/bigquery_tornadoes_it_test.py::BigqueryTornadoesIT::test_bigquery_tornadoes_it
  <https://ci-beam.apache.org/job/beam_PostCommit_Python311/ws/src/sdks/python/apache_beam/io/gcp/tests/utils.py>:100: PendingDeprecationWarning: Client.dataset is deprecated and will be removed in a future version. Use a string like 'my_project.my_dataset' or a cloud.google.bigquery.DatasetReference object, instead.
    table_ref = client.dataset(dataset_id).table(table_id)

apache_beam/examples/dataframe/flight_delays_it_test.py::FlightDelaysTest::test_flight_delays
  <https://ci-beam.apache.org/job/beam_PostCommit_Python311/ws/src/sdks/python/apache_beam/examples/dataframe/flight_delays.py>:47: FutureWarning: The default value of numeric_only in DataFrame.mean is deprecated. In a future version, it will default to False. In addition, specifying 'numeric_only=None' is deprecated. Select only valid columns or specify the value of numeric_only to silence this warning.
    return airline_df[at_top_airports].mean()

apache_beam/io/gcp/bigquery_read_it_test.py::ReadNewTypesTests::test_native_source
  <https://ci-beam.apache.org/job/beam_PostCommit_Python311/ws/src/sdks/python/apache_beam/io/gcp/bigquery_read_it_test.py>:706: BeamDeprecationWarning: BigQuerySource is deprecated since 2.25.0. Use ReadFromBigQuery instead.
    beam.io.BigQuerySource(query=self.query, use_standard_sql=True)))

-- Docs: https://docs.pytest.org/en/stable/how-to/capture-warnings.html
- generated xml file: <https://ci-beam.apache.org/job/beam_PostCommit_Python311/ws/src/sdks/python/pytest_postCommitIT-df-py311.xml> -
=========== 82 passed, 50 skipped, 10 warnings in 6197.75s (1:43:17) ===========

FAILURE: Build failed with an exception.

* Where:
Script '<https://ci-beam.apache.org/job/beam_PostCommit_Python311/ws/src/sdks/python/test-suites/portable/common.gradle'> line: 326

* What went wrong:
Execution failed for task ':sdks:python:test-suites:portable:py311:postCommitPy311IT'.
> Process 'command 'sh'' finished with non-zero exit value 1

* Try:
> Run with --stacktrace option to get the stack trace.
> Run with --info or --debug option to get more log output.
> Get more help at https://help.gradle.org.

Deprecated Gradle features were used in this build, making it incompatible with Gradle 9.0.

You can use '--warning-mode all' to show the individual deprecation warnings and determine if they come from your own scripts or plugins.

For more on this, please refer to https://docs.gradle.org/8.4/userguide/command_line_interface.html#sec:command_line_warnings in the Gradle documentation.

BUILD FAILED in 1h 49m 42s
217 actionable tasks: 152 executed, 61 from cache, 4 up-to-date

Publishing build scan...
https://ge.apache.org/s/jn7cjdjwegws4

Build step 'Invoke Gradle script' changed build result to FAILURE
Build step 'Invoke Gradle script' marked build as failure

---------------------------------------------------------------------
To unsubscribe, e-mail: builds-unsubscribe@beam.apache.org
For additional commands, e-mail: builds-help@beam.apache.org


Build failed in Jenkins: beam_PostCommit_Python311 #992

Posted by Apache Jenkins Server <je...@builds.apache.org>.
See <https://ci-beam.apache.org/job/beam_PostCommit_Python311/992/display/redirect>

Changes:


------------------------------------------
[...truncated 13.14 MB...]
  File "<https://ci-beam.apache.org/job/beam_PostCommit_Python311/ws/src/sdks/python/apache_beam/runners/worker/data_plane.py",> line 669, in _read_inputs
    for elements in elements_iterator:
  File "<https://ci-beam.apache.org/job/beam_PostCommit_Python311/ws/src/build/gradleenv/-1720702906/lib/python3.11/site-packages/grpc/_channel.py",> line 540, in __next__
    return self._next()
           ^^^^^^^^^^^^
  File "<https://ci-beam.apache.org/job/beam_PostCommit_Python311/ws/src/build/gradleenv/-1720702906/lib/python3.11/site-packages/grpc/_channel.py",> line 966, in _next
    raise self
grpc._channel._MultiThreadedRendezvous: <_MultiThreadedRendezvous of RPC that terminated with:
	status = StatusCode.UNAVAILABLE
	details = "recvmsg:Connection reset by peer"
	debug_error_string = "UNKNOWN:Error received from peer ipv6:%5B::1%5D:39387 {grpc_message:"recvmsg:Connection reset by peer", grpc_status:14, created_time:"2023-12-12T05:13:22.380795493+00:00"}"
>
Exception in thread read_grpc_client_inputs:
    return self._next()
Traceback (most recent call last):
           ^^^^^^^^^^^^
    return self._next()
  File "/usr/lib/python3.11/threading.py", line 1038, in _bootstrap_inner
  File "<https://ci-beam.apache.org/job/beam_PostCommit_Python311/ws/src/build/gradleenv/-1720702906/lib/python3.11/site-packages/grpc/_channel.py",> line 966, in _next
           ^^^^^^^^^^^^
  File "<https://ci-beam.apache.org/job/beam_PostCommit_Python311/ws/src/build/gradleenv/-1720702906/lib/python3.11/site-packages/grpc/_channel.py",> line 966, in _next
    self.run()
  File "/usr/lib/python3.11/threading.py", line 975, in run
    raise self
grpc._channel._MultiThreadedRendezvous: <_MultiThreadedRendezvous of RPC that terminated with:
	status = StatusCode.UNAVAILABLE
	details = "Socket closed"
	debug_error_string = "UNKNOWN:Error received from peer ipv6:%5B::1%5D:39153 {created_time:"2023-12-12T05:13:22.380800486+00:00", grpc_status:14, grpc_message:"Socket closed"}"
>
    raise self
    self._target(*self._args, **self._kwargs)
grpc._channel._MultiThreadedRendezvous: <_MultiThreadedRendezvous of RPC that terminated with:
	status = StatusCode.UNAVAILABLE
	details = "Socket closed"
	debug_error_string = "UNKNOWN:Error received from peer ipv6:%5B::1%5D:44127 {created_time:"2023-12-12T05:13:22.380797738+00:00", grpc_status:14, grpc_message:"Socket closed"}"
>
  File "<https://ci-beam.apache.org/job/beam_PostCommit_Python311/ws/src/sdks/python/apache_beam/runners/worker/data_plane.py",> line 686, in <lambda>
    target=lambda: self._read_inputs(elements_iterator),
                   ^^^^^^^^^^^^^^^^^^^^^^^^^^^^^^^^^^^^
  File "<https://ci-beam.apache.org/job/beam_PostCommit_Python311/ws/src/sdks/python/apache_beam/runners/worker/data_plane.py",> line 669, in _read_inputs
    for elements in elements_iterator:
  File "<https://ci-beam.apache.org/job/beam_PostCommit_Python311/ws/src/build/gradleenv/-1720702906/lib/python3.11/site-packages/grpc/_channel.py",> line 540, in __next__
    return self._next()
           ^^^^^^^^^^^^
  File "<https://ci-beam.apache.org/job/beam_PostCommit_Python311/ws/src/build/gradleenv/-1720702906/lib/python3.11/site-packages/grpc/_channel.py",> line 966, in _next
    raise self
grpc._channel._MultiThreadedRendezvous: <_MultiThreadedRendezvous of RPC that terminated with:
	status = StatusCode.UNAVAILABLE
	details = "recvmsg:Connection reset by peer"
	debug_error_string = "UNKNOWN:Error received from peer ipv6:%5B::1%5D:39387 {grpc_message:"recvmsg:Connection reset by peer", grpc_status:14, created_time:"2023-12-12T05:13:22.380795493+00:00"}"
>

> Task :sdks:python:test-suites:dataflow:py311:postCommitIT

[gw0] PASSED apache_beam/io/gcp/bigquery_read_it_test.py::ReadTests::test_table_schema_retrieve 
apache_beam/io/gcp/bigquery_read_it_test.py::ReadTests::test_table_schema_retrieve_specifying_only_table 
[gw6] PASSED apache_beam/ml/inference/sklearn_inference_it_test.py::SklearnInference::test_sklearn_mnist_classification 
apache_beam/ml/inference/sklearn_inference_it_test.py::SklearnInference::test_sklearn_mnist_classification_large_model 
[gw3] PASSED apache_beam/io/gcp/bigquery_io_read_it_test.py::BigqueryIOReadIT::test_bigquery_read_1M_python 
apache_beam/io/gcp/bigquery_io_read_it_test.py::BigqueryIOReadIT::test_bigquery_read_custom_1M_python 
[gw4] PASSED apache_beam/dataframe/io_it_test.py::ReadUsingReadGbqTests::test_ReadGbq_export_with_project 
apache_beam/dataframe/io_it_test.py::ReadUsingReadGbqTests::test_ReadGbq_with_computation 
[gw7] PASSED apache_beam/io/gcp/big_query_query_to_table_it_test.py::BigQueryQueryToTableIT::test_big_query_standard_sql 
apache_beam/examples/dataframe/taxiride_it_test.py::TaxirideIT::test_aggregation 
[gw0] PASSED apache_beam/io/gcp/bigquery_read_it_test.py::ReadTests::test_table_schema_retrieve_specifying_only_table 
apache_beam/io/gcp/bigquery_read_it_test.py::ReadTests::test_table_schema_retrieve_with_direct_read 
[gw5] PASSED apache_beam/io/gcp/bigquery_write_it_test.py::BigQueryWriteIntegrationTests::test_big_query_write_new_types 
apache_beam/io/gcp/bigquery_write_it_test.py::BigQueryWriteIntegrationTests::test_big_query_write_schema_autodetect 
[gw5] SKIPPED apache_beam/io/gcp/bigquery_write_it_test.py::BigQueryWriteIntegrationTests::test_big_query_write_schema_autodetect 
apache_beam/io/gcp/bigquery_write_it_test.py::BigQueryWriteIntegrationTests::test_big_query_write_without_schema 
[gw6] PASSED apache_beam/ml/inference/sklearn_inference_it_test.py::SklearnInference::test_sklearn_mnist_classification_large_model 
apache_beam/ml/inference/sklearn_inference_it_test.py::SklearnInference::test_sklearn_regression 
[gw6] SKIPPED apache_beam/ml/inference/sklearn_inference_it_test.py::SklearnInference::test_sklearn_regression 
apache_beam/io/gcp/healthcare/dicomio_integration_test.py::DICOMIoIntegrationTest::test_dicom_search_instances 
[gw3] PASSED apache_beam/io/gcp/bigquery_io_read_it_test.py::BigqueryIOReadIT::test_bigquery_read_custom_1M_python 
apache_beam/io/gcp/gcsio_integration_test.py::GcsIOIntegrationTest::test_batch_copy_and_delete 
[gw3] PASSED apache_beam/io/gcp/gcsio_integration_test.py::GcsIOIntegrationTest::test_batch_copy_and_delete 
apache_beam/io/gcp/gcsio_integration_test.py::GcsIOIntegrationTest::test_copy 
[gw3] PASSED apache_beam/io/gcp/gcsio_integration_test.py::GcsIOIntegrationTest::test_copy 
apache_beam/examples/complete/autocomplete_test.py::AutocompleteTest::test_autocomplete_it 
[gw1] PASSED apache_beam/io/gcp/bigquery_json_it_test.py::BigQueryJsonIT::test_streaming_inserts 
apache_beam/examples/wordcount_it_test.py::WordCountIT::test_wordcount_impersonation_it 
[gw4] PASSED apache_beam/dataframe/io_it_test.py::ReadUsingReadGbqTests::test_ReadGbq_with_computation 
apache_beam/io/gcp/pubsub_integration_test.py::PubSubIntegrationTest::test_streaming_data_only 
[gw0] PASSED apache_beam/io/gcp/bigquery_read_it_test.py::ReadTests::test_table_schema_retrieve_with_direct_read 
apache_beam/io/gcp/bigquery_read_it_test.py::ReadUsingStorageApiTests::test_iobase_source 
[gw5] PASSED apache_beam/io/gcp/bigquery_write_it_test.py::BigQueryWriteIntegrationTests::test_big_query_write_without_schema 
apache_beam/examples/fastavro_it_test.py::FastavroIT::test_avro_it 
[gw6] PASSED apache_beam/io/gcp/healthcare/dicomio_integration_test.py::DICOMIoIntegrationTest::test_dicom_search_instances 
apache_beam/io/gcp/healthcare/dicomio_integration_test.py::DICOMIoIntegrationTest::test_dicom_store_instance_from_gcs 
[gw7] PASSED apache_beam/examples/dataframe/taxiride_it_test.py::TaxirideIT::test_aggregation 
apache_beam/examples/dataframe/taxiride_it_test.py::TaxirideIT::test_enrich 
[gw2] PASSED apache_beam/io/gcp/bigquery_test.py::PubSubBigQueryIT::test_file_loads 
apache_beam/io/gcp/bigquery_test.py::PubSubBigQueryIT::test_streaming_inserts 
[gw3] PASSED apache_beam/examples/complete/autocomplete_test.py::AutocompleteTest::test_autocomplete_it 
apache_beam/examples/complete/game/game_stats_it_test.py::GameStatsIT::test_game_stats_it 
[gw1] PASSED apache_beam/examples/wordcount_it_test.py::WordCountIT::test_wordcount_impersonation_it 
apache_beam/examples/wordcount_it_test.py::WordCountIT::test_wordcount_it 
[gw0] PASSED apache_beam/io/gcp/bigquery_read_it_test.py::ReadUsingStorageApiTests::test_iobase_source 
apache_beam/io/gcp/bigquery_read_it_test.py::ReadUsingStorageApiTests::test_iobase_source_with_column_selection 
[gw6] PASSED apache_beam/io/gcp/healthcare/dicomio_integration_test.py::DICOMIoIntegrationTest::test_dicom_store_instance_from_gcs 
apache_beam/examples/streaming_wordcount_it_test.py::StreamingWordCountIT::test_streaming_wordcount_it 
[gw1] PASSED apache_beam/examples/wordcount_it_test.py::WordCountIT::test_wordcount_it 
apache_beam/examples/complete/game/leader_board_it_test.py::LeaderBoardIT::test_leader_board_it 
[gw4] PASSED apache_beam/io/gcp/pubsub_integration_test.py::PubSubIntegrationTest::test_streaming_data_only 
apache_beam/io/gcp/pubsub_integration_test.py::PubSubIntegrationTest::test_streaming_with_attributes 
[gw0] PASSED apache_beam/io/gcp/bigquery_read_it_test.py::ReadUsingStorageApiTests::test_iobase_source_with_column_selection 
apache_beam/io/gcp/bigquery_read_it_test.py::ReadUsingStorageApiTests::test_iobase_source_with_column_selection_and_row_restriction 
[gw5] PASSED apache_beam/examples/fastavro_it_test.py::FastavroIT::test_avro_it 
apache_beam/examples/streaming_wordcount_debugging_it_test.py::StreamingWordcountDebuggingIT::test_streaming_wordcount_debugging_it 
[gw5] SKIPPED apache_beam/examples/streaming_wordcount_debugging_it_test.py::StreamingWordcountDebuggingIT::test_streaming_wordcount_debugging_it 
apache_beam/examples/complete/juliaset/juliaset/juliaset_test_it.py::JuliaSetTestIT::test_run_example_with_setup_file <https://ci-beam.apache.org/job/beam_PostCommit_Python311/ws/src/build/gradleenv/2050596099/bin/python3.11>: No module named build
warning: sdist: standard file not found: should have one of README, README.rst, README.txt, README.md

warning: check: missing required meta-data: url

warning: check: missing meta-data: either (author and author_email) or (maintainer and maintainer_email) should be supplied


[gw0] PASSED apache_beam/io/gcp/bigquery_read_it_test.py::ReadUsingStorageApiTests::test_iobase_source_with_column_selection_and_row_restriction 
apache_beam/io/gcp/bigquery_read_it_test.py::ReadUsingStorageApiTests::test_iobase_source_with_column_selection_and_row_restriction_rows 
[gw3] PASSED apache_beam/examples/complete/game/game_stats_it_test.py::GameStatsIT::test_game_stats_it 
apache_beam/examples/complete/game/hourly_team_score_it_test.py::HourlyTeamScoreIT::test_hourly_team_score_it 
[gw5] PASSED apache_beam/examples/complete/juliaset/juliaset/juliaset_test_it.py::JuliaSetTestIT::test_run_example_with_setup_file 
apache_beam/ml/gcp/naturallanguageml_test_it.py::NaturalLanguageMlTestIT::test_analyzing_syntax 
[gw5] SKIPPED apache_beam/ml/gcp/naturallanguageml_test_it.py::NaturalLanguageMlTestIT::test_analyzing_syntax 
apache_beam/ml/gcp/videointelligenceml_test_it.py::VideoIntelligenceMlTestIT::test_label_detection_with_video_context 
[gw5] SKIPPED apache_beam/ml/gcp/videointelligenceml_test_it.py::VideoIntelligenceMlTestIT::test_label_detection_with_video_context 
apache_beam/ml/inference/base_test.py::RunInferenceBaseTest::test_run_inference_with_side_inputin_streaming 
[gw5] SKIPPED apache_beam/ml/inference/base_test.py::RunInferenceBaseTest::test_run_inference_with_side_inputin_streaming 
apache_beam/ml/inference/onnx_inference_it_test.py::OnnxInference::test_onnx_run_inference_roberta_sentiment_classification 
[gw5] SKIPPED apache_beam/ml/inference/onnx_inference_it_test.py::OnnxInference::test_onnx_run_inference_roberta_sentiment_classification 
apache_beam/runners/dataflow/dataflow_exercise_metrics_pipeline_test.py::ExerciseMetricsPipelineTest::test_metrics_it 
[gw5] SKIPPED apache_beam/runners/dataflow/dataflow_exercise_metrics_pipeline_test.py::ExerciseMetricsPipelineTest::test_metrics_it 
apache_beam/transforms/external_it_test.py::ExternalTransformIT::test_job_python_from_python_it 
[gw2] PASSED apache_beam/io/gcp/bigquery_test.py::PubSubBigQueryIT::test_streaming_inserts 
apache_beam/io/gcp/bigquery_test.py::BigQueryFileLoadsIntegrationTests::test_avro_file_load 
[gw6] PASSED apache_beam/examples/streaming_wordcount_it_test.py::StreamingWordCountIT::test_streaming_wordcount_it 
apache_beam/examples/cookbook/bigquery_tornadoes_it_test.py::BigqueryTornadoesIT::test_bigquery_tornadoes_it 
[gw0] PASSED apache_beam/io/gcp/bigquery_read_it_test.py::ReadUsingStorageApiTests::test_iobase_source_with_column_selection_and_row_restriction_rows 
apache_beam/io/gcp/bigquery_read_it_test.py::ReadUsingStorageApiTests::test_iobase_source_with_native_datetime 
[gw7] PASSED apache_beam/examples/dataframe/taxiride_it_test.py::TaxirideIT::test_enrich 
apache_beam/ml/gcp/cloud_dlp_it_test.py::CloudDLPIT::test_deidentification 
[gw4] PASSED apache_beam/io/gcp/pubsub_integration_test.py::PubSubIntegrationTest::test_streaming_with_attributes 
apache_beam/examples/complete/game/user_score_it_test.py::UserScoreIT::test_user_score_it 
[gw1] PASSED apache_beam/examples/complete/game/leader_board_it_test.py::LeaderBoardIT::test_leader_board_it 
apache_beam/examples/inference/tfx_bsl/tfx_bsl_inference_it_test.py::TFXRunInferenceTests::test_tfx_run_inference_mobilenetv2 
[gw1] SKIPPED apache_beam/examples/inference/tfx_bsl/tfx_bsl_inference_it_test.py::TFXRunInferenceTests::test_tfx_run_inference_mobilenetv2 
apache_beam/io/parquetio_it_test.py::TestParquetIT::test_parquetio_it 
[gw5] PASSED apache_beam/transforms/external_it_test.py::ExternalTransformIT::test_job_python_from_python_it 
apache_beam/transforms/periodicsequence_it_test.py::PeriodicSequenceIT::test_periodicsequence_outputs_valid_watermarks_it 
[gw5] SKIPPED apache_beam/transforms/periodicsequence_it_test.py::PeriodicSequenceIT::test_periodicsequence_outputs_valid_watermarks_it 
[gw6] PASSED apache_beam/examples/cookbook/bigquery_tornadoes_it_test.py::BigqueryTornadoesIT::test_bigquery_tornadoes_it 
apache_beam/io/fileio_test.py::MatchIntegrationTest::test_transform_on_gcs 
[gw2] PASSED apache_beam/io/gcp/bigquery_test.py::BigQueryFileLoadsIntegrationTests::test_avro_file_load 
apache_beam/examples/cookbook/datastore_wordcount_it_test.py::DatastoreWordCountIT::test_datastore_wordcount_it 
[gw0] PASSED apache_beam/io/gcp/bigquery_read_it_test.py::ReadUsingStorageApiTests::test_iobase_source_with_native_datetime 
apache_beam/io/gcp/bigquery_read_it_test.py::ReadUsingStorageApiTests::test_iobase_source_with_query 
[gw7] PASSED apache_beam/ml/gcp/cloud_dlp_it_test.py::CloudDLPIT::test_deidentification 
apache_beam/ml/gcp/cloud_dlp_it_test.py::CloudDLPIT::test_inspection 
[gw1] PASSED apache_beam/io/parquetio_it_test.py::TestParquetIT::test_parquetio_it 
[gw6] PASSED apache_beam/io/fileio_test.py::MatchIntegrationTest::test_transform_on_gcs 
[gw2] PASSED apache_beam/examples/cookbook/datastore_wordcount_it_test.py::DatastoreWordCountIT::test_datastore_wordcount_it 
[gw0] PASSED apache_beam/io/gcp/bigquery_read_it_test.py::ReadUsingStorageApiTests::test_iobase_source_with_query 
apache_beam/io/gcp/bigquery_read_it_test.py::ReadUsingStorageApiTests::test_iobase_source_with_query_and_filters 
[gw7] PASSED apache_beam/ml/gcp/cloud_dlp_it_test.py::CloudDLPIT::test_inspection 
[gw3] PASSED apache_beam/examples/complete/game/hourly_team_score_it_test.py::HourlyTeamScoreIT::test_hourly_team_score_it 
apache_beam/examples/dataframe/flight_delays_it_test.py::FlightDelaysTest::test_flight_delays 
[gw4] PASSED apache_beam/examples/complete/game/user_score_it_test.py::UserScoreIT::test_user_score_it 
apache_beam/io/gcp/datastore/v1new/datastore_write_it_test.py::DatastoreWriteIT::test_datastore_write_limit 
[gw0] PASSED apache_beam/io/gcp/bigquery_read_it_test.py::ReadUsingStorageApiTests::test_iobase_source_with_query_and_filters 
apache_beam/io/gcp/bigquery_read_it_test.py::ReadUsingStorageApiTests::test_iobase_source_with_row_restriction 
[gw3] PASSED apache_beam/examples/dataframe/flight_delays_it_test.py::FlightDelaysTest::test_flight_delays 
apache_beam/ml/gcp/visionml_test_it.py::VisionMlTestIT::test_text_detection_with_language_hint 
[gw0] PASSED apache_beam/io/gcp/bigquery_read_it_test.py::ReadUsingStorageApiTests::test_iobase_source_with_row_restriction 
apache_beam/io/gcp/bigquery_read_it_test.py::ReadUsingStorageApiTests::test_iobase_source_with_very_selective_filters 
[gw3] PASSED apache_beam/ml/gcp/visionml_test_it.py::VisionMlTestIT::test_text_detection_with_language_hint 
[gw0] PASSED apache_beam/io/gcp/bigquery_read_it_test.py::ReadUsingStorageApiTests::test_iobase_source_with_very_selective_filters 
apache_beam/io/gcp/bigquery_read_it_test.py::ReadNewTypesTests::test_iobase_source 
[gw0] PASSED apache_beam/io/gcp/bigquery_read_it_test.py::ReadNewTypesTests::test_iobase_source 
apache_beam/io/gcp/bigquery_read_it_test.py::ReadNewTypesTests::test_native_source 
[gw0] PASSED apache_beam/io/gcp/bigquery_read_it_test.py::ReadNewTypesTests::test_native_source 
apache_beam/io/gcp/bigquery_read_it_test.py::ReadAllBQTests::test_read_queries 
[gw4] PASSED apache_beam/io/gcp/datastore/v1new/datastore_write_it_test.py::DatastoreWriteIT::test_datastore_write_limit 
[gw0] PASSED apache_beam/io/gcp/bigquery_read_it_test.py::ReadAllBQTests::test_read_queries 
apache_beam/io/gcp/bigquery_read_it_test.py::ReadInteractiveRunnerTests::test_read_in_interactive_runner 
[gw0] PASSED apache_beam/io/gcp/bigquery_read_it_test.py::ReadInteractiveRunnerTests::test_read_in_interactive_runner 

=============================== warnings summary ===============================
apache_beam/io/gcp/bigquery.py:2603
  <https://ci-beam.apache.org/job/beam_PostCommit_Python311/ws/src/sdks/python/apache_beam/io/gcp/bigquery.py>:2603: DeprecationWarning: invalid escape sequence '\#'
    """Read data from BigQuery.

apache_beam/io/gcp/bigquery_read_it_test.py::ReadTests::test_native_source
  <https://ci-beam.apache.org/job/beam_PostCommit_Python311/ws/src/sdks/python/apache_beam/io/gcp/bigquery_read_it_test.py>:170: BeamDeprecationWarning: BigQuerySource is deprecated since 2.25.0. Use ReadFromBigQuery instead.
    beam.io.BigQuerySource(query=self.query, use_standard_sql=True)))

apache_beam/io/gcp/bigquery_test.py::PubSubBigQueryIT::test_file_loads
apache_beam/examples/complete/game/game_stats_it_test.py::GameStatsIT::test_game_stats_it
apache_beam/io/gcp/bigquery_test.py::PubSubBigQueryIT::test_streaming_inserts
apache_beam/examples/complete/game/leader_board_it_test.py::LeaderBoardIT::test_leader_board_it
apache_beam/examples/complete/game/hourly_team_score_it_test.py::HourlyTeamScoreIT::test_hourly_team_score_it
  <https://ci-beam.apache.org/job/beam_PostCommit_Python311/ws/src/sdks/python/apache_beam/io/gcp/tests/utils.py>:63: PendingDeprecationWarning: Client.dataset is deprecated and will be removed in a future version. Use a string like 'my_project.my_dataset' or a cloud.google.bigquery.DatasetReference object, instead.
    dataset_ref = client.dataset(unique_dataset_name, project=project)

apache_beam/examples/cookbook/bigquery_tornadoes_it_test.py::BigqueryTornadoesIT::test_bigquery_tornadoes_it
  <https://ci-beam.apache.org/job/beam_PostCommit_Python311/ws/src/sdks/python/apache_beam/io/gcp/tests/utils.py>:100: PendingDeprecationWarning: Client.dataset is deprecated and will be removed in a future version. Use a string like 'my_project.my_dataset' or a cloud.google.bigquery.DatasetReference object, instead.
    table_ref = client.dataset(dataset_id).table(table_id)

apache_beam/examples/dataframe/flight_delays_it_test.py::FlightDelaysTest::test_flight_delays
  <https://ci-beam.apache.org/job/beam_PostCommit_Python311/ws/src/sdks/python/apache_beam/examples/dataframe/flight_delays.py>:47: FutureWarning: The default value of numeric_only in DataFrame.mean is deprecated. In a future version, it will default to False. In addition, specifying 'numeric_only=None' is deprecated. Select only valid columns or specify the value of numeric_only to silence this warning.
    return airline_df[at_top_airports].mean()

apache_beam/io/gcp/bigquery_read_it_test.py::ReadNewTypesTests::test_native_source
  <https://ci-beam.apache.org/job/beam_PostCommit_Python311/ws/src/sdks/python/apache_beam/io/gcp/bigquery_read_it_test.py>:706: BeamDeprecationWarning: BigQuerySource is deprecated since 2.25.0. Use ReadFromBigQuery instead.
    beam.io.BigQuerySource(query=self.query, use_standard_sql=True)))

-- Docs: https://docs.pytest.org/en/stable/how-to/capture-warnings.html
- generated xml file: <https://ci-beam.apache.org/job/beam_PostCommit_Python311/ws/src/sdks/python/pytest_postCommitIT-df-py311.xml> -
=========== 82 passed, 50 skipped, 10 warnings in 6035.35s (1:40:35) ===========

FAILURE: Build failed with an exception.

* Where:
Script '<https://ci-beam.apache.org/job/beam_PostCommit_Python311/ws/src/sdks/python/test-suites/portable/common.gradle'> line: 326

* What went wrong:
Execution failed for task ':sdks:python:test-suites:portable:py311:postCommitPy311IT'.
> Process 'command 'sh'' finished with non-zero exit value 1

* Try:
> Run with --stacktrace option to get the stack trace.
> Run with --info or --debug option to get more log output.
> Get more help at https://help.gradle.org.

Deprecated Gradle features were used in this build, making it incompatible with Gradle 9.0.

You can use '--warning-mode all' to show the individual deprecation warnings and determine if they come from your own scripts or plugins.

For more on this, please refer to https://docs.gradle.org/8.4/userguide/command_line_interface.html#sec:command_line_warnings in the Gradle documentation.

BUILD FAILED in 1h 46m 33s
217 actionable tasks: 152 executed, 61 from cache, 4 up-to-date

Publishing build scan...
https://ge.apache.org/s/aaxin5mia7ijs

Build step 'Invoke Gradle script' changed build result to FAILURE
Build step 'Invoke Gradle script' marked build as failure

---------------------------------------------------------------------
To unsubscribe, e-mail: builds-unsubscribe@beam.apache.org
For additional commands, e-mail: builds-help@beam.apache.org


Build failed in Jenkins: beam_PostCommit_Python311 #991

Posted by Apache Jenkins Server <je...@builds.apache.org>.
See <https://ci-beam.apache.org/job/beam_PostCommit_Python311/991/display/redirect>

Changes:


------------------------------------------
[...truncated 13.10 MB...]
    raise self
grpc._channel._MultiThreadedRendezvous: <_MultiThreadedRendezvous of RPC that terminated with:
	status = StatusCode.UNAVAILABLE
	details = "recvmsg:Connection reset by peer"
	debug_error_string = "UNKNOWN:Error received from peer ipv6:%5B::1%5D:45167 {grpc_message:"recvmsg:Connection reset by peer", grpc_status:14, created_time:"2023-12-11T23:14:55.745189519+00:00"}"
>
Exception in thread read_grpc_client_inputs:
Traceback (most recent call last):
  File "/usr/lib/python3.11/threading.py", line 1038, in _bootstrap_inner
    self._target(*self._args, **self._kwargs)
    self.run()
    for work_request in self._control_stub.Control(get_responses()):
  File "/usr/lib/python3.11/threading.py", line 975, in run
  File "<https://ci-beam.apache.org/job/beam_PostCommit_Python311/ws/src/build/gradleenv/-1720702906/lib/python3.11/site-packages/grpc/_channel.py",> line 540, in __next__
  File "<https://ci-beam.apache.org/job/beam_PostCommit_Python311/ws/src/sdks/python/apache_beam/runners/worker/sdk_worker.py",> line 1035, in pull_responses
    self._target(*self._args, **self._kwargs)
  File "<https://ci-beam.apache.org/job/beam_PostCommit_Python311/ws/src/sdks/python/apache_beam/runners/worker/data_plane.py",> line 686, in <lambda>
    return self._next()
           ^^^^^^^^^^^^
  File "<https://ci-beam.apache.org/job/beam_PostCommit_Python311/ws/src/build/gradleenv/-1720702906/lib/python3.11/site-packages/grpc/_channel.py",> line 966, in _next
    target=lambda: self._read_inputs(elements_iterator),
                   ^^^^^^^^^^^^^^^^^^^^^^^^^^^^^^^^^^^^
  File "<https://ci-beam.apache.org/job/beam_PostCommit_Python311/ws/src/sdks/python/apache_beam/runners/worker/data_plane.py",> line 669, in _read_inputs
    for response in responses:
    raise self
  File "<https://ci-beam.apache.org/job/beam_PostCommit_Python311/ws/src/build/gradleenv/-1720702906/lib/python3.11/site-packages/grpc/_channel.py",> line 540, in __next__
grpc._channel._MultiThreadedRendezvous: <_MultiThreadedRendezvous of RPC that terminated with:
	status = StatusCode.UNAVAILABLE
	details = "recvmsg:Connection reset by peer"
	debug_error_string = "UNKNOWN:Error received from peer ipv6:%5B::1%5D:34247 {created_time:"2023-12-11T23:14:55.74525148+00:00", grpc_status:14, grpc_message:"recvmsg:Connection reset by peer"}"
>
    for elements in elements_iterator:
  File "<https://ci-beam.apache.org/job/beam_PostCommit_Python311/ws/src/build/gradleenv/-1720702906/lib/python3.11/site-packages/grpc/_channel.py",> line 540, in __next__
    return self._next()
           ^^^^^^^^^^^^
  File "<https://ci-beam.apache.org/job/beam_PostCommit_Python311/ws/src/build/gradleenv/-1720702906/lib/python3.11/site-packages/grpc/_channel.py",> line 966, in _next
    return self._next()
           ^^^^^^^^^^^^
  File "<https://ci-beam.apache.org/job/beam_PostCommit_Python311/ws/src/build/gradleenv/-1720702906/lib/python3.11/site-packages/grpc/_channel.py",> line 966, in _next
    raise self
grpc._channel._MultiThreadedRendezvous: <_MultiThreadedRendezvous of RPC that terminated with:
	status = StatusCode.UNAVAILABLE
	details = "Socket closed"
	debug_error_string = "UNKNOWN:Error received from peer ipv6:%5B::1%5D:37723 {grpc_message:"Socket closed", grpc_status:14, created_time:"2023-12-11T23:14:55.745215555+00:00"}"
>
    raise self
grpc._channel._MultiThreadedRendezvous: <_MultiThreadedRendezvous of RPC that terminated with:
	status = StatusCode.UNAVAILABLE
	details = "recvmsg:Connection reset by peer"
	debug_error_string = "UNKNOWN:Error received from peer ipv6:%5B::1%5D:45167 {grpc_message:"recvmsg:Connection reset by peer", grpc_status:14, created_time:"2023-12-11T23:14:55.745189519+00:00"}"
>

> Task :sdks:python:test-suites:dataflow:py311:postCommitIT

[gw4] PASSED apache_beam/io/gcp/bigquery_read_it_test.py::ReadTests::test_table_schema_retrieve 
apache_beam/io/gcp/bigquery_read_it_test.py::ReadTests::test_table_schema_retrieve_specifying_only_table 
[gw1] PASSED apache_beam/io/gcp/bigquery_io_read_it_test.py::BigqueryIOReadIT::test_bigquery_read_1M_python 
apache_beam/io/gcp/bigquery_io_read_it_test.py::BigqueryIOReadIT::test_bigquery_read_custom_1M_python 
[gw5] PASSED apache_beam/io/gcp/big_query_query_to_table_it_test.py::BigQueryQueryToTableIT::test_big_query_new_types_avro 
apache_beam/io/gcp/big_query_query_to_table_it_test.py::BigQueryQueryToTableIT::test_big_query_standard_sql 
[gw7] PASSED apache_beam/io/gcp/bigquery_write_it_test.py::BigQueryWriteIntegrationTests::test_big_query_write_insert_non_transient_api_call_error 
apache_beam/io/gcp/bigquery_write_it_test.py::BigQueryWriteIntegrationTests::test_big_query_write_new_types 
[gw0] PASSED apache_beam/dataframe/io_it_test.py::ReadUsingReadGbqTests::test_ReadGbq_export_with_project 
apache_beam/dataframe/io_it_test.py::ReadUsingReadGbqTests::test_ReadGbq_with_computation 
[gw6] PASSED apache_beam/ml/inference/sklearn_inference_it_test.py::SklearnInference::test_sklearn_mnist_classification 
apache_beam/ml/inference/sklearn_inference_it_test.py::SklearnInference::test_sklearn_mnist_classification_large_model 
[gw4] PASSED apache_beam/io/gcp/bigquery_read_it_test.py::ReadTests::test_table_schema_retrieve_specifying_only_table 
apache_beam/io/gcp/bigquery_read_it_test.py::ReadTests::test_table_schema_retrieve_with_direct_read 
[gw1] PASSED apache_beam/io/gcp/bigquery_io_read_it_test.py::BigqueryIOReadIT::test_bigquery_read_custom_1M_python 
apache_beam/io/gcp/gcsio_integration_test.py::GcsIOIntegrationTest::test_batch_copy_and_delete 
[gw1] PASSED apache_beam/io/gcp/gcsio_integration_test.py::GcsIOIntegrationTest::test_batch_copy_and_delete 
apache_beam/io/gcp/gcsio_integration_test.py::GcsIOIntegrationTest::test_copy 
[gw1] PASSED apache_beam/io/gcp/gcsio_integration_test.py::GcsIOIntegrationTest::test_copy 
apache_beam/ml/gcp/cloud_dlp_it_test.py::CloudDLPIT::test_deidentification 
[gw2] PASSED apache_beam/io/gcp/bigquery_json_it_test.py::BigQueryJsonIT::test_streaming_inserts 
apache_beam/examples/wordcount_it_test.py::WordCountIT::test_wordcount_impersonation_it 
[gw7] PASSED apache_beam/io/gcp/bigquery_write_it_test.py::BigQueryWriteIntegrationTests::test_big_query_write_new_types 
apache_beam/io/gcp/bigquery_write_it_test.py::BigQueryWriteIntegrationTests::test_big_query_write_schema_autodetect 
[gw7] SKIPPED apache_beam/io/gcp/bigquery_write_it_test.py::BigQueryWriteIntegrationTests::test_big_query_write_schema_autodetect 
apache_beam/io/gcp/bigquery_write_it_test.py::BigQueryWriteIntegrationTests::test_big_query_write_without_schema 
[gw5] PASSED apache_beam/io/gcp/big_query_query_to_table_it_test.py::BigQueryQueryToTableIT::test_big_query_standard_sql 
apache_beam/examples/dataframe/taxiride_it_test.py::TaxirideIT::test_aggregation 
[gw0] PASSED apache_beam/dataframe/io_it_test.py::ReadUsingReadGbqTests::test_ReadGbq_with_computation 
apache_beam/io/gcp/pubsub_integration_test.py::PubSubIntegrationTest::test_streaming_data_only 
[gw3] PASSED apache_beam/io/gcp/bigquery_test.py::PubSubBigQueryIT::test_file_loads 
apache_beam/io/gcp/bigquery_test.py::PubSubBigQueryIT::test_streaming_inserts 
[gw6] PASSED apache_beam/ml/inference/sklearn_inference_it_test.py::SklearnInference::test_sklearn_mnist_classification_large_model 
apache_beam/ml/inference/sklearn_inference_it_test.py::SklearnInference::test_sklearn_regression 
[gw6] SKIPPED apache_beam/ml/inference/sklearn_inference_it_test.py::SklearnInference::test_sklearn_regression 
apache_beam/io/gcp/healthcare/dicomio_integration_test.py::DICOMIoIntegrationTest::test_dicom_search_instances 
[gw4] PASSED apache_beam/io/gcp/bigquery_read_it_test.py::ReadTests::test_table_schema_retrieve_with_direct_read 
apache_beam/io/gcp/bigquery_read_it_test.py::ReadUsingStorageApiTests::test_iobase_source 
[gw1] PASSED apache_beam/ml/gcp/cloud_dlp_it_test.py::CloudDLPIT::test_deidentification 
apache_beam/ml/gcp/cloud_dlp_it_test.py::CloudDLPIT::test_inspection 
[gw2] PASSED apache_beam/examples/wordcount_it_test.py::WordCountIT::test_wordcount_impersonation_it 
apache_beam/examples/wordcount_it_test.py::WordCountIT::test_wordcount_it 
[gw7] PASSED apache_beam/io/gcp/bigquery_write_it_test.py::BigQueryWriteIntegrationTests::test_big_query_write_without_schema 
apache_beam/examples/streaming_wordcount_it_test.py::StreamingWordCountIT::test_streaming_wordcount_it 
[gw6] PASSED apache_beam/io/gcp/healthcare/dicomio_integration_test.py::DICOMIoIntegrationTest::test_dicom_search_instances 
apache_beam/io/gcp/healthcare/dicomio_integration_test.py::DICOMIoIntegrationTest::test_dicom_store_instance_from_gcs 
[gw5] PASSED apache_beam/examples/dataframe/taxiride_it_test.py::TaxirideIT::test_aggregation 
apache_beam/examples/dataframe/taxiride_it_test.py::TaxirideIT::test_enrich 
[gw1] PASSED apache_beam/ml/gcp/cloud_dlp_it_test.py::CloudDLPIT::test_inspection 
apache_beam/examples/fastavro_it_test.py::FastavroIT::test_avro_it 
[gw0] PASSED apache_beam/io/gcp/pubsub_integration_test.py::PubSubIntegrationTest::test_streaming_data_only 
apache_beam/io/gcp/pubsub_integration_test.py::PubSubIntegrationTest::test_streaming_with_attributes 
[gw6] PASSED apache_beam/io/gcp/healthcare/dicomio_integration_test.py::DICOMIoIntegrationTest::test_dicom_store_instance_from_gcs 
apache_beam/examples/complete/game/user_score_it_test.py::UserScoreIT::test_user_score_it 
[gw4] PASSED apache_beam/io/gcp/bigquery_read_it_test.py::ReadUsingStorageApiTests::test_iobase_source 
apache_beam/io/gcp/bigquery_read_it_test.py::ReadUsingStorageApiTests::test_iobase_source_with_column_selection 
[gw2] PASSED apache_beam/examples/wordcount_it_test.py::WordCountIT::test_wordcount_it 
apache_beam/examples/streaming_wordcount_debugging_it_test.py::StreamingWordcountDebuggingIT::test_streaming_wordcount_debugging_it 
[gw2] SKIPPED apache_beam/examples/streaming_wordcount_debugging_it_test.py::StreamingWordcountDebuggingIT::test_streaming_wordcount_debugging_it 
apache_beam/examples/cookbook/bigquery_tornadoes_it_test.py::BigqueryTornadoesIT::test_bigquery_tornadoes_it 
[gw4] PASSED apache_beam/io/gcp/bigquery_read_it_test.py::ReadUsingStorageApiTests::test_iobase_source_with_column_selection 
apache_beam/io/gcp/bigquery_read_it_test.py::ReadUsingStorageApiTests::test_iobase_source_with_column_selection_and_row_restriction 
[gw3] PASSED apache_beam/io/gcp/bigquery_test.py::PubSubBigQueryIT::test_streaming_inserts 
apache_beam/io/gcp/bigquery_test.py::BigQueryFileLoadsIntegrationTests::test_avro_file_load 
[gw7] PASSED apache_beam/examples/streaming_wordcount_it_test.py::StreamingWordCountIT::test_streaming_wordcount_it 
apache_beam/examples/complete/autocomplete_test.py::AutocompleteTest::test_autocomplete_it 
[gw2] PASSED apache_beam/examples/cookbook/bigquery_tornadoes_it_test.py::BigqueryTornadoesIT::test_bigquery_tornadoes_it 
apache_beam/ml/gcp/naturallanguageml_test_it.py::NaturalLanguageMlTestIT::test_analyzing_syntax 
[gw2] SKIPPED apache_beam/ml/gcp/naturallanguageml_test_it.py::NaturalLanguageMlTestIT::test_analyzing_syntax 
apache_beam/ml/gcp/videointelligenceml_test_it.py::VideoIntelligenceMlTestIT::test_label_detection_with_video_context 
[gw2] SKIPPED apache_beam/ml/gcp/videointelligenceml_test_it.py::VideoIntelligenceMlTestIT::test_label_detection_with_video_context 
apache_beam/ml/inference/onnx_inference_it_test.py::OnnxInference::test_onnx_run_inference_roberta_sentiment_classification 
[gw2] SKIPPED apache_beam/ml/inference/onnx_inference_it_test.py::OnnxInference::test_onnx_run_inference_roberta_sentiment_classification 
apache_beam/runners/dataflow/dataflow_exercise_metrics_pipeline_test.py::ExerciseMetricsPipelineTest::test_metrics_it 
[gw2] SKIPPED apache_beam/runners/dataflow/dataflow_exercise_metrics_pipeline_test.py::ExerciseMetricsPipelineTest::test_metrics_it 
apache_beam/transforms/external_it_test.py::ExternalTransformIT::test_job_python_from_python_it 
[gw1] PASSED apache_beam/examples/fastavro_it_test.py::FastavroIT::test_avro_it 
apache_beam/examples/complete/juliaset/juliaset/juliaset_test_it.py::JuliaSetTestIT::test_run_example_with_setup_file 
[gw4] PASSED apache_beam/io/gcp/bigquery_read_it_test.py::ReadUsingStorageApiTests::test_iobase_source_with_column_selection_and_row_restriction 
apache_beam/io/gcp/bigquery_read_it_test.py::ReadUsingStorageApiTests::test_iobase_source_with_column_selection_and_row_restriction_rows <https://ci-beam.apache.org/job/beam_PostCommit_Python311/ws/src/build/gradleenv/2050596099/bin/python3.11>: No module named build
warning: sdist: standard file not found: should have one of README, README.rst, README.txt, README.md

warning: check: missing required meta-data: url

warning: check: missing meta-data: either (author and author_email) or (maintainer and maintainer_email) should be supplied


[gw0] PASSED apache_beam/io/gcp/pubsub_integration_test.py::PubSubIntegrationTest::test_streaming_with_attributes 
apache_beam/examples/complete/game/hourly_team_score_it_test.py::HourlyTeamScoreIT::test_hourly_team_score_it 
[gw3] PASSED apache_beam/io/gcp/bigquery_test.py::BigQueryFileLoadsIntegrationTests::test_avro_file_load 
apache_beam/examples/complete/game/leader_board_it_test.py::LeaderBoardIT::test_leader_board_it 
[gw7] PASSED apache_beam/examples/complete/autocomplete_test.py::AutocompleteTest::test_autocomplete_it 
apache_beam/examples/cookbook/datastore_wordcount_it_test.py::DatastoreWordCountIT::test_datastore_wordcount_it 
[gw6] PASSED apache_beam/examples/complete/game/user_score_it_test.py::UserScoreIT::test_user_score_it 
apache_beam/examples/dataframe/flight_delays_it_test.py::FlightDelaysTest::test_flight_delays 
[gw2] PASSED apache_beam/transforms/external_it_test.py::ExternalTransformIT::test_job_python_from_python_it 
apache_beam/transforms/periodicsequence_it_test.py::PeriodicSequenceIT::test_periodicsequence_outputs_valid_watermarks_it 
[gw2] SKIPPED apache_beam/transforms/periodicsequence_it_test.py::PeriodicSequenceIT::test_periodicsequence_outputs_valid_watermarks_it 
[gw4] PASSED apache_beam/io/gcp/bigquery_read_it_test.py::ReadUsingStorageApiTests::test_iobase_source_with_column_selection_and_row_restriction_rows 
apache_beam/io/gcp/bigquery_read_it_test.py::ReadUsingStorageApiTests::test_iobase_source_with_native_datetime 
[gw1] PASSED apache_beam/examples/complete/juliaset/juliaset/juliaset_test_it.py::JuliaSetTestIT::test_run_example_with_setup_file 
apache_beam/io/fileio_test.py::MatchIntegrationTest::test_transform_on_gcs 
[gw5] PASSED apache_beam/examples/dataframe/taxiride_it_test.py::TaxirideIT::test_enrich 
apache_beam/examples/complete/game/game_stats_it_test.py::GameStatsIT::test_game_stats_it 
[gw7] PASSED apache_beam/examples/cookbook/datastore_wordcount_it_test.py::DatastoreWordCountIT::test_datastore_wordcount_it 
apache_beam/ml/inference/base_test.py::RunInferenceBaseTest::test_run_inference_with_side_inputin_streaming 
[gw7] SKIPPED apache_beam/ml/inference/base_test.py::RunInferenceBaseTest::test_run_inference_with_side_inputin_streaming 
[gw6] PASSED apache_beam/examples/dataframe/flight_delays_it_test.py::FlightDelaysTest::test_flight_delays 
apache_beam/io/gcp/datastore/v1new/datastore_write_it_test.py::DatastoreWriteIT::test_datastore_write_limit 
[gw4] PASSED apache_beam/io/gcp/bigquery_read_it_test.py::ReadUsingStorageApiTests::test_iobase_source_with_native_datetime 
apache_beam/io/gcp/bigquery_read_it_test.py::ReadUsingStorageApiTests::test_iobase_source_with_query 
[gw1] PASSED apache_beam/io/fileio_test.py::MatchIntegrationTest::test_transform_on_gcs 
[gw3] PASSED apache_beam/examples/complete/game/leader_board_it_test.py::LeaderBoardIT::test_leader_board_it 
apache_beam/ml/gcp/visionml_test_it.py::VisionMlTestIT::test_text_detection_with_language_hint 
[gw0] PASSED apache_beam/examples/complete/game/hourly_team_score_it_test.py::HourlyTeamScoreIT::test_hourly_team_score_it 
apache_beam/io/parquetio_it_test.py::TestParquetIT::test_parquetio_it 
[gw4] PASSED apache_beam/io/gcp/bigquery_read_it_test.py::ReadUsingStorageApiTests::test_iobase_source_with_query 
apache_beam/io/gcp/bigquery_read_it_test.py::ReadUsingStorageApiTests::test_iobase_source_with_query_and_filters 
[gw3] PASSED apache_beam/ml/gcp/visionml_test_it.py::VisionMlTestIT::test_text_detection_with_language_hint 
[gw0] PASSED apache_beam/io/parquetio_it_test.py::TestParquetIT::test_parquetio_it 
[gw4] PASSED apache_beam/io/gcp/bigquery_read_it_test.py::ReadUsingStorageApiTests::test_iobase_source_with_query_and_filters 
apache_beam/io/gcp/bigquery_read_it_test.py::ReadUsingStorageApiTests::test_iobase_source_with_row_restriction 
[gw5] PASSED apache_beam/examples/complete/game/game_stats_it_test.py::GameStatsIT::test_game_stats_it 
apache_beam/examples/inference/tfx_bsl/tfx_bsl_inference_it_test.py::TFXRunInferenceTests::test_tfx_run_inference_mobilenetv2 
[gw5] SKIPPED apache_beam/examples/inference/tfx_bsl/tfx_bsl_inference_it_test.py::TFXRunInferenceTests::test_tfx_run_inference_mobilenetv2 
[gw4] PASSED apache_beam/io/gcp/bigquery_read_it_test.py::ReadUsingStorageApiTests::test_iobase_source_with_row_restriction 
apache_beam/io/gcp/bigquery_read_it_test.py::ReadUsingStorageApiTests::test_iobase_source_with_very_selective_filters 
[gw4] PASSED apache_beam/io/gcp/bigquery_read_it_test.py::ReadUsingStorageApiTests::test_iobase_source_with_very_selective_filters 
apache_beam/io/gcp/bigquery_read_it_test.py::ReadNewTypesTests::test_iobase_source 
[gw6] PASSED apache_beam/io/gcp/datastore/v1new/datastore_write_it_test.py::DatastoreWriteIT::test_datastore_write_limit 
[gw4] PASSED apache_beam/io/gcp/bigquery_read_it_test.py::ReadNewTypesTests::test_iobase_source 
apache_beam/io/gcp/bigquery_read_it_test.py::ReadNewTypesTests::test_native_source 
[gw4] PASSED apache_beam/io/gcp/bigquery_read_it_test.py::ReadNewTypesTests::test_native_source 
apache_beam/io/gcp/bigquery_read_it_test.py::ReadAllBQTests::test_read_queries 
[gw4] PASSED apache_beam/io/gcp/bigquery_read_it_test.py::ReadAllBQTests::test_read_queries 
apache_beam/io/gcp/bigquery_read_it_test.py::ReadInteractiveRunnerTests::test_read_in_interactive_runner 
[gw4] PASSED apache_beam/io/gcp/bigquery_read_it_test.py::ReadInteractiveRunnerTests::test_read_in_interactive_runner 

=============================== warnings summary ===============================
apache_beam/io/gcp/bigquery_read_it_test.py::ReadTests::test_native_source
  <https://ci-beam.apache.org/job/beam_PostCommit_Python311/ws/src/sdks/python/apache_beam/io/gcp/bigquery_read_it_test.py>:170: BeamDeprecationWarning: BigQuerySource is deprecated since 2.25.0. Use ReadFromBigQuery instead.
    beam.io.BigQuerySource(query=self.query, use_standard_sql=True)))

apache_beam/io/gcp/bigquery_test.py::PubSubBigQueryIT::test_file_loads
apache_beam/io/gcp/bigquery_test.py::PubSubBigQueryIT::test_streaming_inserts
apache_beam/examples/complete/game/leader_board_it_test.py::LeaderBoardIT::test_leader_board_it
apache_beam/examples/complete/game/hourly_team_score_it_test.py::HourlyTeamScoreIT::test_hourly_team_score_it
apache_beam/examples/complete/game/game_stats_it_test.py::GameStatsIT::test_game_stats_it
  <https://ci-beam.apache.org/job/beam_PostCommit_Python311/ws/src/sdks/python/apache_beam/io/gcp/tests/utils.py>:63: PendingDeprecationWarning: Client.dataset is deprecated and will be removed in a future version. Use a string like 'my_project.my_dataset' or a cloud.google.bigquery.DatasetReference object, instead.
    dataset_ref = client.dataset(unique_dataset_name, project=project)

apache_beam/examples/cookbook/bigquery_tornadoes_it_test.py::BigqueryTornadoesIT::test_bigquery_tornadoes_it
  <https://ci-beam.apache.org/job/beam_PostCommit_Python311/ws/src/sdks/python/apache_beam/io/gcp/tests/utils.py>:100: PendingDeprecationWarning: Client.dataset is deprecated and will be removed in a future version. Use a string like 'my_project.my_dataset' or a cloud.google.bigquery.DatasetReference object, instead.
    table_ref = client.dataset(dataset_id).table(table_id)

apache_beam/examples/dataframe/flight_delays_it_test.py::FlightDelaysTest::test_flight_delays
  <https://ci-beam.apache.org/job/beam_PostCommit_Python311/ws/src/sdks/python/apache_beam/examples/dataframe/flight_delays.py>:47: FutureWarning: The default value of numeric_only in DataFrame.mean is deprecated. In a future version, it will default to False. In addition, specifying 'numeric_only=None' is deprecated. Select only valid columns or specify the value of numeric_only to silence this warning.
    return airline_df[at_top_airports].mean()

apache_beam/io/gcp/bigquery_read_it_test.py::ReadNewTypesTests::test_native_source
  <https://ci-beam.apache.org/job/beam_PostCommit_Python311/ws/src/sdks/python/apache_beam/io/gcp/bigquery_read_it_test.py>:706: BeamDeprecationWarning: BigQuerySource is deprecated since 2.25.0. Use ReadFromBigQuery instead.
    beam.io.BigQuerySource(query=self.query, use_standard_sql=True)))

-- Docs: https://docs.pytest.org/en/stable/how-to/capture-warnings.html
- generated xml file: <https://ci-beam.apache.org/job/beam_PostCommit_Python311/ws/src/sdks/python/pytest_postCommitIT-df-py311.xml> -
=========== 82 passed, 50 skipped, 9 warnings in 6404.01s (1:46:44) ============

FAILURE: Build failed with an exception.

* Where:
Script '<https://ci-beam.apache.org/job/beam_PostCommit_Python311/ws/src/sdks/python/test-suites/portable/common.gradle'> line: 326

* What went wrong:
Execution failed for task ':sdks:python:test-suites:portable:py311:postCommitPy311IT'.
> Process 'command 'sh'' finished with non-zero exit value 1

* Try:
> Run with --stacktrace option to get the stack trace.
> Run with --info or --debug option to get more log output.
> Get more help at https://help.gradle.org.

Deprecated Gradle features were used in this build, making it incompatible with Gradle 9.0.

You can use '--warning-mode all' to show the individual deprecation warnings and determine if they come from your own scripts or plugins.

For more on this, please refer to https://docs.gradle.org/8.4/userguide/command_line_interface.html#sec:command_line_warnings in the Gradle documentation.

BUILD FAILED in 1h 53m 32s
217 actionable tasks: 152 executed, 61 from cache, 4 up-to-date

Publishing build scan...
https://ge.apache.org/s/unmkdjmd5wf2e

Build step 'Invoke Gradle script' changed build result to FAILURE
Build step 'Invoke Gradle script' marked build as failure

---------------------------------------------------------------------
To unsubscribe, e-mail: builds-unsubscribe@beam.apache.org
For additional commands, e-mail: builds-help@beam.apache.org


Build failed in Jenkins: beam_PostCommit_Python311 #990

Posted by Apache Jenkins Server <je...@builds.apache.org>.
See <https://ci-beam.apache.org/job/beam_PostCommit_Python311/990/display/redirect?page=changes>

Changes:

[noreply] Add per test timeout in recently changed dataflow legacy worker tests


------------------------------------------
[...truncated 13.21 MB...]
    raise self
grpc._channel._MultiThreadedRendezvous: <_MultiThreadedRendezvous of RPC that terminated with:
	status = StatusCode.UNAVAILABLE
	details = "Socket closed"
	debug_error_string = "UNKNOWN:Error received from peer ipv6:%5B::1%5D:46491 {created_time:"2023-12-11T17:18:01.299566295+00:00", grpc_status:14, grpc_message:"Socket closed"}"
>
Traceback (most recent call last):
Exception in thread read_grpc_client_inputs:
    self.run()
Traceback (most recent call last):
  File "/usr/lib/python3.11/threading.py", line 1038, in _bootstrap_inner
  File "/usr/lib/python3.11/threading.py", line 975, in run
  File "/usr/lib/python3.11/threading.py", line 1038, in _bootstrap_inner
    self.run()
    self._target(*self._args, **self._kwargs)
  File "/usr/lib/python3.11/threading.py", line 975, in run
  File "<https://ci-beam.apache.org/job/beam_PostCommit_Python311/ws/src/sdks/python/apache_beam/runners/worker/sdk_worker.py",> line 262, in run
    self.run()
  File "/usr/lib/python3.11/threading.py", line 975, in run
    self._target(*self._args, **self._kwargs)
  File "<https://ci-beam.apache.org/job/beam_PostCommit_Python311/ws/src/sdks/python/apache_beam/runners/worker/data_plane.py",> line 686, in <lambda>
    self._target(*self._args, **self._kwargs)
    target=lambda: self._read_inputs(elements_iterator),
  File "<https://ci-beam.apache.org/job/beam_PostCommit_Python311/ws/src/sdks/python/apache_beam/runners/worker/sdk_worker.py",> line 1035, in pull_responses
                   ^^^^^^^^^^^^^^^^^^^^^^^^^^^^^^^^^^^^
    for work_request in self._control_stub.Control(get_responses()):
  File "<https://ci-beam.apache.org/job/beam_PostCommit_Python311/ws/src/sdks/python/apache_beam/runners/worker/data_plane.py",> line 669, in _read_inputs
  File "<https://ci-beam.apache.org/job/beam_PostCommit_Python311/ws/src/build/gradleenv/-1720702906/lib/python3.11/site-packages/grpc/_channel.py",> line 540, in __next__
    for response in responses:
    for elements in elements_iterator:
  File "<https://ci-beam.apache.org/job/beam_PostCommit_Python311/ws/src/build/gradleenv/-1720702906/lib/python3.11/site-packages/grpc/_channel.py",> line 540, in __next__
    return self._next()
  File "<https://ci-beam.apache.org/job/beam_PostCommit_Python311/ws/src/build/gradleenv/-1720702906/lib/python3.11/site-packages/grpc/_channel.py",> line 540, in __next__
           ^^^^^^^^^^^^
    return self._next()
  File "<https://ci-beam.apache.org/job/beam_PostCommit_Python311/ws/src/build/gradleenv/-1720702906/lib/python3.11/site-packages/grpc/_channel.py",> line 966, in _next
           ^^^^^^^^^^^^
    return self._next()
           ^^^^^^^^^^^^
  File "<https://ci-beam.apache.org/job/beam_PostCommit_Python311/ws/src/build/gradleenv/-1720702906/lib/python3.11/site-packages/grpc/_channel.py",> line 966, in _next
  File "<https://ci-beam.apache.org/job/beam_PostCommit_Python311/ws/src/build/gradleenv/-1720702906/lib/python3.11/site-packages/grpc/_channel.py",> line 966, in _next
    raise self
    raise self
grpc._channel._MultiThreadedRendezvous: <_MultiThreadedRendezvous of RPC that terminated with:
	status = StatusCode.UNAVAILABLE
	details = "recvmsg:Connection reset by peer"
	debug_error_string = "UNKNOWN:Error received from peer ipv6:%5B::1%5D:40423 {grpc_message:"recvmsg:Connection reset by peer", grpc_status:14, created_time:"2023-12-11T17:18:01.299598534+00:00"}"
>
grpc._channel._MultiThreadedRendezvous: <_MultiThreadedRendezvous of RPC that terminated with:
	status = StatusCode.UNAVAILABLE
	details = "Socket closed"
	debug_error_string = "UNKNOWN:Error received from peer ipv6:%5B::1%5D:46491 {created_time:"2023-12-11T17:18:01.299566295+00:00", grpc_status:14, grpc_message:"Socket closed"}"
>
    raise self
grpc._channel._MultiThreadedRendezvous: <_MultiThreadedRendezvous of RPC that terminated with:
	status = StatusCode.UNAVAILABLE
	details = "Socket closed"
	debug_error_string = "UNKNOWN:Error received from peer ipv6:%5B::1%5D:38317 {created_time:"2023-12-11T17:18:01.299571849+00:00", grpc_status:14, grpc_message:"Socket closed"}"
>

> Task :sdks:python:test-suites:dataflow:py311:postCommitIT

[gw2] PASSED apache_beam/io/gcp/bigquery_write_it_test.py::BigQueryWriteIntegrationTests::test_big_query_write_new_types 
apache_beam/io/gcp/bigquery_write_it_test.py::BigQueryWriteIntegrationTests::test_big_query_write_schema_autodetect 
[gw2] SKIPPED apache_beam/io/gcp/bigquery_write_it_test.py::BigQueryWriteIntegrationTests::test_big_query_write_schema_autodetect 
apache_beam/io/gcp/bigquery_write_it_test.py::BigQueryWriteIntegrationTests::test_big_query_write_without_schema 
[gw3] PASSED apache_beam/dataframe/io_it_test.py::ReadUsingReadGbqTests::test_ReadGbq_export_with_project 
apache_beam/dataframe/io_it_test.py::ReadUsingReadGbqTests::test_ReadGbq_with_computation 
[gw0] PASSED apache_beam/io/gcp/bigquery_read_it_test.py::ReadTests::test_table_schema_retrieve_specifying_only_table 
apache_beam/io/gcp/bigquery_read_it_test.py::ReadTests::test_table_schema_retrieve_with_direct_read 
[gw4] PASSED apache_beam/ml/inference/sklearn_inference_it_test.py::SklearnInference::test_sklearn_mnist_classification_large_model 
apache_beam/ml/inference/sklearn_inference_it_test.py::SklearnInference::test_sklearn_regression 
[gw4] SKIPPED apache_beam/ml/inference/sklearn_inference_it_test.py::SklearnInference::test_sklearn_regression 
apache_beam/ml/gcp/cloud_dlp_it_test.py::CloudDLPIT::test_deidentification 
[gw7] PASSED apache_beam/io/gcp/big_query_query_to_table_it_test.py::BigQueryQueryToTableIT::test_big_query_standard_sql 
apache_beam/examples/dataframe/taxiride_it_test.py::TaxirideIT::test_aggregation 
[gw2] PASSED apache_beam/io/gcp/bigquery_write_it_test.py::BigQueryWriteIntegrationTests::test_big_query_write_without_schema 
apache_beam/examples/fastavro_it_test.py::FastavroIT::test_avro_it 
[gw5] PASSED apache_beam/io/gcp/bigquery_json_it_test.py::BigQueryJsonIT::test_streaming_inserts 
apache_beam/examples/wordcount_it_test.py::WordCountIT::test_wordcount_impersonation_it 
[gw3] PASSED apache_beam/dataframe/io_it_test.py::ReadUsingReadGbqTests::test_ReadGbq_with_computation 
apache_beam/io/gcp/bigquery_io_read_it_test.py::BigqueryIOReadIT::test_bigquery_read_1M_python 
[gw0] PASSED apache_beam/io/gcp/bigquery_read_it_test.py::ReadTests::test_table_schema_retrieve_with_direct_read 
apache_beam/io/gcp/bigquery_read_it_test.py::ReadUsingStorageApiTests::test_iobase_source 
[gw1] PASSED apache_beam/io/gcp/pubsub_integration_test.py::PubSubIntegrationTest::test_streaming_data_only 
apache_beam/io/gcp/pubsub_integration_test.py::PubSubIntegrationTest::test_streaming_with_attributes 
[gw6] PASSED apache_beam/io/gcp/bigquery_test.py::PubSubBigQueryIT::test_file_loads 
apache_beam/io/gcp/bigquery_test.py::PubSubBigQueryIT::test_streaming_inserts 
[gw4] PASSED apache_beam/ml/gcp/cloud_dlp_it_test.py::CloudDLPIT::test_deidentification 
apache_beam/ml/gcp/cloud_dlp_it_test.py::CloudDLPIT::test_inspection 
[gw5] PASSED apache_beam/examples/wordcount_it_test.py::WordCountIT::test_wordcount_impersonation_it 
apache_beam/examples/wordcount_it_test.py::WordCountIT::test_wordcount_it 
[gw7] PASSED apache_beam/examples/dataframe/taxiride_it_test.py::TaxirideIT::test_aggregation 
apache_beam/examples/dataframe/taxiride_it_test.py::TaxirideIT::test_enrich 
[gw3] PASSED apache_beam/io/gcp/bigquery_io_read_it_test.py::BigqueryIOReadIT::test_bigquery_read_1M_python 
apache_beam/io/gcp/bigquery_io_read_it_test.py::BigqueryIOReadIT::test_bigquery_read_custom_1M_python 
[gw0] PASSED apache_beam/io/gcp/bigquery_read_it_test.py::ReadUsingStorageApiTests::test_iobase_source 
apache_beam/io/gcp/bigquery_read_it_test.py::ReadUsingStorageApiTests::test_iobase_source_with_column_selection 
[gw4] PASSED apache_beam/ml/gcp/cloud_dlp_it_test.py::CloudDLPIT::test_inspection 
apache_beam/examples/streaming_wordcount_it_test.py::StreamingWordCountIT::test_streaming_wordcount_it 
[gw3] PASSED apache_beam/io/gcp/bigquery_io_read_it_test.py::BigqueryIOReadIT::test_bigquery_read_custom_1M_python 
apache_beam/examples/complete/game/leader_board_it_test.py::LeaderBoardIT::test_leader_board_it 
[gw5] PASSED apache_beam/examples/wordcount_it_test.py::WordCountIT::test_wordcount_it 
apache_beam/examples/complete/game/hourly_team_score_it_test.py::HourlyTeamScoreIT::test_hourly_team_score_it 
[gw2] PASSED apache_beam/examples/fastavro_it_test.py::FastavroIT::test_avro_it 
apache_beam/examples/streaming_wordcount_debugging_it_test.py::StreamingWordcountDebuggingIT::test_streaming_wordcount_debugging_it 
[gw2] SKIPPED apache_beam/examples/streaming_wordcount_debugging_it_test.py::StreamingWordcountDebuggingIT::test_streaming_wordcount_debugging_it 
apache_beam/examples/complete/game/game_stats_it_test.py::GameStatsIT::test_game_stats_it 
[gw0] PASSED apache_beam/io/gcp/bigquery_read_it_test.py::ReadUsingStorageApiTests::test_iobase_source_with_column_selection 
apache_beam/io/gcp/bigquery_read_it_test.py::ReadUsingStorageApiTests::test_iobase_source_with_column_selection_and_row_restriction 
[gw1] PASSED apache_beam/io/gcp/pubsub_integration_test.py::PubSubIntegrationTest::test_streaming_with_attributes 
apache_beam/io/gcp/healthcare/dicomio_integration_test.py::DICOMIoIntegrationTest::test_dicom_search_instances 
[gw0] PASSED apache_beam/io/gcp/bigquery_read_it_test.py::ReadUsingStorageApiTests::test_iobase_source_with_column_selection_and_row_restriction 
apache_beam/io/gcp/bigquery_read_it_test.py::ReadUsingStorageApiTests::test_iobase_source_with_column_selection_and_row_restriction_rows 
[gw1] PASSED apache_beam/io/gcp/healthcare/dicomio_integration_test.py::DICOMIoIntegrationTest::test_dicom_search_instances 
apache_beam/io/gcp/healthcare/dicomio_integration_test.py::DICOMIoIntegrationTest::test_dicom_store_instance_from_gcs 
[gw6] PASSED apache_beam/io/gcp/bigquery_test.py::PubSubBigQueryIT::test_streaming_inserts 
apache_beam/io/gcp/bigquery_test.py::BigQueryFileLoadsIntegrationTests::test_avro_file_load 
[gw4] PASSED apache_beam/examples/streaming_wordcount_it_test.py::StreamingWordCountIT::test_streaming_wordcount_it 
apache_beam/examples/complete/juliaset/juliaset/juliaset_test_it.py::JuliaSetTestIT::test_run_example_with_setup_file <https://ci-beam.apache.org/job/beam_PostCommit_Python311/ws/src/build/gradleenv/2050596099/bin/python3.11>: No module named build
warning: sdist: standard file not found: should have one of README, README.rst, README.txt, README.md

warning: check: missing required meta-data: url

warning: check: missing meta-data: either (author and author_email) or (maintainer and maintainer_email) should be supplied


[gw0] PASSED apache_beam/io/gcp/bigquery_read_it_test.py::ReadUsingStorageApiTests::test_iobase_source_with_column_selection_and_row_restriction_rows 
apache_beam/io/gcp/bigquery_read_it_test.py::ReadUsingStorageApiTests::test_iobase_source_with_native_datetime 
[gw5] PASSED apache_beam/examples/complete/game/hourly_team_score_it_test.py::HourlyTeamScoreIT::test_hourly_team_score_it 
apache_beam/examples/cookbook/bigquery_tornadoes_it_test.py::BigqueryTornadoesIT::test_bigquery_tornadoes_it 
[gw1] PASSED apache_beam/io/gcp/healthcare/dicomio_integration_test.py::DICOMIoIntegrationTest::test_dicom_store_instance_from_gcs 
apache_beam/ml/gcp/videointelligenceml_test_it.py::VideoIntelligenceMlTestIT::test_label_detection_with_video_context 
[gw1] SKIPPED apache_beam/ml/gcp/videointelligenceml_test_it.py::VideoIntelligenceMlTestIT::test_label_detection_with_video_context 
apache_beam/ml/gcp/visionml_test_it.py::VisionMlTestIT::test_text_detection_with_language_hint 
[gw3] PASSED apache_beam/examples/complete/game/leader_board_it_test.py::LeaderBoardIT::test_leader_board_it 
apache_beam/examples/dataframe/flight_delays_it_test.py::FlightDelaysTest::test_flight_delays 
[gw6] PASSED apache_beam/io/gcp/bigquery_test.py::BigQueryFileLoadsIntegrationTests::test_avro_file_load 
apache_beam/examples/complete/game/user_score_it_test.py::UserScoreIT::test_user_score_it 
[gw7] PASSED apache_beam/examples/dataframe/taxiride_it_test.py::TaxirideIT::test_enrich 
apache_beam/examples/complete/autocomplete_test.py::AutocompleteTest::test_autocomplete_it 
[gw2] PASSED apache_beam/examples/complete/game/game_stats_it_test.py::GameStatsIT::test_game_stats_it 
apache_beam/io/gcp/datastore/v1new/datastore_write_it_test.py::DatastoreWriteIT::test_datastore_write_limit 
[gw4] PASSED apache_beam/examples/complete/juliaset/juliaset/juliaset_test_it.py::JuliaSetTestIT::test_run_example_with_setup_file 
apache_beam/examples/inference/tfx_bsl/tfx_bsl_inference_it_test.py::TFXRunInferenceTests::test_tfx_run_inference_mobilenetv2 
[gw4] SKIPPED apache_beam/examples/inference/tfx_bsl/tfx_bsl_inference_it_test.py::TFXRunInferenceTests::test_tfx_run_inference_mobilenetv2 
apache_beam/ml/inference/onnx_inference_it_test.py::OnnxInference::test_onnx_run_inference_roberta_sentiment_classification 
[gw4] SKIPPED apache_beam/ml/inference/onnx_inference_it_test.py::OnnxInference::test_onnx_run_inference_roberta_sentiment_classification 
[gw0] PASSED apache_beam/io/gcp/bigquery_read_it_test.py::ReadUsingStorageApiTests::test_iobase_source_with_native_datetime 
apache_beam/io/gcp/bigquery_read_it_test.py::ReadUsingStorageApiTests::test_iobase_source_with_query 
[gw5] PASSED apache_beam/examples/cookbook/bigquery_tornadoes_it_test.py::BigqueryTornadoesIT::test_bigquery_tornadoes_it 
apache_beam/io/parquetio_it_test.py::TestParquetIT::test_parquetio_it 
[gw3] PASSED apache_beam/examples/dataframe/flight_delays_it_test.py::FlightDelaysTest::test_flight_delays 
apache_beam/io/fileio_test.py::MatchIntegrationTest::test_transform_on_gcs 
[gw1] PASSED apache_beam/ml/gcp/visionml_test_it.py::VisionMlTestIT::test_text_detection_with_language_hint 
apache_beam/transforms/external_it_test.py::ExternalTransformIT::test_job_python_from_python_it 
[gw7] PASSED apache_beam/examples/complete/autocomplete_test.py::AutocompleteTest::test_autocomplete_it 
apache_beam/examples/cookbook/datastore_wordcount_it_test.py::DatastoreWordCountIT::test_datastore_wordcount_it 
[gw0] PASSED apache_beam/io/gcp/bigquery_read_it_test.py::ReadUsingStorageApiTests::test_iobase_source_with_query 
apache_beam/io/gcp/bigquery_read_it_test.py::ReadUsingStorageApiTests::test_iobase_source_with_query_and_filters 
[gw5] PASSED apache_beam/io/parquetio_it_test.py::TestParquetIT::test_parquetio_it 
apache_beam/runners/dataflow/dataflow_exercise_metrics_pipeline_test.py::ExerciseMetricsPipelineTest::test_metrics_it 
[gw5] SKIPPED apache_beam/runners/dataflow/dataflow_exercise_metrics_pipeline_test.py::ExerciseMetricsPipelineTest::test_metrics_it 
[gw3] PASSED apache_beam/io/fileio_test.py::MatchIntegrationTest::test_transform_on_gcs 
[gw1] PASSED apache_beam/transforms/external_it_test.py::ExternalTransformIT::test_job_python_from_python_it 
apache_beam/transforms/periodicsequence_it_test.py::PeriodicSequenceIT::test_periodicsequence_outputs_valid_watermarks_it 
[gw1] SKIPPED apache_beam/transforms/periodicsequence_it_test.py::PeriodicSequenceIT::test_periodicsequence_outputs_valid_watermarks_it 
[gw7] PASSED apache_beam/examples/cookbook/datastore_wordcount_it_test.py::DatastoreWordCountIT::test_datastore_wordcount_it 
[gw6] PASSED apache_beam/examples/complete/game/user_score_it_test.py::UserScoreIT::test_user_score_it 
apache_beam/ml/inference/base_test.py::RunInferenceBaseTest::test_run_inference_with_side_inputin_streaming 
[gw6] SKIPPED apache_beam/ml/inference/base_test.py::RunInferenceBaseTest::test_run_inference_with_side_inputin_streaming 
[gw0] PASSED apache_beam/io/gcp/bigquery_read_it_test.py::ReadUsingStorageApiTests::test_iobase_source_with_query_and_filters 
apache_beam/io/gcp/bigquery_read_it_test.py::ReadUsingStorageApiTests::test_iobase_source_with_row_restriction 
[gw0] PASSED apache_beam/io/gcp/bigquery_read_it_test.py::ReadUsingStorageApiTests::test_iobase_source_with_row_restriction 
apache_beam/io/gcp/bigquery_read_it_test.py::ReadUsingStorageApiTests::test_iobase_source_with_very_selective_filters 
[gw0] PASSED apache_beam/io/gcp/bigquery_read_it_test.py::ReadUsingStorageApiTests::test_iobase_source_with_very_selective_filters 
apache_beam/io/gcp/bigquery_read_it_test.py::ReadNewTypesTests::test_iobase_source 
[gw2] PASSED apache_beam/io/gcp/datastore/v1new/datastore_write_it_test.py::DatastoreWriteIT::test_datastore_write_limit 
apache_beam/ml/gcp/naturallanguageml_test_it.py::NaturalLanguageMlTestIT::test_analyzing_syntax 
[gw2] SKIPPED apache_beam/ml/gcp/naturallanguageml_test_it.py::NaturalLanguageMlTestIT::test_analyzing_syntax 
[gw0] PASSED apache_beam/io/gcp/bigquery_read_it_test.py::ReadNewTypesTests::test_iobase_source 
apache_beam/io/gcp/bigquery_read_it_test.py::ReadNewTypesTests::test_native_source 
[gw0] PASSED apache_beam/io/gcp/bigquery_read_it_test.py::ReadNewTypesTests::test_native_source 
apache_beam/io/gcp/bigquery_read_it_test.py::ReadAllBQTests::test_read_queries 
[gw0] PASSED apache_beam/io/gcp/bigquery_read_it_test.py::ReadAllBQTests::test_read_queries 
apache_beam/io/gcp/bigquery_read_it_test.py::ReadInteractiveRunnerTests::test_read_in_interactive_runner 
[gw0] PASSED apache_beam/io/gcp/bigquery_read_it_test.py::ReadInteractiveRunnerTests::test_read_in_interactive_runner 

=============================== warnings summary ===============================
apache_beam/io/gcp/bigquery.py:2603
  <https://ci-beam.apache.org/job/beam_PostCommit_Python311/ws/src/sdks/python/apache_beam/io/gcp/bigquery.py>:2603: DeprecationWarning: invalid escape sequence '\#'
    """Read data from BigQuery.

apache_beam/io/gcp/bigquery_read_it_test.py::ReadTests::test_native_source
  <https://ci-beam.apache.org/job/beam_PostCommit_Python311/ws/src/sdks/python/apache_beam/io/gcp/bigquery_read_it_test.py>:170: BeamDeprecationWarning: BigQuerySource is deprecated since 2.25.0. Use ReadFromBigQuery instead.
    beam.io.BigQuerySource(query=self.query, use_standard_sql=True)))

apache_beam/io/gcp/bigquery_test.py::PubSubBigQueryIT::test_file_loads
apache_beam/io/gcp/bigquery_test.py::PubSubBigQueryIT::test_streaming_inserts
apache_beam/examples/complete/game/hourly_team_score_it_test.py::HourlyTeamScoreIT::test_hourly_team_score_it
apache_beam/examples/complete/game/leader_board_it_test.py::LeaderBoardIT::test_leader_board_it
apache_beam/examples/complete/game/game_stats_it_test.py::GameStatsIT::test_game_stats_it
  <https://ci-beam.apache.org/job/beam_PostCommit_Python311/ws/src/sdks/python/apache_beam/io/gcp/tests/utils.py>:63: PendingDeprecationWarning: Client.dataset is deprecated and will be removed in a future version. Use a string like 'my_project.my_dataset' or a cloud.google.bigquery.DatasetReference object, instead.
    dataset_ref = client.dataset(unique_dataset_name, project=project)

apache_beam/examples/cookbook/bigquery_tornadoes_it_test.py::BigqueryTornadoesIT::test_bigquery_tornadoes_it
  <https://ci-beam.apache.org/job/beam_PostCommit_Python311/ws/src/sdks/python/apache_beam/io/gcp/tests/utils.py>:100: PendingDeprecationWarning: Client.dataset is deprecated and will be removed in a future version. Use a string like 'my_project.my_dataset' or a cloud.google.bigquery.DatasetReference object, instead.
    table_ref = client.dataset(dataset_id).table(table_id)

apache_beam/examples/dataframe/flight_delays_it_test.py::FlightDelaysTest::test_flight_delays
  <https://ci-beam.apache.org/job/beam_PostCommit_Python311/ws/src/sdks/python/apache_beam/examples/dataframe/flight_delays.py>:47: FutureWarning: The default value of numeric_only in DataFrame.mean is deprecated. In a future version, it will default to False. In addition, specifying 'numeric_only=None' is deprecated. Select only valid columns or specify the value of numeric_only to silence this warning.
    return airline_df[at_top_airports].mean()

apache_beam/io/gcp/bigquery_read_it_test.py::ReadNewTypesTests::test_native_source
  <https://ci-beam.apache.org/job/beam_PostCommit_Python311/ws/src/sdks/python/apache_beam/io/gcp/bigquery_read_it_test.py>:706: BeamDeprecationWarning: BigQuerySource is deprecated since 2.25.0. Use ReadFromBigQuery instead.
    beam.io.BigQuerySource(query=self.query, use_standard_sql=True)))

-- Docs: https://docs.pytest.org/en/stable/how-to/capture-warnings.html
- generated xml file: <https://ci-beam.apache.org/job/beam_PostCommit_Python311/ws/src/sdks/python/pytest_postCommitIT-df-py311.xml> -
=========== 82 passed, 51 skipped, 10 warnings in 6115.54s (1:41:55) ===========

FAILURE: Build failed with an exception.

* Where:
Script '<https://ci-beam.apache.org/job/beam_PostCommit_Python311/ws/src/sdks/python/test-suites/portable/common.gradle'> line: 326

* What went wrong:
Execution failed for task ':sdks:python:test-suites:portable:py311:postCommitPy311IT'.
> Process 'command 'sh'' finished with non-zero exit value 1

* Try:
> Run with --stacktrace option to get the stack trace.
> Run with --info or --debug option to get more log output.
> Get more help at https://help.gradle.org.

Deprecated Gradle features were used in this build, making it incompatible with Gradle 9.0.

You can use '--warning-mode all' to show the individual deprecation warnings and determine if they come from your own scripts or plugins.

For more on this, please refer to https://docs.gradle.org/8.4/userguide/command_line_interface.html#sec:command_line_warnings in the Gradle documentation.

BUILD FAILED in 1h 49m 22s
217 actionable tasks: 152 executed, 61 from cache, 4 up-to-date

Publishing build scan...
https://ge.apache.org/s/62pbsvjlclbyg

Build step 'Invoke Gradle script' changed build result to FAILURE
Build step 'Invoke Gradle script' marked build as failure

---------------------------------------------------------------------
To unsubscribe, e-mail: builds-unsubscribe@beam.apache.org
For additional commands, e-mail: builds-help@beam.apache.org


Build failed in Jenkins: beam_PostCommit_Python311 #989

Posted by Apache Jenkins Server <je...@builds.apache.org>.
See <https://ci-beam.apache.org/job/beam_PostCommit_Python311/989/display/redirect>

Changes:


------------------------------------------
[...truncated 13.17 MB...]
  File "<https://ci-beam.apache.org/job/beam_PostCommit_Python311/ws/src/build/gradleenv/-1720702906/lib/python3.11/site-packages/grpc/_channel.py",> line 966, in _next
ERROR:apache_beam.runners.worker.data_plane:Failed to read inputs in the data plane.
Traceback (most recent call last):
  File "<https://ci-beam.apache.org/job/beam_PostCommit_Python311/ws/src/sdks/python/apache_beam/runners/worker/data_plane.py",> line 669, in _read_inputs
    for elements in elements_iterator:
  File "<https://ci-beam.apache.org/job/beam_PostCommit_Python311/ws/src/build/gradleenv/-1720702906/lib/python3.11/site-packages/grpc/_channel.py",> line 540, in __next__
    return self._next()
           ^^^^^^^^^^^^
  File "<https://ci-beam.apache.org/job/beam_PostCommit_Python311/ws/src/build/gradleenv/-1720702906/lib/python3.11/site-packages/grpc/_channel.py",> line 966, in _next
    raise self
grpc._channel._MultiThreadedRendezvous: <_MultiThreadedRendezvous of RPC that terminated with:
	status = StatusCode.UNAVAILABLE
	details = "Socket closed"
	debug_error_string = "UNKNOWN:Error received from peer ipv6:%5B::1%5D:33647 {created_time:"2023-12-11T11:11:56.572302509+00:00", grpc_status:14, grpc_message:"Socket closed"}"
>
Exception in thread read_grpc_client_inputs:
Traceback (most recent call last):
  File "/usr/lib/python3.11/threading.py", line 1038, in _bootstrap_inner
    raise self
    self.run()
grpc._channel._MultiThreadedRendezvous: <_MultiThreadedRendezvous of RPC that terminated with:
	status = StatusCode.UNAVAILABLE
	details = "recvmsg:Connection reset by peer"
	debug_error_string = "UNKNOWN:Error received from peer ipv6:%5B::1%5D:35475 {created_time:"2023-12-11T11:11:56.572316126+00:00", grpc_status:14, grpc_message:"recvmsg:Connection reset by peer"}"
>
  File "/usr/lib/python3.11/threading.py", line 975, in run
    for response in responses:
  File "<https://ci-beam.apache.org/job/beam_PostCommit_Python311/ws/src/build/gradleenv/-1720702906/lib/python3.11/site-packages/grpc/_channel.py",> line 540, in __next__
    self._target(*self._args, **self._kwargs)
  File "<https://ci-beam.apache.org/job/beam_PostCommit_Python311/ws/src/sdks/python/apache_beam/runners/worker/data_plane.py",> line 686, in <lambda>
    return self._next()
           ^^^^^^^^^^^^
  File "<https://ci-beam.apache.org/job/beam_PostCommit_Python311/ws/src/build/gradleenv/-1720702906/lib/python3.11/site-packages/grpc/_channel.py",> line 966, in _next
    target=lambda: self._read_inputs(elements_iterator),
                   ^^^^^^^^^^^^^^^^^^^^^^^^^^^^^^^^^^^^
  File "<https://ci-beam.apache.org/job/beam_PostCommit_Python311/ws/src/sdks/python/apache_beam/runners/worker/data_plane.py",> line 669, in _read_inputs
    raise self
grpc._channel._MultiThreadedRendezvous: <_MultiThreadedRendezvous of RPC that terminated with:
	status = StatusCode.UNAVAILABLE
	details = "Socket closed"
	debug_error_string = "UNKNOWN:Error received from peer ipv6:%5B::1%5D:43299 {grpc_message:"Socket closed", grpc_status:14, created_time:"2023-12-11T11:11:56.572315139+00:00"}"
>
    for elements in elements_iterator:
  File "<https://ci-beam.apache.org/job/beam_PostCommit_Python311/ws/src/build/gradleenv/-1720702906/lib/python3.11/site-packages/grpc/_channel.py",> line 540, in __next__
    return self._next()
           ^^^^^^^^^^^^
  File "<https://ci-beam.apache.org/job/beam_PostCommit_Python311/ws/src/build/gradleenv/-1720702906/lib/python3.11/site-packages/grpc/_channel.py",> line 966, in _next
    raise self
grpc._channel._MultiThreadedRendezvous: <_MultiThreadedRendezvous of RPC that terminated with:
	status = StatusCode.UNAVAILABLE
	details = "Socket closed"
	debug_error_string = "UNKNOWN:Error received from peer ipv6:%5B::1%5D:33647 {created_time:"2023-12-11T11:11:56.572302509+00:00", grpc_status:14, grpc_message:"Socket closed"}"
>

> Task :sdks:python:test-suites:dataflow:py311:postCommitIT

[gw3] PASSED apache_beam/io/gcp/bigquery_read_it_test.py::ReadTests::test_table_schema_retrieve 
apache_beam/io/gcp/bigquery_read_it_test.py::ReadTests::test_table_schema_retrieve_specifying_only_table 
[gw5] PASSED apache_beam/io/gcp/big_query_query_to_table_it_test.py::BigQueryQueryToTableIT::test_big_query_new_types_avro 
apache_beam/io/gcp/big_query_query_to_table_it_test.py::BigQueryQueryToTableIT::test_big_query_standard_sql 
[gw7] PASSED apache_beam/ml/inference/sklearn_inference_it_test.py::SklearnInference::test_sklearn_mnist_classification 
apache_beam/ml/inference/sklearn_inference_it_test.py::SklearnInference::test_sklearn_mnist_classification_large_model 
[gw1] PASSED apache_beam/dataframe/io_it_test.py::ReadUsingReadGbqTests::test_ReadGbq_export_with_project 
apache_beam/dataframe/io_it_test.py::ReadUsingReadGbqTests::test_ReadGbq_with_computation 
[gw4] PASSED apache_beam/io/gcp/bigquery_write_it_test.py::BigQueryWriteIntegrationTests::test_big_query_write_new_types 
apache_beam/io/gcp/bigquery_write_it_test.py::BigQueryWriteIntegrationTests::test_big_query_write_schema_autodetect 
[gw4] SKIPPED apache_beam/io/gcp/bigquery_write_it_test.py::BigQueryWriteIntegrationTests::test_big_query_write_schema_autodetect 
apache_beam/io/gcp/bigquery_write_it_test.py::BigQueryWriteIntegrationTests::test_big_query_write_without_schema 
[gw3] PASSED apache_beam/io/gcp/bigquery_read_it_test.py::ReadTests::test_table_schema_retrieve_specifying_only_table 
apache_beam/io/gcp/bigquery_read_it_test.py::ReadTests::test_table_schema_retrieve_with_direct_read 
[gw5] PASSED apache_beam/io/gcp/big_query_query_to_table_it_test.py::BigQueryQueryToTableIT::test_big_query_standard_sql 
apache_beam/examples/dataframe/taxiride_it_test.py::TaxirideIT::test_aggregation 
[gw7] PASSED apache_beam/ml/inference/sklearn_inference_it_test.py::SklearnInference::test_sklearn_mnist_classification_large_model 
apache_beam/ml/inference/sklearn_inference_it_test.py::SklearnInference::test_sklearn_regression 
[gw7] SKIPPED apache_beam/ml/inference/sklearn_inference_it_test.py::SklearnInference::test_sklearn_regression 
apache_beam/ml/gcp/cloud_dlp_it_test.py::CloudDLPIT::test_deidentification 
[gw1] PASSED apache_beam/dataframe/io_it_test.py::ReadUsingReadGbqTests::test_ReadGbq_with_computation 
apache_beam/io/gcp/bigquery_io_read_it_test.py::BigqueryIOReadIT::test_bigquery_read_1M_python 
[gw4] PASSED apache_beam/io/gcp/bigquery_write_it_test.py::BigQueryWriteIntegrationTests::test_big_query_write_without_schema 
apache_beam/examples/fastavro_it_test.py::FastavroIT::test_avro_it 
[gw6] PASSED apache_beam/io/gcp/bigquery_json_it_test.py::BigQueryJsonIT::test_streaming_inserts 
apache_beam/examples/wordcount_it_test.py::WordCountIT::test_wordcount_impersonation_it 
[gw2] PASSED apache_beam/io/gcp/pubsub_integration_test.py::PubSubIntegrationTest::test_streaming_data_only 
apache_beam/io/gcp/pubsub_integration_test.py::PubSubIntegrationTest::test_streaming_with_attributes 
[gw3] PASSED apache_beam/io/gcp/bigquery_read_it_test.py::ReadTests::test_table_schema_retrieve_with_direct_read 
apache_beam/io/gcp/bigquery_read_it_test.py::ReadUsingStorageApiTests::test_iobase_source 
[gw0] PASSED apache_beam/io/gcp/bigquery_test.py::PubSubBigQueryIT::test_file_loads 
apache_beam/io/gcp/bigquery_test.py::PubSubBigQueryIT::test_streaming_inserts 
[gw7] PASSED apache_beam/ml/gcp/cloud_dlp_it_test.py::CloudDLPIT::test_deidentification 
apache_beam/ml/gcp/cloud_dlp_it_test.py::CloudDLPIT::test_inspection 
[gw5] PASSED apache_beam/examples/dataframe/taxiride_it_test.py::TaxirideIT::test_aggregation 
apache_beam/examples/dataframe/taxiride_it_test.py::TaxirideIT::test_enrich 
[gw1] PASSED apache_beam/io/gcp/bigquery_io_read_it_test.py::BigqueryIOReadIT::test_bigquery_read_1M_python 
apache_beam/io/gcp/bigquery_io_read_it_test.py::BigqueryIOReadIT::test_bigquery_read_custom_1M_python 
[gw3] PASSED apache_beam/io/gcp/bigquery_read_it_test.py::ReadUsingStorageApiTests::test_iobase_source 
apache_beam/io/gcp/bigquery_read_it_test.py::ReadUsingStorageApiTests::test_iobase_source_with_column_selection 
[gw6] PASSED apache_beam/examples/wordcount_it_test.py::WordCountIT::test_wordcount_impersonation_it 
apache_beam/examples/wordcount_it_test.py::WordCountIT::test_wordcount_it 
[gw7] PASSED apache_beam/ml/gcp/cloud_dlp_it_test.py::CloudDLPIT::test_inspection 
apache_beam/examples/complete/autocomplete_test.py::AutocompleteTest::test_autocomplete_it 
[gw1] PASSED apache_beam/io/gcp/bigquery_io_read_it_test.py::BigqueryIOReadIT::test_bigquery_read_custom_1M_python 
apache_beam/examples/complete/game/game_stats_it_test.py::GameStatsIT::test_game_stats_it 
[gw3] PASSED apache_beam/io/gcp/bigquery_read_it_test.py::ReadUsingStorageApiTests::test_iobase_source_with_column_selection 
apache_beam/io/gcp/bigquery_read_it_test.py::ReadUsingStorageApiTests::test_iobase_source_with_column_selection_and_row_restriction 
[gw4] PASSED apache_beam/examples/fastavro_it_test.py::FastavroIT::test_avro_it 
apache_beam/examples/streaming_wordcount_debugging_it_test.py::StreamingWordcountDebuggingIT::test_streaming_wordcount_debugging_it 
[gw4] SKIPPED apache_beam/examples/streaming_wordcount_debugging_it_test.py::StreamingWordcountDebuggingIT::test_streaming_wordcount_debugging_it 
apache_beam/examples/complete/game/hourly_team_score_it_test.py::HourlyTeamScoreIT::test_hourly_team_score_it 
[gw6] PASSED apache_beam/examples/wordcount_it_test.py::WordCountIT::test_wordcount_it 
apache_beam/examples/complete/game/leader_board_it_test.py::LeaderBoardIT::test_leader_board_it 
[gw2] PASSED apache_beam/io/gcp/pubsub_integration_test.py::PubSubIntegrationTest::test_streaming_with_attributes 
apache_beam/io/gcp/healthcare/dicomio_integration_test.py::DICOMIoIntegrationTest::test_dicom_search_instances 
[gw7] PASSED apache_beam/examples/complete/autocomplete_test.py::AutocompleteTest::test_autocomplete_it 
apache_beam/examples/complete/juliaset/juliaset/juliaset_test_it.py::JuliaSetTestIT::test_run_example_with_setup_file <https://ci-beam.apache.org/job/beam_PostCommit_Python311/ws/src/build/gradleenv/2050596099/bin/python3.11>: No module named build
warning: sdist: standard file not found: should have one of README, README.rst, README.txt, README.md

warning: check: missing required meta-data: url

warning: check: missing meta-data: either (author and author_email) or (maintainer and maintainer_email) should be supplied


[gw3] PASSED apache_beam/io/gcp/bigquery_read_it_test.py::ReadUsingStorageApiTests::test_iobase_source_with_column_selection_and_row_restriction 
apache_beam/io/gcp/bigquery_read_it_test.py::ReadUsingStorageApiTests::test_iobase_source_with_column_selection_and_row_restriction_rows 
[gw2] PASSED apache_beam/io/gcp/healthcare/dicomio_integration_test.py::DICOMIoIntegrationTest::test_dicom_search_instances 
apache_beam/io/gcp/healthcare/dicomio_integration_test.py::DICOMIoIntegrationTest::test_dicom_store_instance_from_gcs 
[gw0] PASSED apache_beam/io/gcp/bigquery_test.py::PubSubBigQueryIT::test_streaming_inserts 
apache_beam/io/gcp/bigquery_test.py::BigQueryFileLoadsIntegrationTests::test_avro_file_load 
[gw7] PASSED apache_beam/examples/complete/juliaset/juliaset/juliaset_test_it.py::JuliaSetTestIT::test_run_example_with_setup_file 
apache_beam/examples/inference/tfx_bsl/tfx_bsl_inference_it_test.py::TFXRunInferenceTests::test_tfx_run_inference_mobilenetv2 
[gw7] SKIPPED apache_beam/examples/inference/tfx_bsl/tfx_bsl_inference_it_test.py::TFXRunInferenceTests::test_tfx_run_inference_mobilenetv2 
apache_beam/ml/gcp/visionml_test_it.py::VisionMlTestIT::test_text_detection_with_language_hint 
[gw3] PASSED apache_beam/io/gcp/bigquery_read_it_test.py::ReadUsingStorageApiTests::test_iobase_source_with_column_selection_and_row_restriction_rows 
apache_beam/io/gcp/bigquery_read_it_test.py::ReadUsingStorageApiTests::test_iobase_source_with_native_datetime 
[gw2] PASSED apache_beam/io/gcp/healthcare/dicomio_integration_test.py::DICOMIoIntegrationTest::test_dicom_store_instance_from_gcs 
apache_beam/ml/gcp/videointelligenceml_test_it.py::VideoIntelligenceMlTestIT::test_label_detection_with_video_context 
[gw2] SKIPPED apache_beam/ml/gcp/videointelligenceml_test_it.py::VideoIntelligenceMlTestIT::test_label_detection_with_video_context 
apache_beam/ml/inference/base_test.py::RunInferenceBaseTest::test_run_inference_with_side_inputin_streaming 
[gw2] SKIPPED apache_beam/ml/inference/base_test.py::RunInferenceBaseTest::test_run_inference_with_side_inputin_streaming 
apache_beam/transforms/periodicsequence_it_test.py::PeriodicSequenceIT::test_periodicsequence_outputs_valid_watermarks_it 
[gw2] SKIPPED apache_beam/transforms/periodicsequence_it_test.py::PeriodicSequenceIT::test_periodicsequence_outputs_valid_watermarks_it 
[gw5] PASSED apache_beam/examples/dataframe/taxiride_it_test.py::TaxirideIT::test_enrich 
apache_beam/examples/streaming_wordcount_it_test.py::StreamingWordCountIT::test_streaming_wordcount_it 
[gw7] PASSED apache_beam/ml/gcp/visionml_test_it.py::VisionMlTestIT::test_text_detection_with_language_hint 
apache_beam/runners/dataflow/dataflow_exercise_metrics_pipeline_test.py::ExerciseMetricsPipelineTest::test_metrics_it 
[gw7] SKIPPED apache_beam/runners/dataflow/dataflow_exercise_metrics_pipeline_test.py::ExerciseMetricsPipelineTest::test_metrics_it 
apache_beam/transforms/external_it_test.py::ExternalTransformIT::test_job_python_from_python_it 
[gw0] PASSED apache_beam/io/gcp/bigquery_test.py::BigQueryFileLoadsIntegrationTests::test_avro_file_load 
apache_beam/examples/complete/game/user_score_it_test.py::UserScoreIT::test_user_score_it 
[gw6] PASSED apache_beam/examples/complete/game/leader_board_it_test.py::LeaderBoardIT::test_leader_board_it 
apache_beam/examples/dataframe/flight_delays_it_test.py::FlightDelaysTest::test_flight_delays 
[gw1] PASSED apache_beam/examples/complete/game/game_stats_it_test.py::GameStatsIT::test_game_stats_it 
apache_beam/examples/cookbook/datastore_wordcount_it_test.py::DatastoreWordCountIT::test_datastore_wordcount_it 
[gw4] PASSED apache_beam/examples/complete/game/hourly_team_score_it_test.py::HourlyTeamScoreIT::test_hourly_team_score_it 
apache_beam/io/parquetio_it_test.py::TestParquetIT::test_parquetio_it 
[gw3] PASSED apache_beam/io/gcp/bigquery_read_it_test.py::ReadUsingStorageApiTests::test_iobase_source_with_native_datetime 
apache_beam/io/gcp/bigquery_read_it_test.py::ReadUsingStorageApiTests::test_iobase_source_with_query 
[gw7] PASSED apache_beam/transforms/external_it_test.py::ExternalTransformIT::test_job_python_from_python_it 
[gw6] PASSED apache_beam/examples/dataframe/flight_delays_it_test.py::FlightDelaysTest::test_flight_delays 
apache_beam/ml/gcp/naturallanguageml_test_it.py::NaturalLanguageMlTestIT::test_analyzing_syntax 
[gw6] SKIPPED apache_beam/ml/gcp/naturallanguageml_test_it.py::NaturalLanguageMlTestIT::test_analyzing_syntax 
[gw4] PASSED apache_beam/io/parquetio_it_test.py::TestParquetIT::test_parquetio_it 
apache_beam/io/gcp/datastore/v1new/datastore_write_it_test.py::DatastoreWriteIT::test_datastore_write_limit 
[gw1] PASSED apache_beam/examples/cookbook/datastore_wordcount_it_test.py::DatastoreWordCountIT::test_datastore_wordcount_it 
apache_beam/io/fileio_test.py::MatchIntegrationTest::test_transform_on_gcs 
[gw3] PASSED apache_beam/io/gcp/bigquery_read_it_test.py::ReadUsingStorageApiTests::test_iobase_source_with_query 
apache_beam/io/gcp/bigquery_read_it_test.py::ReadUsingStorageApiTests::test_iobase_source_with_query_and_filters 
[gw5] PASSED apache_beam/examples/streaming_wordcount_it_test.py::StreamingWordCountIT::test_streaming_wordcount_it 
apache_beam/examples/cookbook/bigquery_tornadoes_it_test.py::BigqueryTornadoesIT::test_bigquery_tornadoes_it 
[gw0] PASSED apache_beam/examples/complete/game/user_score_it_test.py::UserScoreIT::test_user_score_it 
apache_beam/ml/inference/onnx_inference_it_test.py::OnnxInference::test_onnx_run_inference_roberta_sentiment_classification 
[gw0] SKIPPED apache_beam/ml/inference/onnx_inference_it_test.py::OnnxInference::test_onnx_run_inference_roberta_sentiment_classification 
[gw1] PASSED apache_beam/io/fileio_test.py::MatchIntegrationTest::test_transform_on_gcs 
[gw3] PASSED apache_beam/io/gcp/bigquery_read_it_test.py::ReadUsingStorageApiTests::test_iobase_source_with_query_and_filters 
apache_beam/io/gcp/bigquery_read_it_test.py::ReadUsingStorageApiTests::test_iobase_source_with_row_restriction 
[gw5] PASSED apache_beam/examples/cookbook/bigquery_tornadoes_it_test.py::BigqueryTornadoesIT::test_bigquery_tornadoes_it 
[gw3] PASSED apache_beam/io/gcp/bigquery_read_it_test.py::ReadUsingStorageApiTests::test_iobase_source_with_row_restriction 
apache_beam/io/gcp/bigquery_read_it_test.py::ReadUsingStorageApiTests::test_iobase_source_with_very_selective_filters 
[gw3] PASSED apache_beam/io/gcp/bigquery_read_it_test.py::ReadUsingStorageApiTests::test_iobase_source_with_very_selective_filters 
apache_beam/io/gcp/bigquery_read_it_test.py::ReadNewTypesTests::test_iobase_source 
[gw3] PASSED apache_beam/io/gcp/bigquery_read_it_test.py::ReadNewTypesTests::test_iobase_source 
apache_beam/io/gcp/bigquery_read_it_test.py::ReadNewTypesTests::test_native_source 
[gw4] PASSED apache_beam/io/gcp/datastore/v1new/datastore_write_it_test.py::DatastoreWriteIT::test_datastore_write_limit 
[gw3] PASSED apache_beam/io/gcp/bigquery_read_it_test.py::ReadNewTypesTests::test_native_source 
apache_beam/io/gcp/bigquery_read_it_test.py::ReadAllBQTests::test_read_queries 
[gw3] PASSED apache_beam/io/gcp/bigquery_read_it_test.py::ReadAllBQTests::test_read_queries 
apache_beam/io/gcp/bigquery_read_it_test.py::ReadInteractiveRunnerTests::test_read_in_interactive_runner 
[gw3] PASSED apache_beam/io/gcp/bigquery_read_it_test.py::ReadInteractiveRunnerTests::test_read_in_interactive_runner 

=============================== warnings summary ===============================
apache_beam/io/gcp/bigquery.py:2603
  <https://ci-beam.apache.org/job/beam_PostCommit_Python311/ws/src/sdks/python/apache_beam/io/gcp/bigquery.py>:2603: DeprecationWarning: invalid escape sequence '\#'
    """Read data from BigQuery.

apache_beam/io/gcp/bigquery_read_it_test.py::ReadTests::test_native_source
  <https://ci-beam.apache.org/job/beam_PostCommit_Python311/ws/src/sdks/python/apache_beam/io/gcp/bigquery_read_it_test.py>:170: BeamDeprecationWarning: BigQuerySource is deprecated since 2.25.0. Use ReadFromBigQuery instead.
    beam.io.BigQuerySource(query=self.query, use_standard_sql=True)))

apache_beam/io/gcp/bigquery_test.py::PubSubBigQueryIT::test_file_loads
apache_beam/io/gcp/bigquery_test.py::PubSubBigQueryIT::test_streaming_inserts
apache_beam/examples/complete/game/leader_board_it_test.py::LeaderBoardIT::test_leader_board_it
apache_beam/examples/complete/game/game_stats_it_test.py::GameStatsIT::test_game_stats_it
apache_beam/examples/complete/game/hourly_team_score_it_test.py::HourlyTeamScoreIT::test_hourly_team_score_it
  <https://ci-beam.apache.org/job/beam_PostCommit_Python311/ws/src/sdks/python/apache_beam/io/gcp/tests/utils.py>:63: PendingDeprecationWarning: Client.dataset is deprecated and will be removed in a future version. Use a string like 'my_project.my_dataset' or a cloud.google.bigquery.DatasetReference object, instead.
    dataset_ref = client.dataset(unique_dataset_name, project=project)

apache_beam/examples/dataframe/flight_delays_it_test.py::FlightDelaysTest::test_flight_delays
  <https://ci-beam.apache.org/job/beam_PostCommit_Python311/ws/src/sdks/python/apache_beam/examples/dataframe/flight_delays.py>:47: FutureWarning: The default value of numeric_only in DataFrame.mean is deprecated. In a future version, it will default to False. In addition, specifying 'numeric_only=None' is deprecated. Select only valid columns or specify the value of numeric_only to silence this warning.
    return airline_df[at_top_airports].mean()

apache_beam/examples/cookbook/bigquery_tornadoes_it_test.py::BigqueryTornadoesIT::test_bigquery_tornadoes_it
  <https://ci-beam.apache.org/job/beam_PostCommit_Python311/ws/src/sdks/python/apache_beam/io/gcp/tests/utils.py>:100: PendingDeprecationWarning: Client.dataset is deprecated and will be removed in a future version. Use a string like 'my_project.my_dataset' or a cloud.google.bigquery.DatasetReference object, instead.
    table_ref = client.dataset(dataset_id).table(table_id)

apache_beam/io/gcp/bigquery_read_it_test.py::ReadNewTypesTests::test_native_source
  <https://ci-beam.apache.org/job/beam_PostCommit_Python311/ws/src/sdks/python/apache_beam/io/gcp/bigquery_read_it_test.py>:706: BeamDeprecationWarning: BigQuerySource is deprecated since 2.25.0. Use ReadFromBigQuery instead.
    beam.io.BigQuerySource(query=self.query, use_standard_sql=True)))

-- Docs: https://docs.pytest.org/en/stable/how-to/capture-warnings.html
- generated xml file: <https://ci-beam.apache.org/job/beam_PostCommit_Python311/ws/src/sdks/python/pytest_postCommitIT-df-py311.xml> -
=========== 82 passed, 51 skipped, 10 warnings in 5841.33s (1:37:21) ===========

FAILURE: Build failed with an exception.

* Where:
Script '<https://ci-beam.apache.org/job/beam_PostCommit_Python311/ws/src/sdks/python/test-suites/portable/common.gradle'> line: 326

* What went wrong:
Execution failed for task ':sdks:python:test-suites:portable:py311:postCommitPy311IT'.
> Process 'command 'sh'' finished with non-zero exit value 1

* Try:
> Run with --stacktrace option to get the stack trace.
> Run with --info or --debug option to get more log output.
> Get more help at https://help.gradle.org.

Deprecated Gradle features were used in this build, making it incompatible with Gradle 9.0.

You can use '--warning-mode all' to show the individual deprecation warnings and determine if they come from your own scripts or plugins.

For more on this, please refer to https://docs.gradle.org/8.4/userguide/command_line_interface.html#sec:command_line_warnings in the Gradle documentation.

BUILD FAILED in 1h 43m 2s
217 actionable tasks: 152 executed, 61 from cache, 4 up-to-date

Publishing build scan...
https://ge.apache.org/s/fcuh6djau4p72

Build step 'Invoke Gradle script' changed build result to FAILURE
Build step 'Invoke Gradle script' marked build as failure

---------------------------------------------------------------------
To unsubscribe, e-mail: builds-unsubscribe@beam.apache.org
For additional commands, e-mail: builds-help@beam.apache.org