You are viewing a plain text version of this content. The canonical link for it is here.
Posted to dev@kafka.apache.org by Apache Jenkins Server <je...@builds.apache.org> on 2022/08/16 17:02:20 UTC
Build failed in Jenkins: Kafka » Kafka Branch Builder » trunk #1147
See <https://ci-builds.apache.org/job/Kafka/job/kafka/job/trunk/1147/display/redirect>
Changes:
------------------------------------------
[...truncated 421165 lines...]
[2022-08-16T16:47:07.769Z] > Task :connect:api:javadoc
[2022-08-16T16:47:09.037Z] > Task :connect:api:copyDependantLibs UP-TO-DATE
[2022-08-16T16:47:09.037Z] > Task :connect:api:jar UP-TO-DATE
[2022-08-16T16:47:09.037Z] > Task :connect:json:copyDependantLibs UP-TO-DATE
[2022-08-16T16:47:09.037Z] > Task :connect:json:jar UP-TO-DATE
[2022-08-16T16:47:09.037Z] > Task :connect:json:generateMetadataFileForMavenJavaPublication
[2022-08-16T16:47:09.037Z] > Task :connect:api:generateMetadataFileForMavenJavaPublication
[2022-08-16T16:47:09.037Z] > Task :connect:api:javadocJar
[2022-08-16T16:47:09.037Z] > Task :connect:api:compileTestJava UP-TO-DATE
[2022-08-16T16:47:09.037Z] > Task :connect:api:testClasses UP-TO-DATE
[2022-08-16T16:47:09.037Z] > Task :connect:api:testJar
[2022-08-16T16:47:09.037Z] > Task :connect:json:publishMavenJavaPublicationToMavenLocal
[2022-08-16T16:47:09.037Z] > Task :connect:json:publishToMavenLocal
[2022-08-16T16:47:09.037Z] > Task :connect:api:testSrcJar
[2022-08-16T16:47:09.951Z] > Task :connect:api:publishMavenJavaPublicationToMavenLocal
[2022-08-16T16:47:09.951Z] > Task :connect:api:publishToMavenLocal
[2022-08-16T16:47:09.951Z]
[2022-08-16T16:47:09.951Z] > Task :streams:javadoc
[2022-08-16T16:47:09.951Z] /home/jenkins/workspace/Kafka_kafka_trunk/streams/src/main/java/org/apache/kafka/streams/kstream/Repartitioned.java:101: warning - Tag @link: reference not found: DefaultPartitioner
[2022-08-16T16:47:09.951Z] /home/jenkins/workspace/Kafka_kafka_trunk/streams/src/main/java/org/apache/kafka/streams/kstream/Repartitioned.java:167: warning - Tag @link: reference not found: DefaultPartitioner
[2022-08-16T16:47:09.951Z] /home/jenkins/workspace/Kafka_kafka_trunk/streams/src/main/java/org/apache/kafka/streams/TopologyConfig.java:58: warning - Tag @link: missing '#': "org.apache.kafka.streams.StreamsBuilder()"
[2022-08-16T16:47:09.951Z] /home/jenkins/workspace/Kafka_kafka_trunk/streams/src/main/java/org/apache/kafka/streams/TopologyConfig.java:58: warning - Tag @link: can't find org.apache.kafka.streams.StreamsBuilder() in org.apache.kafka.streams.TopologyConfig
[2022-08-16T16:47:09.951Z] /home/jenkins/workspace/Kafka_kafka_trunk/streams/src/main/java/org/apache/kafka/streams/TopologyDescription.java:38: warning - Tag @link: reference not found: ProcessorContext#forward(Object, Object) forwards
[2022-08-16T16:47:09.951Z] /home/jenkins/workspace/Kafka_kafka_trunk/streams/src/main/java/org/apache/kafka/streams/query/Position.java:44: warning - Tag @link: can't find query(Query,
[2022-08-16T16:47:09.951Z] PositionBound, boolean) in org.apache.kafka.streams.processor.StateStore
[2022-08-16T16:47:09.951Z] /home/jenkins/workspace/Kafka_kafka_trunk/streams/src/main/java/org/apache/kafka/streams/query/QueryResult.java:109: warning - Tag @link: reference not found: this#getResult()
[2022-08-16T16:47:09.951Z] /home/jenkins/workspace/Kafka_kafka_trunk/streams/src/main/java/org/apache/kafka/streams/query/QueryResult.java:116: warning - Tag @link: reference not found: this#getFailureReason()
[2022-08-16T16:47:09.951Z] /home/jenkins/workspace/Kafka_kafka_trunk/streams/src/main/java/org/apache/kafka/streams/query/QueryResult.java:116: warning - Tag @link: reference not found: this#getFailureMessage()
[2022-08-16T16:47:09.951Z] /home/jenkins/workspace/Kafka_kafka_trunk/streams/src/main/java/org/apache/kafka/streams/query/QueryResult.java:154: warning - Tag @link: reference not found: this#isSuccess()
[2022-08-16T16:47:09.951Z] /home/jenkins/workspace/Kafka_kafka_trunk/streams/src/main/java/org/apache/kafka/streams/query/QueryResult.java:154: warning - Tag @link: reference not found: this#isFailure()
[2022-08-16T16:47:09.951Z] /home/jenkins/workspace/Kafka_kafka_trunk/streams/src/main/java/org/apache/kafka/streams/kstream/KStream.java:890: warning - Tag @link: reference not found: DefaultPartitioner
[2022-08-16T16:47:09.951Z] /home/jenkins/workspace/Kafka_kafka_trunk/streams/src/main/java/org/apache/kafka/streams/kstream/KStream.java:919: warning - Tag @link: reference not found: DefaultPartitioner
[2022-08-16T16:47:09.951Z] /home/jenkins/workspace/Kafka_kafka_trunk/streams/src/main/java/org/apache/kafka/streams/kstream/KStream.java:939: warning - Tag @link: reference not found: DefaultPartitioner
[2022-08-16T16:47:09.951Z] 25 warnings
[2022-08-16T16:47:09.951Z]
[2022-08-16T16:47:09.951Z] > Task :streams:javadocJar
[2022-08-16T16:47:10.718Z]
[2022-08-16T16:47:10.718Z] > Task :clients:javadoc
[2022-08-16T16:47:10.718Z] /home/jenkins/workspace/Kafka_kafka_trunk/clients/src/main/java/org/apache/kafka/common/security/oauthbearer/secured/OAuthBearerLoginCallbackHandler.java:147: warning - Tag @link: reference not found:
[2022-08-16T16:47:12.620Z] 1 warning
[2022-08-16T16:47:12.620Z]
[2022-08-16T16:47:12.620Z] > Task :clients:javadocJar
[2022-08-16T16:47:17.142Z] > Task :core:compileScala
[2022-08-16T16:47:19.877Z] > Task :clients:testJar
[2022-08-16T16:47:24.701Z] > Task :clients:testSrcJar
[2022-08-16T16:47:24.701Z] > Task :clients:publishMavenJavaPublicationToMavenLocal
[2022-08-16T16:47:24.701Z] > Task :clients:publishToMavenLocal
[2022-08-16T16:48:43.640Z] > Task :core:classes
[2022-08-16T16:48:43.640Z] > Task :core:compileTestJava NO-SOURCE
[2022-08-16T16:49:14.696Z] > Task :core:compileTestScala
[2022-08-16T16:49:50.601Z] > Task :core:testClasses
[2022-08-16T16:50:07.186Z] > Task :streams:compileTestJava
[2022-08-16T16:50:07.186Z] > Task :streams:testClasses
[2022-08-16T16:50:07.186Z] > Task :streams:testJar
[2022-08-16T16:50:08.100Z] > Task :streams:testSrcJar
[2022-08-16T16:50:08.100Z] > Task :streams:publishMavenJavaPublicationToMavenLocal
[2022-08-16T16:50:08.100Z] > Task :streams:publishToMavenLocal
[2022-08-16T16:50:08.100Z]
[2022-08-16T16:50:08.100Z] Deprecated Gradle features were used in this build, making it incompatible with Gradle 8.0.
[2022-08-16T16:50:08.100Z]
[2022-08-16T16:50:08.100Z] You can use '--warning-mode all' to show the individual deprecation warnings and determine if they come from your own scripts or plugins.
[2022-08-16T16:50:08.100Z]
[2022-08-16T16:50:08.100Z] See https://docs.gradle.org/7.5.1/userguide/command_line_interface.html#sec:command_line_warnings
[2022-08-16T16:50:08.100Z]
[2022-08-16T16:50:08.100Z] Execution optimizations have been disabled for 2 invalid unit(s) of work during this build to ensure correctness.
[2022-08-16T16:50:08.100Z] Please consult deprecation warnings for more details.
[2022-08-16T16:50:08.100Z]
[2022-08-16T16:50:08.100Z] BUILD SUCCESSFUL in 4m 11s
[2022-08-16T16:50:08.100Z] 79 actionable tasks: 37 executed, 42 up-to-date
[Pipeline] sh
[2022-08-16T16:50:11.564Z] + grep ^version= gradle.properties
[2022-08-16T16:50:11.564Z] + cut -d= -f 2
[Pipeline] dir
[2022-08-16T16:50:12.230Z] Running in /home/jenkins/workspace/Kafka_kafka_trunk/streams/quickstart
[Pipeline] {
[Pipeline] sh
[2022-08-16T16:50:14.582Z] + mvn clean install -Dgpg.skip
[2022-08-16T16:50:18.444Z] [INFO] Scanning for projects...
[2022-08-16T16:50:18.444Z] [INFO] ------------------------------------------------------------------------
[2022-08-16T16:50:18.444Z] [INFO] Reactor Build Order:
[2022-08-16T16:50:18.444Z] [INFO]
[2022-08-16T16:50:18.444Z] [INFO] Kafka Streams :: Quickstart [pom]
[2022-08-16T16:50:18.444Z] [INFO] streams-quickstart-java [maven-archetype]
[2022-08-16T16:50:18.444Z] [INFO]
[2022-08-16T16:50:18.444Z] [INFO] ----------------< org.apache.kafka:streams-quickstart >-----------------
[2022-08-16T16:50:18.444Z] [INFO] Building Kafka Streams :: Quickstart 3.4.0-SNAPSHOT [1/2]
[2022-08-16T16:50:18.444Z] [INFO] --------------------------------[ pom ]---------------------------------
[2022-08-16T16:50:19.358Z] [INFO]
[2022-08-16T16:50:19.358Z] [INFO] --- maven-clean-plugin:3.0.0:clean (default-clean) @ streams-quickstart ---
[2022-08-16T16:50:19.358Z] [INFO]
[2022-08-16T16:50:19.358Z] [INFO] --- maven-remote-resources-plugin:1.5:process (process-resource-bundles) @ streams-quickstart ---
[2022-08-16T16:50:20.272Z] [INFO]
[2022-08-16T16:50:20.272Z] [INFO] --- maven-site-plugin:3.5.1:attach-descriptor (attach-descriptor) @ streams-quickstart ---
[2022-08-16T16:50:21.985Z] [INFO]
[2022-08-16T16:50:21.985Z] [INFO] --- maven-gpg-plugin:1.6:sign (sign-artifacts) @ streams-quickstart ---
[2022-08-16T16:50:21.985Z] [INFO]
[2022-08-16T16:50:21.985Z] [INFO] --- maven-install-plugin:2.5.2:install (default-install) @ streams-quickstart ---
[2022-08-16T16:50:21.985Z] [INFO] Installing /home/jenkins/workspace/Kafka_kafka_trunk/streams/quickstart/pom.xml to /home/jenkins/.m2/repository/org/apache/kafka/streams-quickstart/3.4.0-SNAPSHOT/streams-quickstart-3.4.0-SNAPSHOT.pom
[2022-08-16T16:50:21.985Z] [INFO]
[2022-08-16T16:50:21.985Z] [INFO] --------------< org.apache.kafka:streams-quickstart-java >--------------
[2022-08-16T16:50:21.985Z] [INFO] Building streams-quickstart-java 3.4.0-SNAPSHOT [2/2]
[2022-08-16T16:50:21.985Z] [INFO] --------------------------[ maven-archetype ]---------------------------
[2022-08-16T16:50:21.985Z] [INFO]
[2022-08-16T16:50:21.985Z] [INFO] --- maven-clean-plugin:3.0.0:clean (default-clean) @ streams-quickstart-java ---
[2022-08-16T16:50:21.985Z] [INFO]
[2022-08-16T16:50:21.985Z] [INFO] --- maven-remote-resources-plugin:1.5:process (process-resource-bundles) @ streams-quickstart-java ---
[2022-08-16T16:50:21.985Z] [INFO]
[2022-08-16T16:50:21.985Z] [INFO] --- maven-resources-plugin:2.7:resources (default-resources) @ streams-quickstart-java ---
[2022-08-16T16:50:22.899Z] [INFO] Using 'UTF-8' encoding to copy filtered resources.
[2022-08-16T16:50:22.899Z] [INFO] Copying 6 resources
[2022-08-16T16:50:22.899Z] [INFO] Copying 3 resources
[2022-08-16T16:50:22.899Z] [INFO]
[2022-08-16T16:50:22.899Z] [INFO] --- maven-resources-plugin:2.7:testResources (default-testResources) @ streams-quickstart-java ---
[2022-08-16T16:50:22.899Z] [INFO] Using 'UTF-8' encoding to copy filtered resources.
[2022-08-16T16:50:22.899Z] [INFO] Copying 2 resources
[2022-08-16T16:50:22.899Z] [INFO] Copying 3 resources
[2022-08-16T16:50:22.899Z] [INFO]
[2022-08-16T16:50:22.899Z] [INFO] --- maven-archetype-plugin:2.2:jar (default-jar) @ streams-quickstart-java ---
[2022-08-16T16:50:23.813Z] [INFO] Building archetype jar: /home/jenkins/workspace/Kafka_kafka_trunk/streams/quickstart/java/target/streams-quickstart-java-3.4.0-SNAPSHOT
[2022-08-16T16:50:23.813Z] [INFO]
[2022-08-16T16:50:23.813Z] [INFO] --- maven-site-plugin:3.5.1:attach-descriptor (attach-descriptor) @ streams-quickstart-java ---
[2022-08-16T16:50:23.813Z] [INFO]
[2022-08-16T16:50:23.813Z] [INFO] --- maven-archetype-plugin:2.2:integration-test (default-integration-test) @ streams-quickstart-java ---
[2022-08-16T16:50:23.813Z] [INFO]
[2022-08-16T16:50:23.813Z] [INFO] --- maven-gpg-plugin:1.6:sign (sign-artifacts) @ streams-quickstart-java ---
[2022-08-16T16:50:23.813Z] [INFO]
[2022-08-16T16:50:23.813Z] [INFO] --- maven-install-plugin:2.5.2:install (default-install) @ streams-quickstart-java ---
[2022-08-16T16:50:23.813Z] [INFO] Installing /home/jenkins/workspace/Kafka_kafka_trunk/streams/quickstart/java/target/streams-quickstart-java-3.4.0-SNAPSHOT.jar to /home/jenkins/.m2/repository/org/apache/kafka/streams-quickstart-java/3.4.0-SNAPSHOT/streams-quickstart-java-3.4.0-SNAPSHOT.jar
[2022-08-16T16:50:23.813Z] [INFO] Installing /home/jenkins/workspace/Kafka_kafka_trunk/streams/quickstart/java/pom.xml to /home/jenkins/.m2/repository/org/apache/kafka/streams-quickstart-java/3.4.0-SNAPSHOT/streams-quickstart-java-3.4.0-SNAPSHOT.pom
[2022-08-16T16:50:24.309Z] [INFO]
[2022-08-16T16:50:24.309Z] [INFO] --- maven-archetype-plugin:2.2:update-local-catalog (default-update-local-catalog) @ streams-quickstart-java ---
[2022-08-16T16:50:24.309Z] [INFO] ------------------------------------------------------------------------
[2022-08-16T16:50:24.309Z] [INFO] Reactor Summary for Kafka Streams :: Quickstart 3.4.0-SNAPSHOT:
[2022-08-16T16:50:24.309Z] [INFO]
[2022-08-16T16:50:24.309Z] [INFO] Kafka Streams :: Quickstart ........................ SUCCESS [ 3.830 s]
[2022-08-16T16:50:24.309Z] [INFO] streams-quickstart-java ............................ SUCCESS [ 2.018 s]
[2022-08-16T16:50:24.309Z] [INFO] ------------------------------------------------------------------------
[2022-08-16T16:50:24.309Z] [INFO] BUILD SUCCESS
[2022-08-16T16:50:24.309Z] [INFO] ------------------------------------------------------------------------
[2022-08-16T16:50:24.309Z] [INFO] Total time: 6.304 s
[2022-08-16T16:50:24.309Z] [INFO] Finished at: 2022-08-16T16:50:23Z
[2022-08-16T16:50:24.309Z] [INFO] ------------------------------------------------------------------------
[Pipeline] dir
[2022-08-16T16:50:24.310Z] Running in /home/jenkins/workspace/Kafka_kafka_trunk/streams/quickstart/test-streams-archetype
[Pipeline] {
[Pipeline] sh
[2022-08-16T16:50:26.393Z] + echo Y
[2022-08-16T16:50:26.393Z] + mvn archetype:generate -DarchetypeCatalog=local -DarchetypeGroupId=org.apache.kafka -DarchetypeArtifactId=streams-quickstart-java -DarchetypeVersion=3.4.0-SNAPSHOT -DgroupId=streams.examples -DartifactId=streams.examples -Dversion=0.1 -Dpackage=myapps
[2022-08-16T16:50:27.307Z] [INFO] Scanning for projects...
[2022-08-16T16:50:28.277Z] [INFO]
[2022-08-16T16:50:28.277Z] [INFO] ------------------< org.apache.maven:standalone-pom >-------------------
[2022-08-16T16:50:28.277Z] [INFO] Building Maven Stub Project (No POM) 1
[2022-08-16T16:50:28.277Z] [INFO] --------------------------------[ pom ]---------------------------------
[2022-08-16T16:50:28.277Z] [INFO]
[2022-08-16T16:50:28.277Z] [INFO] >>> maven-archetype-plugin:3.2.1:generate (default-cli) > generate-sources @ standalone-pom >>>
[2022-08-16T16:50:28.277Z] [INFO]
[2022-08-16T16:50:28.277Z] [INFO] <<< maven-archetype-plugin:3.2.1:generate (default-cli) < generate-sources @ standalone-pom <<<
[2022-08-16T16:50:28.277Z] [INFO]
[2022-08-16T16:50:28.277Z] [INFO]
[2022-08-16T16:50:28.277Z] [INFO] --- maven-archetype-plugin:3.2.1:generate (default-cli) @ standalone-pom ---
[2022-08-16T16:50:30.882Z] [INFO] Generating project in Interactive mode
[2022-08-16T16:50:30.882Z] [WARNING] Archetype not found in any catalog. Falling back to central repository.
[2022-08-16T16:50:30.882Z] [WARNING] Add a repository with id 'archetype' in your settings.xml if archetype's repository is elsewhere.
[2022-08-16T16:50:30.882Z] [INFO] Using property: groupId = streams.examples
[2022-08-16T16:50:30.882Z] [INFO] Using property: artifactId = streams.examples
[2022-08-16T16:50:30.882Z] [INFO] Using property: version = 0.1
[2022-08-16T16:50:30.882Z] [INFO] Using property: package = myapps
[2022-08-16T16:50:30.882Z] Confirm properties configuration:
[2022-08-16T16:50:30.882Z] groupId: streams.examples
[2022-08-16T16:50:30.882Z] artifactId: streams.examples
[2022-08-16T16:50:30.882Z] version: 0.1
[2022-08-16T16:50:30.882Z] package: myapps
[2022-08-16T16:50:30.882Z] Y: : [INFO] ----------------------------------------------------------------------------
[2022-08-16T16:50:30.882Z] [INFO] Using following parameters for creating project from Archetype: streams-quickstart-java:3.4.0-SNAPSHOT
[2022-08-16T16:50:30.882Z] [INFO] ----------------------------------------------------------------------------
[2022-08-16T16:50:30.882Z] [INFO] Parameter: groupId, Value: streams.examples
[2022-08-16T16:50:30.882Z] [INFO] Parameter: artifactId, Value: streams.examples
[2022-08-16T16:50:30.882Z] [INFO] Parameter: version, Value: 0.1
[2022-08-16T16:50:30.882Z] [INFO] Parameter: package, Value: myapps
[2022-08-16T16:50:30.882Z] [INFO] Parameter: packageInPathFormat, Value: myapps
[2022-08-16T16:50:30.882Z] [INFO] Parameter: package, Value: myapps
[2022-08-16T16:50:30.882Z] [INFO] Parameter: version, Value: 0.1
[2022-08-16T16:50:30.882Z] [INFO] Parameter: groupId, Value: streams.examples
[2022-08-16T16:50:30.882Z] [INFO] Parameter: artifactId, Value: streams.examples
[2022-08-16T16:50:30.882Z] [INFO] Project created from Archetype in dir: /home/jenkins/workspace/Kafka_kafka_trunk/streams/quickstart/test-streams-archetype/streams.examples
[2022-08-16T16:50:30.882Z] [INFO] ------------------------------------------------------------------------
[2022-08-16T16:50:30.882Z] [INFO] BUILD SUCCESS
[2022-08-16T16:50:30.882Z] [INFO] ------------------------------------------------------------------------
[2022-08-16T16:50:30.882Z] [INFO] Total time: 3.731 s
[2022-08-16T16:50:30.882Z] [INFO] Finished at: 2022-08-16T16:50:30Z
[2022-08-16T16:50:30.882Z] [INFO] ------------------------------------------------------------------------
[Pipeline] dir
[2022-08-16T16:50:31.381Z] Running in /home/jenkins/workspace/Kafka_kafka_trunk/streams/quickstart/test-streams-archetype/streams.examples
[Pipeline] {
[Pipeline] sh
[2022-08-16T16:50:33.792Z] + mvn compile
[2022-08-16T16:50:34.705Z] [INFO] Scanning for projects...
[2022-08-16T16:50:34.706Z] [INFO]
[2022-08-16T16:50:34.706Z] [INFO] -----------------< streams.examples:streams.examples >------------------
[2022-08-16T16:50:34.706Z] [INFO] Building Kafka Streams Quickstart :: Java 0.1
[2022-08-16T16:50:34.706Z] [INFO] --------------------------------[ jar ]---------------------------------
[2022-08-16T16:50:35.682Z] [INFO]
[2022-08-16T16:50:35.682Z] [INFO] --- maven-resources-plugin:2.6:resources (default-resources) @ streams.examples ---
[2022-08-16T16:50:35.682Z] [INFO] Using 'UTF-8' encoding to copy filtered resources.
[2022-08-16T16:50:35.682Z] [INFO] Copying 1 resource
[2022-08-16T16:50:35.682Z] [INFO]
[2022-08-16T16:50:35.682Z] [INFO] --- maven-compiler-plugin:3.1:compile (default-compile) @ streams.examples ---
[2022-08-16T16:50:36.595Z] [INFO] Changes detected - recompiling the module!
[2022-08-16T16:50:36.595Z] [INFO] Compiling 3 source files to /home/jenkins/workspace/Kafka_kafka_trunk/streams/quickstart/test-streams-archetype/streams.examples/target/classes
[2022-08-16T16:50:37.509Z] [INFO] ------------------------------------------------------------------------
[2022-08-16T16:50:37.509Z] [INFO] BUILD SUCCESS
[2022-08-16T16:50:37.509Z] [INFO] ------------------------------------------------------------------------
[2022-08-16T16:50:37.509Z] [INFO] Total time: 2.854 s
[2022-08-16T16:50:37.509Z] [INFO] Finished at: 2022-08-16T16:50:36Z
[2022-08-16T16:50:37.509Z] [INFO] ------------------------------------------------------------------------
[Pipeline] }
[Pipeline] // dir
[Pipeline] }
[Pipeline] // dir
[Pipeline] }
[Pipeline] // dir
[Pipeline] }
[Pipeline] // withEnv
[Pipeline] }
[Pipeline] // withEnv
[Pipeline] }
[Pipeline] // withEnv
[Pipeline] }
[Pipeline] // node
[Pipeline] }
[Pipeline] // timestamps
[Pipeline] }
[Pipeline] // timeout
[Pipeline] }
[Pipeline] // stage
[Pipeline] }
[Pipeline] // parallel
[Pipeline] }
[Pipeline] // stage
[Pipeline] stage
[Pipeline] { (Declarative: Post Actions)
[Pipeline] node
Still waiting to schedule task
Waiting for next available executor on ‘ubuntu’
Running on builds31 in /home/jenkins/workspace/Kafka_kafka_trunk
[Pipeline] {
[Pipeline] script
[Pipeline] {
[Pipeline] step
Build failed in Jenkins: Kafka » Kafka Branch Builder » trunk #1149
Posted by Apache Jenkins Server <je...@builds.apache.org>.
See <https://ci-builds.apache.org/job/Kafka/job/kafka/job/trunk/1149/display/redirect>
Changes:
------------------------------------------
[...truncated 4038 lines...]
[2022-08-17T21:26:07.424Z] > Task :storage:testClasses
[2022-08-17T21:26:10.987Z] > Task :storage:checkstyleTest
[2022-08-17T21:26:14.549Z] > Task :connect:runtime:compileTestJava
[2022-08-17T21:26:14.549Z] > Task :connect:runtime:testClasses
[2022-08-17T21:26:16.294Z] > Task :connect:mirror:compileTestJava
[2022-08-17T21:26:16.294Z] > Task :connect:mirror:testClasses
[2022-08-17T21:26:18.042Z] > Task :connect:mirror:checkstyleTest
[2022-08-17T21:26:18.721Z] [Warn] /home/jenkins/workspace/Kafka_kafka_trunk/core/src/main/scala/kafka/utils/Implicits.scala:58:4: @nowarn annotation does not suppress any warnings
[2022-08-17T21:26:18.721Z] [Warn] /home/jenkins/workspace/Kafka_kafka_trunk/core/src/main/scala/kafka/raft/KafkaMetadataLog.scala:477:4: @nowarn annotation does not suppress any warnings
[2022-08-17T21:26:18.721Z] [Warn] /home/jenkins/workspace/Kafka_kafka_trunk/core/src/main/scala/kafka/security/authorizer/AclAuthorizer.scala:508:4: @nowarn annotation does not suppress any warnings
[2022-08-17T21:26:18.721Z] [Warn] /home/jenkins/workspace/Kafka_kafka_trunk/core/src/main/scala/kafka/utils/CoreUtils.scala:320:4: @nowarn annotation does not suppress any warnings
[2022-08-17T21:26:18.721Z] 8 warnings found
[2022-08-17T21:26:18.721Z] Unexpected javac output: warning: [options] bootstrap class path not set in conjunction with -source 8
[2022-08-17T21:26:18.721Z] 1 warning.
[2022-08-17T21:26:18.721Z]
[2022-08-17T21:26:18.721Z] > Task :clients:spotbugsMain
[2022-08-17T21:26:18.721Z] [main] INFO edu.umd.cs.findbugs.ExitCodes - Calculating exit code...
[2022-08-17T21:26:18.721Z]
[2022-08-17T21:26:18.721Z] > Task :core:classes
[2022-08-17T21:26:18.721Z] > Task :core:compileTestJava NO-SOURCE
[2022-08-17T21:26:18.721Z] > Task :examples:compileJava
[2022-08-17T21:26:18.721Z] > Task :examples:classes
[2022-08-17T21:26:18.721Z] > Task :examples:compileTestJava NO-SOURCE
[2022-08-17T21:26:18.721Z] > Task :shell:compileJava
[2022-08-17T21:26:18.721Z] > Task :shell:classes
[2022-08-17T21:26:18.721Z] > Task :examples:testClasses UP-TO-DATE
[2022-08-17T21:26:18.721Z] > Task :examples:checkstyleTest NO-SOURCE
[2022-08-17T21:26:18.721Z] > Task :examples:checkstyleMain
[2022-08-17T21:26:18.721Z] > Task :shell:compileTestJava
[2022-08-17T21:26:18.721Z] > Task :shell:testClasses
[2022-08-17T21:26:19.734Z] > Task :shell:checkstyleTest
[2022-08-17T21:26:19.734Z] > Task :shell:checkstyleMain
[2022-08-17T21:26:22.871Z]
[2022-08-17T21:26:22.871Z] > Task :examples:spotbugsMain
[2022-08-17T21:26:22.871Z] WARNING: A terminally deprecated method in java.lang.System has been called
[2022-08-17T21:26:22.871Z] WARNING: System::setSecurityManager has been called by edu.umd.cs.findbugs.ba.jsr305.TypeQualifierValue (file:/home/jenkins/.gradle/caches/modules-2/files-2.1/com.github.spotbugs/spotbugs/4.2.2/fef7e4208082fc1c6a1b7dfd84eb382add52dead/spotbugs-4.2.2.jar)
[2022-08-17T21:26:22.871Z] WARNING: Please consider reporting this to the maintainers of edu.umd.cs.findbugs.ba.jsr305.TypeQualifierValue
[2022-08-17T21:26:22.871Z] WARNING: System::setSecurityManager will be removed in a future release
[2022-08-17T21:26:28.024Z] > Task :connect:runtime:checkstyleTest
[2022-08-17T21:26:29.331Z] [main] INFO edu.umd.cs.findbugs.ExitCodes - Calculating exit code...
[2022-08-17T21:26:29.331Z]
[2022-08-17T21:26:29.331Z] > Task :shell:spotbugsMain
[2022-08-17T21:26:29.331Z] WARNING: A terminally deprecated method in java.lang.System has been called
[2022-08-17T21:26:29.331Z] WARNING: System::setSecurityManager has been called by edu.umd.cs.findbugs.ba.jsr305.TypeQualifierValue (file:/home/jenkins/.gradle/caches/modules-2/files-2.1/com.github.spotbugs/spotbugs/4.2.2/fef7e4208082fc1c6a1b7dfd84eb382add52dead/spotbugs-4.2.2.jar)
[2022-08-17T21:26:29.331Z] WARNING: Please consider reporting this to the maintainers of edu.umd.cs.findbugs.ba.jsr305.TypeQualifierValue
[2022-08-17T21:26:29.331Z] WARNING: System::setSecurityManager will be removed in a future release
[2022-08-17T21:26:32.370Z] [main] INFO edu.umd.cs.findbugs.ExitCodes - Calculating exit code...
[2022-08-17T21:26:32.370Z]
[2022-08-17T21:26:32.370Z] > Task :core:compileTestScala
[2022-08-17T21:26:32.370Z] [Warn] /home/jenkins/workspace/Kafka_kafka_trunk/core/src/test/scala/integration/kafka/server/MultipleListenersWithSameSecurityProtocolBaseTest.scala:30:21: imported `QuorumTestHarness` is permanently hidden by definition of object QuorumTestHarness in package server
[2022-08-17T21:26:36.411Z] > Task :core:spotbugsMain
[2022-08-17T21:26:42.015Z] [Warn] /home/jenkins/workspace/Kafka_kafka_trunk/core/src/test/scala/unit/kafka/server/AdvertiseBrokerTest.scala:22:21: imported `QuorumTestHarness` is permanently hidden by definition of object QuorumTestHarness in package server
[2022-08-17T21:26:42.015Z] [Warn] /home/jenkins/workspace/Kafka_kafka_trunk/core/src/test/scala/unit/kafka/server/BrokerEpochIntegrationTest.scala:27:21: imported `QuorumTestHarness` is permanently hidden by definition of object QuorumTestHarness in package server
[2022-08-17T21:26:43.032Z] [Warn] /home/jenkins/workspace/Kafka_kafka_trunk/core/src/test/scala/unit/kafka/server/DynamicConfigTest.scala:21:21: imported `QuorumTestHarness` is permanently hidden by definition of object QuorumTestHarness in package server
[2022-08-17T21:26:44.260Z] [Warn] /home/jenkins/workspace/Kafka_kafka_trunk/core/src/test/scala/unit/kafka/server/KafkaMetricReporterClusterIdTest.scala:23:21: imported `QuorumTestHarness` is permanently hidden by definition of object QuorumTestHarness in package server
[2022-08-17T21:26:44.260Z] [Warn] /home/jenkins/workspace/Kafka_kafka_trunk/core/src/test/scala/unit/kafka/server/LeaderElectionTest.scala:32:21: imported `QuorumTestHarness` is permanently hidden by definition of object QuorumTestHarness in package server
[2022-08-17T21:26:45.195Z] [Warn] /home/jenkins/workspace/Kafka_kafka_trunk/core/src/test/scala/unit/kafka/server/LogRecoveryTest.scala:25:21: imported `QuorumTestHarness` is permanently hidden by definition of object QuorumTestHarness in package server
[2022-08-17T21:26:46.376Z] [Warn] /home/jenkins/workspace/Kafka_kafka_trunk/core/src/test/scala/unit/kafka/server/ReplicationQuotasTest.scala:28:21: imported `QuorumTestHarness` is permanently hidden by definition of object QuorumTestHarness in package server
[2022-08-17T21:26:46.376Z] [Warn] /home/jenkins/workspace/Kafka_kafka_trunk/core/src/test/scala/unit/kafka/server/ServerGenerateBrokerIdTest.scala:23:21: imported `QuorumTestHarness` is permanently hidden by definition of object QuorumTestHarness in package server
[2022-08-17T21:26:46.376Z] [Warn] /home/jenkins/workspace/Kafka_kafka_trunk/core/src/test/scala/unit/kafka/server/ServerGenerateClusterIdTest.scala:29:21: imported `QuorumTestHarness` is permanently hidden by definition of object QuorumTestHarness in package server
[2022-08-17T21:26:46.376Z] [Warn] /home/jenkins/workspace/Kafka_kafka_trunk/core/src/test/scala/unit/kafka/server/ServerStartupTest.scala:21:21: imported `QuorumTestHarness` is permanently hidden by definition of object QuorumTestHarness in package server
[2022-08-17T21:27:25.507Z] [Warn] /home/jenkins/workspace/Kafka_kafka_trunk/core/src/test/scala/unit/kafka/log/OffsetIndexTest.scala:52:4: @nowarn annotation does not suppress any warnings
[2022-08-17T21:27:25.507Z] 12 warnings found
[2022-08-17T21:27:28.993Z] Unexpected javac output: warning: [options] bootstrap class path not set in conjunction with -source 8
[2022-08-17T21:27:28.993Z] 1 warning.
[2022-08-17T21:27:31.018Z]
[2022-08-17T21:27:31.018Z] > Task :core:testClasses
[2022-08-17T21:27:32.034Z] > Task :core:checkstyleMain
[2022-08-17T21:27:32.035Z] > Task :core:checkstyleTest
[2022-08-17T21:27:33.047Z] > Task :storage:compileTestJava
[2022-08-17T21:27:33.047Z] > Task :storage:testClasses
[2022-08-17T21:27:36.096Z] > Task :storage:checkstyleTest
[2022-08-17T21:27:39.239Z] > Task :connect:runtime:compileTestJava
[2022-08-17T21:27:39.239Z] > Task :connect:runtime:testClasses
[2022-08-17T21:27:39.239Z]
[2022-08-17T21:27:39.239Z] > Task :core:spotbugsMain
[2022-08-17T21:27:39.239Z] WARNING: A terminally deprecated method in java.lang.System has been called
[2022-08-17T21:27:39.239Z] WARNING: System::setSecurityManager has been called by edu.umd.cs.findbugs.ba.jsr305.TypeQualifierValue (file:/home/jenkins/.gradle/caches/modules-2/files-2.1/com.github.spotbugs/spotbugs/4.2.2/fef7e4208082fc1c6a1b7dfd84eb382add52dead/spotbugs-4.2.2.jar)
[2022-08-17T21:27:39.239Z] WARNING: Please consider reporting this to the maintainers of edu.umd.cs.findbugs.ba.jsr305.TypeQualifierValue
[2022-08-17T21:27:39.239Z] WARNING: System::setSecurityManager will be removed in a future release
[2022-08-17T21:27:40.255Z]
[2022-08-17T21:27:40.255Z] > Task :connect:mirror:compileTestJava
[2022-08-17T21:27:40.255Z] > Task :connect:mirror:testClasses
[2022-08-17T21:27:41.268Z] > Task :connect:mirror:checkstyleTest
[2022-08-17T21:27:42.019Z] Unexpected javac output: warning: [options] bootstrap class path not set in conjunction with -source 8
[2022-08-17T21:27:42.019Z] 1 warning.
[2022-08-17T21:27:42.019Z]
[2022-08-17T21:27:42.019Z] > Task :core:testClasses
[2022-08-17T21:27:42.019Z] > Task :core:checkstyleTest
[2022-08-17T21:27:42.019Z] > Task :core:checkstyleMain
[2022-08-17T21:27:42.019Z] > Task :storage:compileTestJava
[2022-08-17T21:27:42.019Z] > Task :storage:testClasses
[2022-08-17T21:27:42.019Z] > Task :storage:checkstyleTest
[2022-08-17T21:27:42.019Z] > Task :connect:runtime:compileTestJava
[2022-08-17T21:27:42.019Z] > Task :connect:runtime:testClasses
[2022-08-17T21:27:42.019Z] > Task :connect:mirror:compileTestJava
[2022-08-17T21:27:42.019Z] > Task :connect:mirror:testClasses
[2022-08-17T21:27:43.052Z] > Task :connect:mirror:checkstyleTest
[2022-08-17T21:27:49.547Z] > Task :connect:runtime:checkstyleTest
[2022-08-17T21:27:54.659Z] > Task :connect:runtime:checkstyleTest
[2022-08-17T21:28:01.799Z] > Task :core:spotbugsMain
[2022-08-17T21:28:25.285Z] [main] INFO edu.umd.cs.findbugs.ExitCodes - Calculating exit code...
[2022-08-17T21:28:25.285Z]
[2022-08-17T21:28:25.285Z] FAILURE: Build failed with an exception.
[2022-08-17T21:28:25.285Z]
[2022-08-17T21:28:25.285Z] * What went wrong:
[2022-08-17T21:28:25.285Z] Execution failed for task ':streams:compileJava'.
[2022-08-17T21:28:25.285Z] > Compilation failed; see the compiler error output for details.
[2022-08-17T21:28:25.285Z]
[2022-08-17T21:28:25.285Z] * Try:
[2022-08-17T21:28:25.285Z] > Run with --stacktrace option to get the stack trace.
[2022-08-17T21:28:25.285Z] > Run with --info or --debug option to get more log output.
[2022-08-17T21:28:25.285Z] > Run with --scan to get full insights.
[2022-08-17T21:28:25.285Z]
[2022-08-17T21:28:25.285Z] * Get more help at https://help.gradle.org
[2022-08-17T21:28:25.285Z]
[2022-08-17T21:28:25.285Z] Deprecated Gradle features were used in this build, making it incompatible with Gradle 8.0.
[2022-08-17T21:28:25.285Z]
[2022-08-17T21:28:25.285Z] You can use '--warning-mode all' to show the individual deprecation warnings and determine if they come from your own scripts or plugins.
[2022-08-17T21:28:25.285Z]
[2022-08-17T21:28:25.285Z] See https://docs.gradle.org/7.5.1/userguide/command_line_interface.html#sec:command_line_warnings
[2022-08-17T21:28:25.285Z]
[2022-08-17T21:28:25.285Z] Execution optimizations have been disabled for 1 invalid unit(s) of work during this build to ensure correctness.
[2022-08-17T21:28:25.285Z] Please consult deprecation warnings for more details.
[2022-08-17T21:28:25.285Z]
[2022-08-17T21:28:25.285Z] BUILD FAILED in 8m 51s
[2022-08-17T21:28:25.285Z] 218 actionable tasks: 173 executed, 45 up-to-date
[2022-08-17T21:28:25.285Z]
[2022-08-17T21:28:25.285Z] See the profiling report at: file:///home/jenkins/workspace/Kafka_kafka_trunk/build/reports/profile/profile-2022-08-17-21-19-26.html
[2022-08-17T21:28:25.285Z] A fine-grained performance profile is available: use the --scan option.
[Pipeline] }
[Pipeline] // withEnv
[Pipeline] }
[Pipeline] // withEnv
[Pipeline] }
[Pipeline] // withEnv
[Pipeline] }
[Pipeline] // node
[Pipeline] }
[Pipeline] // timestamps
[Pipeline] }
[Pipeline] // timeout
[Pipeline] }
[Pipeline] // stage
[Pipeline] }
Failed in branch JDK 11 and Scala 2.12
[2022-08-17T21:29:01.671Z]
[2022-08-17T21:29:01.671Z] > Task :core:spotbugsMain
[2022-08-17T21:29:01.671Z] [main] INFO edu.umd.cs.findbugs.ExitCodes - Calculating exit code...
[2022-08-17T21:29:01.671Z]
[2022-08-17T21:29:01.671Z] FAILURE: Build failed with an exception.
[2022-08-17T21:29:01.671Z]
[2022-08-17T21:29:01.671Z] * What went wrong:
[2022-08-17T21:29:01.671Z] Execution failed for task ':streams:compileJava'.
[2022-08-17T21:29:01.671Z] > Compilation failed; see the compiler error output for details.
[2022-08-17T21:29:01.671Z]
[2022-08-17T21:29:01.671Z] * Try:
[2022-08-17T21:29:01.671Z] > Run with --stacktrace option to get the stack trace.
[2022-08-17T21:29:01.671Z] > Run with --info or --debug option to get more log output.
[2022-08-17T21:29:01.671Z] > Run with --scan to get full insights.
[2022-08-17T21:29:01.671Z]
[2022-08-17T21:29:01.671Z] * Get more help at https://help.gradle.org
[2022-08-17T21:29:01.671Z]
[2022-08-17T21:29:01.671Z] Deprecated Gradle features were used in this build, making it incompatible with Gradle 8.0.
[2022-08-17T21:29:01.671Z]
[2022-08-17T21:29:01.671Z] You can use '--warning-mode all' to show the individual deprecation warnings and determine if they come from your own scripts or plugins.
[2022-08-17T21:29:01.671Z]
[2022-08-17T21:29:01.671Z] See https://docs.gradle.org/7.5.1/userguide/command_line_interface.html#sec:command_line_warnings
[2022-08-17T21:29:01.671Z]
[2022-08-17T21:29:01.671Z] Execution optimizations have been disabled for 2 invalid unit(s) of work during this build to ensure correctness.
[2022-08-17T21:29:01.671Z] Please consult deprecation warnings for more details.
[2022-08-17T21:29:01.671Z]
[2022-08-17T21:29:01.671Z] BUILD FAILED in 8m 46s
[2022-08-17T21:29:01.672Z] 218 actionable tasks: 173 executed, 45 up-to-date
[2022-08-17T21:29:01.672Z]
[2022-08-17T21:29:01.672Z] See the profiling report at: file:///home/jenkins/workspace/Kafka_kafka_trunk/build/reports/profile/profile-2022-08-17-21-20-23.html
[2022-08-17T21:29:01.672Z] A fine-grained performance profile is available: use the --scan option.
[Pipeline] }
[Pipeline] // withEnv
[Pipeline] }
[Pipeline] // withEnv
[Pipeline] }
[Pipeline] // withEnv
[Pipeline] }
[Pipeline] // node
[Pipeline] }
[Pipeline] // timestamps
[Pipeline] }
[Pipeline] // timeout
[Pipeline] }
[Pipeline] // stage
[Pipeline] }
Failed in branch JDK 17 and Scala 2.12
[2022-08-17T21:29:55.755Z] [main] INFO edu.umd.cs.findbugs.ExitCodes - Calculating exit code...
[2022-08-17T21:29:55.755Z]
[2022-08-17T21:29:55.755Z] FAILURE: Build failed with an exception.
[2022-08-17T21:29:55.755Z]
[2022-08-17T21:29:55.755Z] * What went wrong:
[2022-08-17T21:29:55.755Z] Execution failed for task ':streams:compileJava'.
[2022-08-17T21:29:55.755Z] > Compilation failed; see the compiler error output for details.
[2022-08-17T21:29:55.755Z]
[2022-08-17T21:29:55.755Z] * Try:
[2022-08-17T21:29:55.755Z] > Run with --stacktrace option to get the stack trace.
[2022-08-17T21:29:55.755Z] > Run with --info or --debug option to get more log output.
[2022-08-17T21:29:55.755Z] > Run with --scan to get full insights.
[2022-08-17T21:29:55.755Z]
[2022-08-17T21:29:55.755Z] * Get more help at https://help.gradle.org
[2022-08-17T21:29:55.755Z]
[2022-08-17T21:29:55.755Z] Deprecated Gradle features were used in this build, making it incompatible with Gradle 8.0.
[2022-08-17T21:29:55.755Z]
[2022-08-17T21:29:55.755Z] You can use '--warning-mode all' to show the individual deprecation warnings and determine if they come from your own scripts or plugins.
[2022-08-17T21:29:55.755Z]
[2022-08-17T21:29:55.755Z] See https://docs.gradle.org/7.5.1/userguide/command_line_interface.html#sec:command_line_warnings
[2022-08-17T21:29:55.755Z]
[2022-08-17T21:29:55.755Z] Execution optimizations have been disabled for 2 invalid unit(s) of work during this build to ensure correctness.
[2022-08-17T21:29:55.755Z] Please consult deprecation warnings for more details.
[2022-08-17T21:29:55.755Z]
[2022-08-17T21:29:55.755Z] BUILD FAILED in 9m 14s
[2022-08-17T21:29:55.755Z] 218 actionable tasks: 173 executed, 45 up-to-date
[2022-08-17T21:29:55.755Z]
[2022-08-17T21:29:55.755Z] See the profiling report at: file:///home/jenkins/jenkins-agent/workspace/Kafka_kafka_trunk/build/reports/profile/profile-2022-08-17-21-20-32.html
[2022-08-17T21:29:55.755Z] A fine-grained performance profile is available: use the --scan option.
[Pipeline] }
[Pipeline] // withEnv
[Pipeline] }
[Pipeline] // withEnv
[Pipeline] }
[Pipeline] // withEnv
[Pipeline] }
[Pipeline] // node
[Pipeline] }
[Pipeline] // timestamps
[Pipeline] }
[Pipeline] // timeout
[Pipeline] }
[Pipeline] // stage
[Pipeline] }
Failed in branch JDK 11 and Scala 2.13
[Pipeline] // parallel
[Pipeline] }
[Pipeline] // stage
[Pipeline] stage
[Pipeline] { (Declarative: Post Actions)
[Pipeline] node
Running on builds23 in /home/jenkins/workspace/Kafka_kafka_trunk
[Pipeline] {
[Pipeline] script
[Pipeline] {
[Pipeline] step
Build failed in Jenkins: Kafka » Kafka Branch Builder » trunk #1148
Posted by Apache Jenkins Server <je...@builds.apache.org>.
See <https://ci-builds.apache.org/job/Kafka/job/kafka/job/trunk/1148/display/redirect>
Changes:
------------------------------------------
[...truncated 418826 lines...]
[2022-08-17T21:12:42.992Z] TableTableJoinIntegrationTest > [caching enabled = false] > org.apache.kafka.streams.integration.TableTableJoinIntegrationTest.testLeft[caching enabled = false] STARTED
[2022-08-17T21:12:55.191Z]
[2022-08-17T21:12:55.191Z] TableTableJoinIntegrationTest > [caching enabled = false] > org.apache.kafka.streams.integration.TableTableJoinIntegrationTest.testLeft[caching enabled = false] PASSED
[2022-08-17T21:12:55.191Z]
[2022-08-17T21:12:55.191Z] TableTableJoinIntegrationTest > [caching enabled = false] > org.apache.kafka.streams.integration.TableTableJoinIntegrationTest.testInnerInner[caching enabled = false] STARTED
[2022-08-17T21:13:08.764Z]
[2022-08-17T21:13:08.764Z] TableTableJoinIntegrationTest > [caching enabled = false] > org.apache.kafka.streams.integration.TableTableJoinIntegrationTest.testInnerInner[caching enabled = false] PASSED
[2022-08-17T21:13:08.764Z]
[2022-08-17T21:13:08.764Z] TableTableJoinIntegrationTest > [caching enabled = false] > org.apache.kafka.streams.integration.TableTableJoinIntegrationTest.testInnerOuter[caching enabled = false] STARTED
[2022-08-17T21:13:26.578Z]
[2022-08-17T21:13:26.578Z] TableTableJoinIntegrationTest > [caching enabled = false] > org.apache.kafka.streams.integration.TableTableJoinIntegrationTest.testInnerOuter[caching enabled = false] PASSED
[2022-08-17T21:13:26.578Z]
[2022-08-17T21:13:26.578Z] TableTableJoinIntegrationTest > [caching enabled = false] > org.apache.kafka.streams.integration.TableTableJoinIntegrationTest.testInnerLeft[caching enabled = false] STARTED
[2022-08-17T21:13:39.667Z]
[2022-08-17T21:13:39.667Z] TableTableJoinIntegrationTest > [caching enabled = false] > org.apache.kafka.streams.integration.TableTableJoinIntegrationTest.testInnerLeft[caching enabled = false] PASSED
[2022-08-17T21:13:39.667Z]
[2022-08-17T21:13:39.667Z] TableTableJoinIntegrationTest > [caching enabled = false] > org.apache.kafka.streams.integration.TableTableJoinIntegrationTest.testOuterInner[caching enabled = false] STARTED
[2022-08-17T21:13:51.136Z]
[2022-08-17T21:13:51.136Z] TableTableJoinIntegrationTest > [caching enabled = false] > org.apache.kafka.streams.integration.TableTableJoinIntegrationTest.testOuterInner[caching enabled = false] PASSED
[2022-08-17T21:13:51.136Z]
[2022-08-17T21:13:51.136Z] TableTableJoinIntegrationTest > [caching enabled = false] > org.apache.kafka.streams.integration.TableTableJoinIntegrationTest.testOuterOuter[caching enabled = false] STARTED
[2022-08-17T21:14:03.418Z]
[2022-08-17T21:14:03.418Z] TableTableJoinIntegrationTest > [caching enabled = false] > org.apache.kafka.streams.integration.TableTableJoinIntegrationTest.testOuterOuter[caching enabled = false] PASSED
[2022-08-17T21:14:03.418Z]
[2022-08-17T21:14:03.418Z] TaskAssignorIntegrationTest > shouldProperlyConfigureTheAssignor STARTED
[2022-08-17T21:14:03.418Z]
[2022-08-17T21:14:03.418Z] TaskAssignorIntegrationTest > shouldProperlyConfigureTheAssignor PASSED
[2022-08-17T21:14:06.355Z]
[2022-08-17T21:14:06.355Z] TaskMetadataIntegrationTest > shouldReportCorrectEndOffsetInformation STARTED
[2022-08-17T21:14:07.269Z]
[2022-08-17T21:14:07.269Z] TaskMetadataIntegrationTest > shouldReportCorrectEndOffsetInformation PASSED
[2022-08-17T21:14:07.269Z]
[2022-08-17T21:14:07.269Z] TaskMetadataIntegrationTest > shouldReportCorrectCommittedOffsetInformation STARTED
[2022-08-17T21:14:10.060Z]
[2022-08-17T21:14:10.060Z] TaskMetadataIntegrationTest > shouldReportCorrectCommittedOffsetInformation PASSED
[2022-08-17T21:14:10.974Z]
[2022-08-17T21:14:10.975Z] HandlingSourceTopicDeletionIntegrationTest > shouldThrowErrorAfterSourceTopicDeleted STARTED
[2022-08-17T21:14:18.397Z]
[2022-08-17T21:14:18.397Z] HandlingSourceTopicDeletionIntegrationTest > shouldThrowErrorAfterSourceTopicDeleted PASSED
[2022-08-17T21:14:21.666Z]
[2022-08-17T21:14:21.666Z] AdjustStreamThreadCountTest > testConcurrentlyAccessThreads() STARTED
[2022-08-17T21:14:23.750Z]
[2022-08-17T21:14:23.750Z] AdjustStreamThreadCountTest > testConcurrentlyAccessThreads() PASSED
[2022-08-17T21:14:23.750Z]
[2022-08-17T21:14:23.750Z] AdjustStreamThreadCountTest > shouldResizeCacheAfterThreadReplacement() STARTED
[2022-08-17T21:14:30.031Z]
[2022-08-17T21:14:30.031Z] AdjustStreamThreadCountTest > shouldResizeCacheAfterThreadReplacement() PASSED
[2022-08-17T21:14:30.031Z]
[2022-08-17T21:14:30.031Z] AdjustStreamThreadCountTest > shouldAddAndRemoveThreadsMultipleTimes() STARTED
[2022-08-17T21:14:36.589Z]
[2022-08-17T21:14:36.589Z] AdjustStreamThreadCountTest > shouldAddAndRemoveThreadsMultipleTimes() PASSED
[2022-08-17T21:14:36.589Z]
[2022-08-17T21:14:36.589Z] AdjustStreamThreadCountTest > shouldnNotRemoveStreamThreadWithinTimeout() STARTED
[2022-08-17T21:14:38.711Z]
[2022-08-17T21:14:38.711Z] AdjustStreamThreadCountTest > shouldnNotRemoveStreamThreadWithinTimeout() PASSED
[2022-08-17T21:14:38.711Z]
[2022-08-17T21:14:38.711Z] AdjustStreamThreadCountTest > shouldAddAndRemoveStreamThreadsWhileKeepingNamesCorrect() STARTED
[2022-08-17T21:14:59.547Z]
[2022-08-17T21:14:59.547Z] AdjustStreamThreadCountTest > shouldAddAndRemoveStreamThreadsWhileKeepingNamesCorrect() PASSED
[2022-08-17T21:14:59.547Z]
[2022-08-17T21:14:59.547Z] AdjustStreamThreadCountTest > shouldAddStreamThread() STARTED
[2022-08-17T21:15:04.440Z]
[2022-08-17T21:15:04.440Z] AdjustStreamThreadCountTest > shouldAddStreamThread() PASSED
[2022-08-17T21:15:04.440Z]
[2022-08-17T21:15:04.440Z] AdjustStreamThreadCountTest > shouldRemoveStreamThreadWithStaticMembership() STARTED
[2022-08-17T21:15:09.057Z]
[2022-08-17T21:15:09.057Z] AdjustStreamThreadCountTest > shouldRemoveStreamThreadWithStaticMembership() PASSED
[2022-08-17T21:15:09.057Z]
[2022-08-17T21:15:09.057Z] AdjustStreamThreadCountTest > shouldRemoveStreamThread() STARTED
[2022-08-17T21:15:14.997Z]
[2022-08-17T21:15:14.997Z] AdjustStreamThreadCountTest > shouldRemoveStreamThread() PASSED
[2022-08-17T21:15:14.997Z]
[2022-08-17T21:15:14.997Z] AdjustStreamThreadCountTest > shouldResizeCacheAfterThreadRemovalTimesOut() STARTED
[2022-08-17T21:15:15.914Z]
[2022-08-17T21:15:15.914Z] AdjustStreamThreadCountTest > shouldResizeCacheAfterThreadRemovalTimesOut() PASSED
[2022-08-17T21:15:20.266Z]
[2022-08-17T21:15:20.266Z] FineGrainedAutoResetIntegrationTest > shouldOnlyReadRecordsWhereEarliestSpecifiedWithNoCommittedOffsetsWithGlobalAutoOffsetResetLatest() STARTED
[2022-08-17T21:15:21.283Z]
[2022-08-17T21:15:21.284Z] FineGrainedAutoResetIntegrationTest > shouldOnlyReadRecordsWhereEarliestSpecifiedWithNoCommittedOffsetsWithGlobalAutoOffsetResetLatest() PASSED
[2022-08-17T21:15:21.284Z]
[2022-08-17T21:15:21.284Z] FineGrainedAutoResetIntegrationTest > shouldThrowExceptionOverlappingPattern() STARTED
[2022-08-17T21:15:21.284Z]
[2022-08-17T21:15:21.284Z] FineGrainedAutoResetIntegrationTest > shouldThrowExceptionOverlappingPattern() PASSED
[2022-08-17T21:15:21.284Z]
[2022-08-17T21:15:21.284Z] FineGrainedAutoResetIntegrationTest > shouldThrowExceptionOverlappingTopic() STARTED
[2022-08-17T21:15:21.284Z]
[2022-08-17T21:15:21.284Z] FineGrainedAutoResetIntegrationTest > shouldThrowExceptionOverlappingTopic() PASSED
[2022-08-17T21:15:21.284Z]
[2022-08-17T21:15:21.284Z] FineGrainedAutoResetIntegrationTest > shouldOnlyReadRecordsWhereEarliestSpecifiedWithInvalidCommittedOffsets() STARTED
[2022-08-17T21:16:05.927Z]
[2022-08-17T21:16:05.927Z] FineGrainedAutoResetIntegrationTest > shouldOnlyReadRecordsWhereEarliestSpecifiedWithInvalidCommittedOffsets() PASSED
[2022-08-17T21:16:05.927Z]
[2022-08-17T21:16:05.927Z] FineGrainedAutoResetIntegrationTest > shouldOnlyReadRecordsWhereEarliestSpecifiedWithNoCommittedOffsetsWithDefaultGlobalAutoOffsetResetEarliest() STARTED
[2022-08-17T21:16:57.266Z]
[2022-08-17T21:16:57.266Z] FineGrainedAutoResetIntegrationTest > shouldOnlyReadRecordsWhereEarliestSpecifiedWithNoCommittedOffsetsWithDefaultGlobalAutoOffsetResetEarliest() PASSED
[2022-08-17T21:16:57.266Z]
[2022-08-17T21:16:57.266Z] FineGrainedAutoResetIntegrationTest > shouldThrowStreamsExceptionNoResetSpecified() STARTED
[2022-08-17T21:16:57.266Z]
[2022-08-17T21:16:57.266Z] FineGrainedAutoResetIntegrationTest > shouldThrowStreamsExceptionNoResetSpecified() PASSED
[2022-08-17T21:16:57.266Z]
[2022-08-17T21:16:57.266Z] GlobalKTableIntegrationTest > shouldGetToRunningWithOnlyGlobalTopology() STARTED
[2022-08-17T21:16:57.266Z]
[2022-08-17T21:16:57.266Z] GlobalKTableIntegrationTest > shouldGetToRunningWithOnlyGlobalTopology() PASSED
[2022-08-17T21:16:57.266Z]
[2022-08-17T21:16:57.266Z] GlobalKTableIntegrationTest > shouldKStreamGlobalKTableLeftJoin() STARTED
[2022-08-17T21:16:58.281Z]
[2022-08-17T21:16:58.282Z] GlobalKTableIntegrationTest > shouldKStreamGlobalKTableLeftJoin() PASSED
[2022-08-17T21:16:58.282Z]
[2022-08-17T21:16:58.282Z] GlobalKTableIntegrationTest > shouldRestoreGlobalInMemoryKTableOnRestart() STARTED
[2022-08-17T21:16:59.295Z]
[2022-08-17T21:16:59.295Z] GlobalKTableIntegrationTest > shouldRestoreGlobalInMemoryKTableOnRestart() PASSED
[2022-08-17T21:16:59.295Z]
[2022-08-17T21:16:59.295Z] GlobalKTableIntegrationTest > shouldKStreamGlobalKTableJoin() STARTED
[2022-08-17T21:17:03.745Z]
[2022-08-17T21:17:03.745Z] GlobalKTableIntegrationTest > shouldKStreamGlobalKTableJoin() PASSED
[2022-08-17T21:17:05.773Z]
[2022-08-17T21:17:05.773Z] GlobalThreadShutDownOrderTest > shouldFinishGlobalStoreOperationOnShutDown() STARTED
[2022-08-17T21:17:11.396Z]
[2022-08-17T21:17:11.396Z] GlobalThreadShutDownOrderTest > shouldFinishGlobalStoreOperationOnShutDown() PASSED
[2022-08-17T21:17:13.625Z]
[2022-08-17T21:17:13.625Z] IQv2IntegrationTest > shouldFailStopped() STARTED
[2022-08-17T21:17:13.625Z]
[2022-08-17T21:17:13.625Z] IQv2IntegrationTest > shouldFailStopped() PASSED
[2022-08-17T21:17:13.625Z]
[2022-08-17T21:17:13.625Z] IQv2IntegrationTest > shouldNotRequireQueryHandler(TestInfo) STARTED
[2022-08-17T21:17:14.638Z]
[2022-08-17T21:17:14.638Z] IQv2IntegrationTest > shouldNotRequireQueryHandler(TestInfo) PASSED
[2022-08-17T21:17:14.638Z]
[2022-08-17T21:17:14.638Z] IQv2IntegrationTest > shouldFailNotStarted() STARTED
[2022-08-17T21:17:14.638Z]
[2022-08-17T21:17:14.638Z] IQv2IntegrationTest > shouldFailNotStarted() PASSED
[2022-08-17T21:17:14.638Z]
[2022-08-17T21:17:14.638Z] IQv2IntegrationTest > shouldFetchFromPartition() STARTED
[2022-08-17T21:17:18.466Z]
[2022-08-17T21:17:18.466Z] IQv2IntegrationTest > shouldFetchFromPartition() PASSED
[2022-08-17T21:17:18.466Z]
[2022-08-17T21:17:18.466Z] IQv2IntegrationTest > shouldFetchExplicitlyFromAllPartitions() STARTED
[2022-08-17T21:17:21.386Z]
[2022-08-17T21:17:21.386Z] IQv2IntegrationTest > shouldFetchExplicitlyFromAllPartitions() PASSED
[2022-08-17T21:17:21.386Z]
[2022-08-17T21:17:21.386Z] IQv2IntegrationTest > shouldFailUnknownStore() STARTED
[2022-08-17T21:17:21.386Z]
[2022-08-17T21:17:21.386Z] IQv2IntegrationTest > shouldFailUnknownStore() PASSED
[2022-08-17T21:17:21.386Z]
[2022-08-17T21:17:21.386Z] IQv2IntegrationTest > shouldRejectNonRunningActive() STARTED
[2022-08-17T21:17:24.196Z]
[2022-08-17T21:17:24.196Z] IQv2IntegrationTest > shouldRejectNonRunningActive() PASSED
[2022-08-17T21:17:27.153Z]
[2022-08-17T21:17:27.153Z] InternalTopicIntegrationTest > shouldCompactTopicsForKeyValueStoreChangelogs() STARTED
[2022-08-17T21:17:30.194Z]
[2022-08-17T21:17:30.194Z] InternalTopicIntegrationTest > shouldCompactTopicsForKeyValueStoreChangelogs() PASSED
[2022-08-17T21:17:30.194Z]
[2022-08-17T21:17:30.194Z] InternalTopicIntegrationTest > shouldGetToRunningWithWindowedTableInFKJ() STARTED
[2022-08-17T21:17:34.415Z]
[2022-08-17T21:17:34.415Z] InternalTopicIntegrationTest > shouldGetToRunningWithWindowedTableInFKJ() PASSED
[2022-08-17T21:17:34.415Z]
[2022-08-17T21:17:34.415Z] InternalTopicIntegrationTest > shouldCompactAndDeleteTopicsForWindowStoreChangelogs() STARTED
[2022-08-17T21:17:35.599Z]
[2022-08-17T21:17:35.599Z] InternalTopicIntegrationTest > shouldCompactAndDeleteTopicsForWindowStoreChangelogs() PASSED
[2022-08-17T21:17:36.612Z]
[2022-08-17T21:17:36.612Z] KStreamAggregationIntegrationTest > shouldAggregateSlidingWindows(TestInfo) STARTED
[2022-08-17T21:17:45.048Z]
[2022-08-17T21:17:45.048Z] KStreamAggregationIntegrationTest > shouldAggregateSlidingWindows(TestInfo) PASSED
[2022-08-17T21:17:45.048Z]
[2022-08-17T21:17:45.048Z] KStreamAggregationIntegrationTest > shouldReduceSessionWindows() STARTED
[2022-08-17T21:17:45.975Z]
[2022-08-17T21:17:45.975Z] KStreamAggregationIntegrationTest > shouldReduceSessionWindows() PASSED
[2022-08-17T21:17:45.975Z]
[2022-08-17T21:17:45.975Z] KStreamAggregationIntegrationTest > shouldReduceSlidingWindows(TestInfo) STARTED
[2022-08-17T21:17:51.965Z]
[2022-08-17T21:17:51.965Z] KStreamAggregationIntegrationTest > shouldReduceSlidingWindows(TestInfo) PASSED
[2022-08-17T21:17:51.965Z]
[2022-08-17T21:17:51.965Z] KStreamAggregationIntegrationTest > shouldReduce(TestInfo) STARTED
[2022-08-17T21:17:58.708Z]
[2022-08-17T21:17:58.708Z] KStreamAggregationIntegrationTest > shouldReduce(TestInfo) PASSED
[2022-08-17T21:17:58.708Z]
[2022-08-17T21:17:58.708Z] KStreamAggregationIntegrationTest > shouldAggregate(TestInfo) STARTED
[2022-08-17T21:18:02.961Z]
[2022-08-17T21:18:02.961Z] KStreamAggregationIntegrationTest > shouldAggregate(TestInfo) PASSED
[2022-08-17T21:18:02.961Z]
[2022-08-17T21:18:02.961Z] KStreamAggregationIntegrationTest > shouldCount(TestInfo) STARTED
[2022-08-17T21:18:07.030Z]
[2022-08-17T21:18:07.030Z] KStreamAggregationIntegrationTest > shouldCount(TestInfo) PASSED
[2022-08-17T21:18:07.030Z]
[2022-08-17T21:18:07.030Z] KStreamAggregationIntegrationTest > shouldGroupByKey(TestInfo) STARTED
[2022-08-17T21:18:13.971Z]
[2022-08-17T21:18:13.971Z] KStreamAggregationIntegrationTest > shouldGroupByKey(TestInfo) PASSED
[2022-08-17T21:18:13.971Z]
[2022-08-17T21:18:13.971Z] KStreamAggregationIntegrationTest > shouldCountWithInternalStore(TestInfo) STARTED
[2022-08-17T21:18:19.052Z]
[2022-08-17T21:18:19.052Z] KStreamAggregationIntegrationTest > shouldCountWithInternalStore(TestInfo) PASSED
[2022-08-17T21:18:19.052Z]
[2022-08-17T21:18:19.052Z] KStreamAggregationIntegrationTest > shouldCountUnlimitedWindows() STARTED
[2022-08-17T21:18:20.782Z]
[2022-08-17T21:18:20.782Z] KStreamAggregationIntegrationTest > shouldCountUnlimitedWindows() PASSED
[2022-08-17T21:18:20.782Z]
[2022-08-17T21:18:20.782Z] KStreamAggregationIntegrationTest > shouldReduceWindowed(TestInfo) STARTED
[2022-08-17T21:18:23.712Z]
[2022-08-17T21:18:23.712Z] KStreamAggregationIntegrationTest > shouldReduceWindowed(TestInfo) PASSED
[2022-08-17T21:18:23.712Z]
[2022-08-17T21:18:23.712Z] KStreamAggregationIntegrationTest > shouldCountSessionWindows() STARTED
[2022-08-17T21:18:26.772Z]
[2022-08-17T21:18:26.773Z] KStreamAggregationIntegrationTest > shouldCountSessionWindows() PASSED
[2022-08-17T21:18:26.773Z]
[2022-08-17T21:18:26.773Z] KStreamAggregationIntegrationTest > shouldAggregateWindowed(TestInfo) STARTED
[2022-08-17T21:18:33.067Z]
[2022-08-17T21:18:33.067Z] KStreamAggregationIntegrationTest > shouldAggregateWindowed(TestInfo) PASSED
[2022-08-17T21:18:41.538Z] streams-3: SMOKE-TEST-CLIENT-CLOSED
[2022-08-17T21:18:41.538Z] streams-4: SMOKE-TEST-CLIENT-CLOSED
[2022-08-17T21:18:41.539Z] streams-0: SMOKE-TEST-CLIENT-CLOSED
[2022-08-17T21:18:41.539Z] streams-2: SMOKE-TEST-CLIENT-CLOSED
[2022-08-17T21:18:41.539Z] streams-1: SMOKE-TEST-CLIENT-CLOSED
[2022-08-17T21:18:48.233Z]
[2022-08-17T21:18:48.233Z] BUILD SUCCESSFUL in 2h 44m 11s
[2022-08-17T21:18:48.233Z] 212 actionable tasks: 115 executed, 97 up-to-date
[2022-08-17T21:18:48.233Z]
[2022-08-17T21:18:48.233Z] See the profiling report at: file:///home/jenkins/jenkins-agent/workspace/Kafka_kafka_trunk@2/build/reports/profile/profile-2022-08-17-18-35-13.html
[2022-08-17T21:18:48.233Z] A fine-grained performance profile is available: use the --scan option.
[Pipeline] junit
[2022-08-17T21:18:49.073Z] Recording test results
[2022-08-17T21:19:03.738Z] [Checks API] No suitable checks publisher found.
[Pipeline] echo
[2022-08-17T21:19:03.739Z] Skipping Kafka Streams archetype test for Java 17
[Pipeline] }
[Pipeline] // withEnv
[Pipeline] }
[Pipeline] // withEnv
[Pipeline] }
[Pipeline] // withEnv
[Pipeline] }
[Pipeline] // node
[Pipeline] }
[Pipeline] // timestamps
[Pipeline] }
[Pipeline] // timeout
[Pipeline] }
[Pipeline] // stage
[Pipeline] }
[Pipeline] // parallel
[Pipeline] }
[Pipeline] // stage
[Pipeline] stage
[Pipeline] { (Declarative: Post Actions)
[Pipeline] node
Running on builds35 in /home/jenkins/workspace/Kafka_kafka_trunk
[Pipeline] {
[Pipeline] script
[Pipeline] {
[Pipeline] step