You are viewing a plain text version of this content. The canonical link for it is here.
Posted to commits@phoenix.apache.org by Apache Jenkins Server <je...@builds.apache.org> on 2019/11/04 20:39:32 UTC
Build failed in Jenkins: Phoenix | Master #2557
See <https://builds.apache.org/job/Phoenix-master/2557/display/redirect?page=changes>
Changes:
[gjacoby] PHOENIX-5549 BouncyCastle dependency definition has no effect
------------------------------------------
[...truncated 114.55 KB...]
[INFO]
[INFO] Results:
[INFO]
[WARNING] Tests run: 3709, Failures: 0, Errors: 0, Skipped: 2
[INFO]
[INFO]
[INFO] --- maven-failsafe-plugin:2.22.2:integration-test (HBaseManagedTimeTests) @ phoenix-core ---
[INFO]
[INFO] -------------------------------------------------------
[INFO] T E S T S
[INFO] -------------------------------------------------------
[INFO]
[INFO] Results:
[INFO]
[INFO] Tests run: 0, Failures: 0, Errors: 0, Skipped: 0
[INFO]
[INFO]
[INFO] --- maven-failsafe-plugin:2.22.2:integration-test (NeedTheirOwnClusterTests) @ phoenix-core ---
[INFO]
[INFO] -------------------------------------------------------
[INFO] T E S T S
[INFO] -------------------------------------------------------
[INFO] Running org.apache.hadoop.hbase.regionserver.wal.WALReplayWithIndexWritesAndCompressedWALIT
[WARNING] Tests run: 1, Failures: 0, Errors: 0, Skipped: 1, Time elapsed: 0.004 s - in org.apache.hadoop.hbase.regionserver.wal.WALReplayWithIndexWritesAndCompressedWALIT
[INFO] Running org.apache.phoenix.end2end.ConnectionUtilIT
[INFO] Running org.apache.hadoop.hbase.regionserver.wal.WALRecoveryRegionPostOpenIT
[INFO] Tests run: 1, Failures: 0, Errors: 0, Skipped: 0, Time elapsed: 12.95 s - in org.apache.hadoop.hbase.regionserver.wal.WALRecoveryRegionPostOpenIT
[INFO] Running org.apache.phoenix.end2end.ConcurrentMutationsExtendedIT
[INFO] Running org.apache.phoenix.end2end.ContextClassloaderIT
[INFO] Running org.apache.phoenix.end2end.CountDistinctCompressionIT
[INFO] Running org.apache.phoenix.end2end.CsvBulkLoadToolIT
[INFO] Tests run: 3, Failures: 0, Errors: 0, Skipped: 0, Time elapsed: 2.908 s - in org.apache.phoenix.end2end.ContextClassloaderIT
[INFO] Tests run: 1, Failures: 0, Errors: 0, Skipped: 0, Time elapsed: 41.916 s - in org.apache.phoenix.end2end.ConnectionUtilIT
[INFO] Tests run: 1, Failures: 0, Errors: 0, Skipped: 0, Time elapsed: 5.302 s - in org.apache.phoenix.end2end.CountDistinctCompressionIT
[INFO] Running org.apache.phoenix.end2end.CostBasedDecisionIT
[INFO] Running org.apache.phoenix.end2end.DropSchemaIT
[INFO] Running org.apache.phoenix.end2end.IndexBuildTimestampIT
[INFO] Running org.apache.phoenix.end2end.FlappingLocalIndexIT
[INFO] Tests run: 2, Failures: 0, Errors: 0, Skipped: 0, Time elapsed: 15.358 s - in org.apache.phoenix.end2end.DropSchemaIT
[INFO] Running org.apache.phoenix.end2end.IndexExtendedIT
[INFO] Tests run: 16, Failures: 0, Errors: 0, Skipped: 0, Time elapsed: 120.608 s - in org.apache.phoenix.end2end.CsvBulkLoadToolIT
[INFO] Running org.apache.phoenix.end2end.IndexRebuildTaskIT
[INFO] Tests run: 1, Failures: 0, Errors: 0, Skipped: 0, Time elapsed: 18.046 s - in org.apache.phoenix.end2end.IndexRebuildTaskIT
[INFO] Tests run: 20, Failures: 0, Errors: 0, Skipped: 0, Time elapsed: 96.215 s - in org.apache.phoenix.end2end.IndexExtendedIT
[INFO] Running org.apache.phoenix.end2end.IndexScrutinyToolForTenantIT
[INFO] Running org.apache.phoenix.end2end.IndexScrutinyToolIT
[INFO] Running org.apache.phoenix.end2end.IndexToolForPartialBuildIT
[INFO] Tests run: 12, Failures: 0, Errors: 0, Skipped: 0, Time elapsed: 170.816 s - in org.apache.phoenix.end2end.FlappingLocalIndexIT
[INFO] Tests run: 6, Failures: 0, Errors: 0, Skipped: 0, Time elapsed: 58.744 s - in org.apache.phoenix.end2end.IndexScrutinyToolForTenantIT
[INFO] Tests run: 16, Failures: 0, Errors: 0, Skipped: 0, Time elapsed: 176.108 s - in org.apache.phoenix.end2end.IndexBuildTimestampIT
[INFO] Tests run: 1, Failures: 0, Errors: 0, Skipped: 0, Time elapsed: 21.764 s - in org.apache.phoenix.end2end.IndexToolForPartialBuildIT
[INFO] Running org.apache.phoenix.end2end.MigrateSystemTablesToSystemNamespaceIT
[INFO] Running org.apache.phoenix.end2end.IndexToolForPartialBuildWithNamespaceEnabledIT
[INFO] Running org.apache.phoenix.end2end.IndexToolIT
[INFO] Running org.apache.phoenix.end2end.LocalIndexSplitMergeIT
[INFO] Tests run: 10, Failures: 0, Errors: 0, Skipped: 0, Time elapsed: 341.726 s - in org.apache.phoenix.end2end.ConcurrentMutationsExtendedIT
[INFO] Tests run: 2, Failures: 0, Errors: 0, Skipped: 0, Time elapsed: 37.879 s - in org.apache.phoenix.end2end.IndexToolForPartialBuildWithNamespaceEnabledIT
[INFO] Running org.apache.phoenix.end2end.OrderByWithServerMemoryLimitIT
[INFO] Running org.apache.phoenix.end2end.OrderByWithServerClientSpoolingDisabledIT
[INFO] Tests run: 1, Failures: 0, Errors: 0, Skipped: 0, Time elapsed: 2.826 s - in org.apache.phoenix.end2end.OrderByWithServerMemoryLimitIT
[INFO] Running org.apache.phoenix.end2end.OrderByWithSpillingIT
[INFO] Tests run: 3, Failures: 0, Errors: 0, Skipped: 0, Time elapsed: 202.837 s - in org.apache.phoenix.end2end.LocalIndexSplitMergeIT
[INFO] Running org.apache.phoenix.end2end.ParameterizedIndexUpgradeToolIT
[WARNING] Tests run: 33, Failures: 0, Errors: 0, Skipped: 3, Time elapsed: 346.315 s - in org.apache.phoenix.end2end.IndexScrutinyToolIT
[INFO] Tests run: 4, Failures: 0, Errors: 0, Skipped: 0, Time elapsed: 313.074 s - in org.apache.phoenix.end2end.MigrateSystemTablesToSystemNamespaceIT
[INFO] Tests run: 16, Failures: 0, Errors: 0, Skipped: 0, Time elapsed: 170.416 s - in org.apache.phoenix.end2end.OrderByWithServerClientSpoolingDisabledIT
[INFO] Running org.apache.phoenix.end2end.PartialResultServerConfigurationIT
[INFO] Running org.apache.phoenix.end2end.PermissionNSDisabledIT
[INFO] Running org.apache.phoenix.end2end.PermissionNSEnabledIT
[INFO] Tests run: 1, Failures: 0, Errors: 0, Skipped: 0, Time elapsed: 53.657 s - in org.apache.phoenix.end2end.PartialResultServerConfigurationIT
[INFO] Tests run: 20, Failures: 0, Errors: 0, Skipped: 0, Time elapsed: 643.402 s - in org.apache.phoenix.end2end.CostBasedDecisionIT
[INFO] Running org.apache.phoenix.end2end.PermissionsCacheIT
[INFO] Tests run: 16, Failures: 0, Errors: 0, Skipped: 0, Time elapsed: 218.684 s - in org.apache.phoenix.end2end.OrderByWithSpillingIT
[INFO] Running org.apache.phoenix.end2end.PhoenixDriverIT
[INFO] Tests run: 4, Failures: 0, Errors: 0, Skipped: 0, Time elapsed: 66.202 s - in org.apache.phoenix.end2end.PhoenixDriverIT
[INFO] Running org.apache.phoenix.end2end.QueryLoggerIT
[INFO] Tests run: 7, Failures: 0, Errors: 0, Skipped: 0, Time elapsed: 50.852 s - in org.apache.phoenix.end2end.QueryLoggerIT
[INFO] Running org.apache.phoenix.end2end.QueryTimeoutIT
[INFO] Tests run: 2, Failures: 0, Errors: 0, Skipped: 0, Time elapsed: 8.227 s - in org.apache.phoenix.end2end.QueryTimeoutIT
[INFO] Running org.apache.phoenix.end2end.QueryWithLimitIT
[INFO] Tests run: 2, Failures: 0, Errors: 0, Skipped: 0, Time elapsed: 7.301 s - in org.apache.phoenix.end2end.QueryWithLimitIT
[INFO] Running org.apache.phoenix.end2end.RebuildIndexConnectionPropsIT
[INFO] Tests run: 1, Failures: 0, Errors: 0, Skipped: 0, Time elapsed: 0.384 s - in org.apache.phoenix.end2end.RebuildIndexConnectionPropsIT
[INFO] Running org.apache.phoenix.end2end.RegexBulkLoadToolIT
[INFO] Tests run: 8, Failures: 0, Errors: 0, Skipped: 0, Time elapsed: 355.912 s - in org.apache.phoenix.end2end.PermissionNSDisabledIT
[INFO] Running org.apache.phoenix.end2end.RenewLeaseIT
[INFO] Tests run: 1, Failures: 0, Errors: 0, Skipped: 0, Time elapsed: 28.776 s - in org.apache.phoenix.end2end.RenewLeaseIT
[INFO] Tests run: 11, Failures: 0, Errors: 0, Skipped: 0, Time elapsed: 374.508 s - in org.apache.phoenix.end2end.PermissionNSEnabledIT
[INFO] Tests run: 9, Failures: 0, Errors: 0, Skipped: 0, Time elapsed: 343.263 s - in org.apache.phoenix.end2end.PermissionsCacheIT
[WARNING] Tests run: 10, Failures: 0, Errors: 0, Skipped: 2, Time elapsed: 69.392 s - in org.apache.phoenix.end2end.RegexBulkLoadToolIT
[INFO] Running org.apache.phoenix.end2end.SystemCatalogCreationOnConnectionIT
[INFO] Running org.apache.phoenix.end2end.SequencePointInTimeIT
[INFO] Tests run: 1, Failures: 0, Errors: 0, Skipped: 0, Time elapsed: 0.171 s - in org.apache.phoenix.end2end.SequencePointInTimeIT
[INFO] Running org.apache.phoenix.end2end.StatsEnabledSplitSystemCatalogIT
[INFO] Running org.apache.phoenix.end2end.SpillableGroupByIT
[INFO] Tests run: 3, Failures: 0, Errors: 0, Skipped: 0, Time elapsed: 15.308 s - in org.apache.phoenix.end2end.SpillableGroupByIT
[INFO] Running org.apache.phoenix.end2end.SystemCatalogIT
[INFO] Running org.apache.phoenix.end2end.TableSnapshotReadsMapReduceIT
[INFO] Running org.apache.phoenix.end2end.UpdateCacheAcrossDifferentClientsIT
[INFO] Tests run: 4, Failures: 0, Errors: 0, Skipped: 0, Time elapsed: 40.17 s - in org.apache.phoenix.end2end.TableSnapshotReadsMapReduceIT
[INFO] Tests run: 18, Failures: 0, Errors: 0, Skipped: 0, Time elapsed: 94.51 s - in org.apache.phoenix.end2end.StatsEnabledSplitSystemCatalogIT
[INFO] Tests run: 2, Failures: 0, Errors: 0, Skipped: 0, Time elapsed: 67.116 s - in org.apache.phoenix.end2end.SystemCatalogIT
[INFO] Running org.apache.phoenix.end2end.UpgradeIT
[INFO] Tests run: 6, Failures: 0, Errors: 0, Skipped: 0, Time elapsed: 87.839 s - in org.apache.phoenix.end2end.UpdateCacheAcrossDifferentClientsIT
[INFO] Running org.apache.phoenix.end2end.UserDefinedFunctionsIT
[INFO] Running org.apache.phoenix.end2end.index.GlobalIndexCheckerIT
[INFO] Running org.apache.phoenix.end2end.index.ImmutableIndexIT
[INFO] Tests run: 105, Failures: 0, Errors: 0, Skipped: 0, Time elapsed: 953.87 s - in org.apache.phoenix.end2end.IndexToolIT
[INFO] Tests run: 9, Failures: 0, Errors: 0, Skipped: 0, Time elapsed: 119.784 s - in org.apache.phoenix.end2end.UpgradeIT
[INFO] Running org.apache.phoenix.end2end.index.IndexRebuildIncrementDisableCountIT
[INFO] Tests run: 2, Failures: 0, Errors: 0, Skipped: 0, Time elapsed: 11.446 s - in org.apache.phoenix.end2end.index.IndexRebuildIncrementDisableCountIT
[INFO] Tests run: 16, Failures: 0, Errors: 0, Skipped: 0, Time elapsed: 130.746 s - in org.apache.phoenix.end2end.UserDefinedFunctionsIT
[INFO] Running org.apache.phoenix.end2end.index.LocalIndexIT
[INFO] Running org.apache.phoenix.end2end.index.MutableIndexFailureIT
[INFO] Running org.apache.phoenix.end2end.index.MutableIndexExtendedIT
[WARNING] Tests run: 27, Failures: 0, Errors: 0, Skipped: 9, Time elapsed: 30.347 s - in org.apache.phoenix.end2end.index.MutableIndexExtendedIT
[ERROR] Tests run: 12, Failures: 0, Errors: 1, Skipped: 0, Time elapsed: 930.32 s <<< FAILURE! - in org.apache.phoenix.end2end.ParameterizedIndexUpgradeToolIT
[ERROR] testToolWithInputFileParameter[IndexUpgradeToolIT_mutable=false,upgrade=true,isNamespaceEnabled=false](org.apache.phoenix.end2end.ParameterizedIndexUpgradeToolIT) Time elapsed: 95.734 s <<< ERROR!
java.lang.NullPointerException
at org.apache.phoenix.end2end.ParameterizedIndexUpgradeToolIT.testToolWithInputFileParameter(ParameterizedIndexUpgradeToolIT.java:317)
[INFO] Running org.apache.phoenix.end2end.index.MutableIndexRebuilderIT
[INFO] Tests run: 32, Failures: 0, Errors: 0, Skipped: 0, Time elapsed: 246.336 s - in org.apache.phoenix.end2end.index.GlobalIndexCheckerIT
[INFO] Running org.apache.phoenix.end2end.index.MutableIndexFailureWithNamespaceIT
[INFO] Tests run: 1, Failures: 0, Errors: 0, Skipped: 0, Time elapsed: 70.204 s - in org.apache.phoenix.end2end.index.MutableIndexRebuilderIT
[INFO] Running org.apache.phoenix.end2end.index.MutableIndexReplicationIT
[INFO] Tests run: 1, Failures: 0, Errors: 0, Skipped: 0, Time elapsed: 29.918 s - in org.apache.phoenix.end2end.index.MutableIndexReplicationIT
[INFO] Running org.apache.phoenix.end2end.index.PartialIndexRebuilderIT
[INFO] Running org.apache.phoenix.end2end.index.PhoenixMRJobSubmitterIT
[INFO] Tests run: 1, Failures: 0, Errors: 0, Skipped: 0, Time elapsed: 9.958 s - in org.apache.phoenix.end2end.index.PhoenixMRJobSubmitterIT
[INFO] Tests run: 14, Failures: 0, Errors: 0, Skipped: 0, Time elapsed: 248.401 s - in org.apache.phoenix.end2end.index.MutableIndexFailureIT
[INFO] Tests run: 8, Failures: 0, Errors: 0, Skipped: 0, Time elapsed: 168.839 s - in org.apache.phoenix.end2end.index.MutableIndexFailureWithNamespaceIT
[INFO] Running org.apache.phoenix.end2end.join.HashJoinCacheIT
[INFO] Running org.apache.phoenix.end2end.index.txn.TxWriteFailureIT
[INFO] Tests run: 1, Failures: 0, Errors: 0, Skipped: 0, Time elapsed: 11.434 s - in org.apache.phoenix.end2end.join.HashJoinCacheIT
[INFO] Tests run: 11, Failures: 0, Errors: 0, Skipped: 0, Time elapsed: 696.174 s - in org.apache.phoenix.end2end.SystemCatalogCreationOnConnectionIT
[INFO] Running org.apache.phoenix.end2end.join.SortMergeJoinNoSpoolingIT
[INFO] Tests run: 36, Failures: 0, Errors: 0, Skipped: 0, Time elapsed: 19.74 s - in org.apache.phoenix.end2end.join.SortMergeJoinNoSpoolingIT
[INFO] Running org.apache.phoenix.hbase.index.FailForUnsupportedHBaseVersionsIT
[INFO] Tests run: 12, Failures: 0, Errors: 0, Skipped: 0, Time elapsed: 63.884 s - in org.apache.phoenix.end2end.index.txn.TxWriteFailureIT
[INFO] Tests run: 2, Failures: 0, Errors: 0, Skipped: 0, Time elapsed: 24.321 s - in org.apache.phoenix.hbase.index.FailForUnsupportedHBaseVersionsIT
[INFO] Running org.apache.phoenix.execute.UpsertSelectOverlappingBatchesIT
[INFO] Running org.apache.phoenix.execute.PartialCommitIT
[INFO] Running org.apache.phoenix.iterate.RoundRobinResultIteratorWithStatsIT
[WARNING] Tests run: 72, Failures: 0, Errors: 0, Skipped: 18, Time elapsed: 575.576 s - in org.apache.phoenix.end2end.index.ImmutableIndexIT
[INFO] Running org.apache.phoenix.iterate.ScannerLeaseRenewalIT
[INFO] Tests run: 1, Failures: 0, Errors: 0, Skipped: 0, Time elapsed: 5.845 s - in org.apache.phoenix.iterate.RoundRobinResultIteratorWithStatsIT
[INFO] Running org.apache.phoenix.jdbc.SecureUserConnectionsIT
[INFO] Tests run: 8, Failures: 0, Errors: 0, Skipped: 0, Time elapsed: 1.832 s - in org.apache.phoenix.jdbc.SecureUserConnectionsIT
[INFO] Tests run: 3, Failures: 0, Errors: 0, Skipped: 0, Time elapsed: 66.247 s - in org.apache.phoenix.execute.UpsertSelectOverlappingBatchesIT
[INFO] Tests run: 12, Failures: 0, Errors: 0, Skipped: 0, Time elapsed: 93.288 s - in org.apache.phoenix.execute.PartialCommitIT
[INFO] Running org.apache.phoenix.monitoring.PhoenixLoggingMetricsIT
[INFO] Running org.apache.phoenix.monitoring.PhoenixMetricsDisabledIT
[INFO] Tests run: 1, Failures: 0, Errors: 0, Skipped: 0, Time elapsed: 0.005 s - in org.apache.phoenix.monitoring.PhoenixMetricsDisabledIT
[INFO] Running org.apache.phoenix.monitoring.PhoenixMetricsIT
[INFO] Tests run: 4, Failures: 0, Errors: 0, Skipped: 0, Time elapsed: 28.306 s - in org.apache.phoenix.monitoring.PhoenixLoggingMetricsIT
[INFO] Running org.apache.phoenix.rpc.PhoenixClientRpcIT
[INFO] Tests run: 2, Failures: 0, Errors: 0, Skipped: 0, Time elapsed: 7.35 s - in org.apache.phoenix.rpc.PhoenixClientRpcIT
[INFO] Running org.apache.phoenix.rpc.PhoenixServerRpcIT
[INFO] Tests run: 2, Failures: 0, Errors: 0, Skipped: 0, Time elapsed: 18.043 s - in org.apache.phoenix.rpc.PhoenixServerRpcIT
[INFO] Running org.apache.phoenix.schema.stats.NamespaceDisabledStatsCollectorIT
[INFO] Running org.apache.phoenix.schema.stats.NamespaceEnabledStatsCollectorIT
[INFO] Tests run: 2, Failures: 0, Errors: 0, Skipped: 0, Time elapsed: 167.23 s - in org.apache.phoenix.iterate.ScannerLeaseRenewalIT
[INFO] Tests run: 22, Failures: 0, Errors: 0, Skipped: 0, Time elapsed: 97.732 s - in org.apache.phoenix.monitoring.PhoenixMetricsIT
[INFO] Tests run: 50, Failures: 0, Errors: 0, Skipped: 0, Time elapsed: 627.435 s - in org.apache.phoenix.end2end.index.LocalIndexIT
[INFO] Running org.apache.phoenix.schema.stats.NoOpStatsCollectorIT
[INFO] Running org.apache.phoenix.tool.ParameterizedPhoenixCanaryToolIT
[INFO] Tests run: 2, Failures: 0, Errors: 0, Skipped: 0, Time elapsed: 14.121 s - in org.apache.phoenix.schema.stats.NoOpStatsCollectorIT
[INFO] Running org.apache.phoenix.schema.stats.NonTxStatsCollectorIT
[INFO] Running org.apache.phoenix.schema.stats.TxStatsCollectorIT
[INFO] Running org.apache.phoenix.util.CoprocessorHConnectionTableFactoryIT
[INFO] Tests run: 1, Failures: 0, Errors: 0, Skipped: 0, Time elapsed: 8.625 s - in org.apache.phoenix.util.CoprocessorHConnectionTableFactoryIT
[INFO] Tests run: 8, Failures: 0, Errors: 0, Skipped: 0, Time elapsed: 102.308 s - in org.apache.phoenix.tool.ParameterizedPhoenixCanaryToolIT
[INFO] Tests run: 31, Failures: 0, Errors: 0, Skipped: 0, Time elapsed: 559.331 s - in org.apache.phoenix.end2end.index.PartialIndexRebuilderIT
[WARNING] Tests run: 26, Failures: 0, Errors: 0, Skipped: 4, Time elapsed: 184.763 s - in org.apache.phoenix.schema.stats.NamespaceDisabledStatsCollectorIT
[WARNING] Tests run: 26, Failures: 0, Errors: 0, Skipped: 4, Time elapsed: 200.104 s - in org.apache.phoenix.schema.stats.NamespaceEnabledStatsCollectorIT
[WARNING] Tests run: 39, Failures: 0, Errors: 0, Skipped: 6, Time elapsed: 161.305 s - in org.apache.phoenix.schema.stats.NonTxStatsCollectorIT
[WARNING] Tests run: 78, Failures: 0, Errors: 0, Skipped: 12, Time elapsed: 282.992 s - in org.apache.phoenix.schema.stats.TxStatsCollectorIT
[INFO]
[INFO] Results:
[INFO]
[ERROR] Errors:
[ERROR] ParameterizedIndexUpgradeToolIT.testToolWithInputFileParameter:317 ยป NullPointer
[INFO]
[ERROR] Tests run: 956, Failures: 0, Errors: 1, Skipped: 59
[INFO]
[INFO]
[INFO] --- maven-failsafe-plugin:2.22.2:integration-test (SplitSystemCatalogTests) @ phoenix-core ---
[INFO]
[INFO] -------------------------------------------------------
[INFO] T E S T S
[INFO] -------------------------------------------------------
[INFO] Running org.apache.phoenix.end2end.AlterMultiTenantTableWithViewsIT
[INFO] Running org.apache.phoenix.end2end.AlterTableWithViewsIT
[INFO] Running org.apache.phoenix.end2end.DropIndexedColsIT
[INFO] Running org.apache.phoenix.end2end.DropTableWithViewsIT
[INFO] Tests run: 4, Failures: 0, Errors: 0, Skipped: 0, Time elapsed: 22.459 s - in org.apache.phoenix.end2end.DropTableWithViewsIT
[INFO] Tests run: 4, Failures: 0, Errors: 0, Skipped: 0, Time elapsed: 35.306 s - in org.apache.phoenix.end2end.DropIndexedColsIT
[INFO] Running org.apache.phoenix.end2end.TenantSpecificViewIndexIT
[INFO] Running org.apache.phoenix.end2end.TenantSpecificViewIndexSaltedIT
[INFO] Running org.apache.phoenix.end2end.ViewIT
[INFO] Tests run: 9, Failures: 0, Errors: 0, Skipped: 0, Time elapsed: 115.892 s - in org.apache.phoenix.end2end.AlterMultiTenantTableWithViewsIT
[INFO] Tests run: 4, Failures: 0, Errors: 0, Skipped: 0, Time elapsed: 58.406 s - in org.apache.phoenix.end2end.TenantSpecificViewIndexSaltedIT
[INFO] Tests run: 10, Failures: 0, Errors: 0, Skipped: 0, Time elapsed: 115.931 s - in org.apache.phoenix.end2end.TenantSpecificViewIndexIT
[INFO] Running org.apache.phoenix.end2end.ViewMetadataIT
[INFO] Running org.apache.phoenix.end2end.index.ViewIndexIT
[INFO] Tests run: 20, Failures: 0, Errors: 0, Skipped: 0, Time elapsed: 138.033 s - in org.apache.phoenix.end2end.ViewMetadataIT
[INFO] Tests run: 56, Failures: 0, Errors: 0, Skipped: 0, Time elapsed: 359.778 s - in org.apache.phoenix.end2end.AlterTableWithViewsIT
[WARNING] Tests run: 16, Failures: 0, Errors: 0, Skipped: 2, Time elapsed: 109.635 s - in org.apache.phoenix.end2end.index.ViewIndexIT
[INFO] Tests run: 75, Failures: 0, Errors: 0, Skipped: 0, Time elapsed: 292.392 s - in org.apache.phoenix.end2end.ViewIT
[INFO]
[INFO] Results:
[INFO]
[WARNING] Tests run: 198, Failures: 0, Errors: 0, Skipped: 2
[INFO]
[INFO]
[INFO] --- maven-failsafe-plugin:2.22.2:verify (ParallelStatsEnabledTest) @ phoenix-core ---
[INFO] ------------------------------------------------------------------------
[INFO] Reactor Summary for Apache Phoenix 5.1.0-HBase-2.0-SNAPSHOT:
[INFO]
[INFO] Apache Phoenix ..................................... SUCCESS [ 3.559 s]
[INFO] Phoenix Core ....................................... FAILURE [ 02:04 h]
[INFO] Phoenix - Pherf .................................... SKIPPED
[INFO] Phoenix Client ..................................... SKIPPED
[INFO] Phoenix Server ..................................... SKIPPED
[INFO] Phoenix Assembly ................................... SKIPPED
[INFO] Phoenix - Tracing Web Application .................. SKIPPED
[INFO] ------------------------------------------------------------------------
[INFO] BUILD FAILURE
[INFO] ------------------------------------------------------------------------
[INFO] Total time: 02:04 h
[INFO] Finished at: 2019-11-04T20:39:25Z
[INFO] ------------------------------------------------------------------------
[ERROR] Failed to execute goal org.apache.maven.plugins:maven-failsafe-plugin:2.22.2:verify (ParallelStatsEnabledTest) on project phoenix-core: There are test failures.
[ERROR]
[ERROR] Please refer to <https://builds.apache.org/job/Phoenix-master/ws/phoenix-core/target/failsafe-reports> for the individual test results.
[ERROR] Please refer to dump files (if any exist) [date].dump, [date]-jvmRun[N].dump and [date].dumpstream.
[ERROR] -> [Help 1]
[ERROR]
[ERROR] To see the full stack trace of the errors, re-run Maven with the -e switch.
[ERROR] Re-run Maven using the -X switch to enable full debug logging.
[ERROR]
[ERROR] For more information about the errors and possible solutions, please read the following articles:
[ERROR] [Help 1] http://cwiki.apache.org/confluence/display/MAVEN/MojoFailureException
[ERROR]
[ERROR] After correcting the problems, you can resume the build with the command
[ERROR] mvn <args> -rf :phoenix-core
Build step 'Invoke top-level Maven targets' marked build as failure
Recording test results
Jenkins build is back to normal : Phoenix | Master #2558
Posted by Apache Jenkins Server <je...@builds.apache.org>.
See <https://builds.apache.org/job/Phoenix-master/2558/display/redirect?page=changes>