You are viewing a plain text version of this content. The canonical link for it is here.
Posted to dev@zookeeper.apache.org by Apache Jenkins Server <je...@builds.apache.org> on 2018/02/06 11:38:27 UTC

Failed: ZOOKEEPER- PreCommit Build #1447

Build: https://builds.apache.org/job/PreCommit-ZOOKEEPER-github-pr-build/1447/

###################################################################################
########################## LAST 60 LINES OF THE CONSOLE ###########################
[...truncated 43.05 MB...]
     [exec]     +1 javac.  The applied patch does not increase the total number of javac compiler warnings.
     [exec] 
     [exec]     +1 findbugs.  The patch does not introduce any new Findbugs (version 3.0.1) warnings.
     [exec] 
     [exec]     +1 release audit.  The applied patch does not increase the total number of release audit warnings.
     [exec] 
     [exec]     -1 core tests.  The patch failed core unit tests.
     [exec] 
     [exec]     +1 contrib tests.  The patch passed contrib unit tests.
     [exec] 
     [exec] Test results: https://builds.apache.org/job/PreCommit-ZOOKEEPER-github-pr-build/1447//testReport/
     [exec] Findbugs warnings: https://builds.apache.org/job/PreCommit-ZOOKEEPER-github-pr-build/1447//artifact/trunk/build/test/findbugs/newPatchFindbugsWarnings.html
     [exec] Console output: https://builds.apache.org/job/PreCommit-ZOOKEEPER-github-pr-build/1447//console
     [exec] 
     [exec] This message is automatically generated.
     [exec] 
     [exec] 
     [exec] ======================================================================
     [exec] ======================================================================
     [exec]     Adding comment to Jira.
     [exec] ======================================================================
     [exec] ======================================================================
     [exec] 
     [exec] 
     [exec] Unable to log in to server: https://issues.apache.org/jira/rpc/soap/jirasoapservice-v2 with user: hadoopqa.
     [exec]  Cause: ; nested exception is: 
     [exec] 	javax.net.ssl.SSLException: Received fatal alert: protocol_version
     [exec] Unable to log in to server: https://issues.apache.org/jira/rpc/soap/jirasoapservice-v2 with user: hadoopqa.
     [exec]  Cause: ; nested exception is: 
     [exec] 	javax.net.ssl.SSLException: Received fatal alert: protocol_version
     [exec] 
     [exec] 
     [exec] ======================================================================
     [exec] ======================================================================
     [exec]     Finished build.
     [exec] ======================================================================
     [exec] ======================================================================
     [exec] 
     [exec] 
     [exec] mv: '/home/jenkins/jenkins-slave/workspace/PreCommit-ZOOKEEPER-github-pr-build/patchprocess' and '/home/jenkins/jenkins-slave/workspace/PreCommit-ZOOKEEPER-github-pr-build/patchprocess' are the same file

BUILD FAILED
/home/jenkins/jenkins-slave/workspace/PreCommit-ZOOKEEPER-github-pr-build/build.xml:1722: exec returned: 1

Total time: 22 minutes 19 seconds
Build step 'Execute shell' marked build as failure
Archiving artifacts
Setting JDK_1_7_LATEST__HOME=/home/jenkins/tools/java/latest1.7
Recording test results
Setting JDK_1_7_LATEST__HOME=/home/jenkins/tools/java/latest1.7
Setting JDK_1_7_LATEST__HOME=/home/jenkins/tools/java/latest1.7
[description-setter] Description set: ZOOKEEPER-2930
Putting comment on the pull request
Setting JDK_1_7_LATEST__HOME=/home/jenkins/tools/java/latest1.7
Email was triggered for: Failure - Any
Sending email for trigger: Failure - Any
Setting JDK_1_7_LATEST__HOME=/home/jenkins/tools/java/latest1.7
Setting JDK_1_7_LATEST__HOME=/home/jenkins/tools/java/latest1.7
Setting JDK_1_7_LATEST__HOME=/home/jenkins/tools/java/latest1.7



###################################################################################
############################## FAILED TESTS (if any) ##############################
175 tests failed.
FAILED:  org.apache.zookeeper.server.MultiOpSessionUpgradeTest.directCheckUpgradeSessionTest

Error Message:
waiting for server up

Stack Trace:
junit.framework.AssertionFailedError: waiting for server up
	at org.apache.zookeeper.test.QuorumBase.startServers(QuorumBase.java:224)
	at org.apache.zookeeper.test.QuorumBase.setUp(QuorumBase.java:121)
	at org.apache.zookeeper.test.QuorumBase.setUp(QuorumBase.java:79)
	at org.apache.zookeeper.server.MultiOpSessionUpgradeTest.setUp(MultiOpSessionUpgradeTest.java:54)


FAILED:  org.apache.zookeeper.server.MultiOpSessionUpgradeTest.ephemeralCreateMultiOpTest

Error Message:
waiting for server up

Stack Trace:
junit.framework.AssertionFailedError: waiting for server up
	at org.apache.zookeeper.test.QuorumBase.startServers(QuorumBase.java:224)
	at org.apache.zookeeper.test.QuorumBase.setUp(QuorumBase.java:121)
	at org.apache.zookeeper.test.QuorumBase.setUp(QuorumBase.java:79)
	at org.apache.zookeeper.server.MultiOpSessionUpgradeTest.setUp(MultiOpSessionUpgradeTest.java:54)


FAILED:  org.apache.zookeeper.server.MultiOpSessionUpgradeTest.testNull

Error Message:
waiting for server up

Stack Trace:
junit.framework.AssertionFailedError: waiting for server up
	at org.apache.zookeeper.test.QuorumBase.startServers(QuorumBase.java:224)
	at org.apache.zookeeper.test.QuorumBase.setUp(QuorumBase.java:121)
	at org.apache.zookeeper.test.QuorumBase.setUp(QuorumBase.java:79)
	at org.apache.zookeeper.server.MultiOpSessionUpgradeTest.setUp(MultiOpSessionUpgradeTest.java:54)


FAILED:  org.apache.zookeeper.server.ZxidRolloverTest.testSimpleRolloverFollower

Error Message:
null

Stack Trace:
java.lang.NullPointerException
	at org.apache.zookeeper.server.ZxidRolloverTest.tearDown(ZxidRolloverTest.java:217)


FAILED:  org.apache.zookeeper.server.ZxidRolloverTest.testRolloverThenLeaderRestart

Error Message:
null

Stack Trace:
java.lang.NullPointerException
	at org.apache.zookeeper.server.ZxidRolloverTest.tearDown(ZxidRolloverTest.java:217)


FAILED:  org.apache.zookeeper.server.ZxidRolloverTest.testRolloverThenFollowerRestart

Error Message:
null

Stack Trace:
java.lang.NullPointerException
	at org.apache.zookeeper.server.ZxidRolloverTest.tearDown(ZxidRolloverTest.java:217)


FAILED:  org.apache.zookeeper.server.ZxidRolloverTest.testMultipleRollover

Error Message:
null

Stack Trace:
java.lang.NullPointerException
	at org.apache.zookeeper.server.ZxidRolloverTest.tearDown(ZxidRolloverTest.java:217)


FAILED:  org.apache.zookeeper.server.ZxidRolloverTest.testRolloverThenRestart

Error Message:
null

Stack Trace:
java.lang.NullPointerException
	at org.apache.zookeeper.server.ZxidRolloverTest.tearDown(ZxidRolloverTest.java:217)


FAILED:  org.apache.zookeeper.server.admin.JettyAdminServerTest.testQuorum

Error Message:
waiting for server 1 being up

Stack Trace:
junit.framework.AssertionFailedError: waiting for server 1 being up
	at org.apache.zookeeper.server.admin.JettyAdminServerTest.testQuorum(JettyAdminServerTest.java:124)
	at org.apache.zookeeper.JUnit4ZKTestRunner$LoggedInvokeMethod.evaluate(JUnit4ZKTestRunner.java:79)


FAILED:  org.apache.zookeeper.server.quorum.FLELostMessageTest.testLostMessage

Error Message:
Timeout occurred. Please note the time in the report does not reflect the time until the timeout.

Stack Trace:
junit.framework.AssertionFailedError: Timeout occurred. Please note the time in the report does not reflect the time until the timeout.
	at java.lang.Thread.run(Thread.java:745)


FAILED:  org.apache.zookeeper.server.quorum.QuorumPeerMainTest.testInconsistentPeerType

Error Message:
waiting for server 1 being up

Stack Trace:
junit.framework.AssertionFailedError: waiting for server 1 being up
	at org.apache.zookeeper.server.quorum.QuorumPeerMainTest.testInconsistentPeerType(QuorumPeerMainTest.java:609)
	at org.apache.zookeeper.JUnit4ZKTestRunner$LoggedInvokeMethod.evaluate(JUnit4ZKTestRunner.java:79)


FAILED:  org.apache.zookeeper.server.quorum.QuorumPeerMainTest.testMinMaxSessionTimeOut

Error Message:
waiting for server 1 being up

Stack Trace:
junit.framework.AssertionFailedError: waiting for server 1 being up
	at org.apache.zookeeper.server.quorum.QuorumPeerMainTest.testMinMaxSessionTimeOut(QuorumPeerMainTest.java:834)
	at org.apache.zookeeper.JUnit4ZKTestRunner$LoggedInvokeMethod.evaluate(JUnit4ZKTestRunner.java:79)


FAILED:  org.apache.zookeeper.server.quorum.QuorumPeerMainTest.testEarlyLeaderAbandonment

Error Message:
Waiting too long

Stack Trace:
java.lang.RuntimeException: Waiting too long
	at org.apache.zookeeper.server.quorum.QuorumPeerMainTest.waitForAll(QuorumPeerMainTest.java:450)
	at org.apache.zookeeper.server.quorum.QuorumPeerMainTest.testEarlyLeaderAbandonment(QuorumPeerMainTest.java:162)
	at org.apache.zookeeper.JUnit4ZKTestRunner$LoggedInvokeMethod.evaluate(JUnit4ZKTestRunner.java:79)


FAILED:  org.apache.zookeeper.server.quorum.QuorumPeerMainTest.testQuorumDefaults

Error Message:
waiting for server 1 being up

Stack Trace:
junit.framework.AssertionFailedError: waiting for server 1 being up
	at org.apache.zookeeper.server.quorum.QuorumPeerMainTest.testQuorumDefaults(QuorumPeerMainTest.java:746)
	at org.apache.zookeeper.JUnit4ZKTestRunner$LoggedInvokeMethod.evaluate(JUnit4ZKTestRunner.java:79)


FAILED:  org.apache.zookeeper.server.quorum.QuorumPeerMainTest.testHighestZxidJoinLate

Error Message:
Waiting too long

Stack Trace:
java.lang.RuntimeException: Waiting too long
	at org.apache.zookeeper.server.quorum.QuorumPeerMainTest.waitForAll(QuorumPeerMainTest.java:450)
	at org.apache.zookeeper.server.quorum.QuorumPeerMainTest.LaunchServers(QuorumPeerMainTest.java:505)
	at org.apache.zookeeper.server.quorum.QuorumPeerMainTest.LaunchServers(QuorumPeerMainTest.java:472)
	at org.apache.zookeeper.server.quorum.QuorumPeerMainTest.testHighestZxidJoinLate(QuorumPeerMainTest.java:250)
	at org.apache.zookeeper.JUnit4ZKTestRunner$LoggedInvokeMethod.evaluate(JUnit4ZKTestRunner.java:79)


FAILED:  org.apache.zookeeper.server.quorum.QuorumPeerMainTest.testWithOnlyMinSessionTimeout

Error Message:
waiting for server 1 being up

Stack Trace:
junit.framework.AssertionFailedError: waiting for server 1 being up
	at org.apache.zookeeper.server.quorum.QuorumPeerMainTest.testWithOnlyMinSessionTimeout(QuorumPeerMainTest.java:875)
	at org.apache.zookeeper.JUnit4ZKTestRunner$LoggedInvokeMethod.evaluate(JUnit4ZKTestRunner.java:79)


FAILED:  org.apache.zookeeper.server.quorum.QuorumPeerMainTest.testBadPackets

Error Message:
waiting for server 1 being up

Stack Trace:
junit.framework.AssertionFailedError: waiting for server 1 being up
	at org.apache.zookeeper.server.quorum.QuorumPeerMainTest.testBadPackets(QuorumPeerMainTest.java:682)
	at org.apache.zookeeper.JUnit4ZKTestRunner$LoggedInvokeMethod.evaluate(JUnit4ZKTestRunner.java:79)


FAILED:  org.apache.zookeeper.server.quorum.QuorumPeerMainTest.testQuorum

Error Message:
waiting for server 1 being up

Stack Trace:
junit.framework.AssertionFailedError: waiting for server 1 being up
	at org.apache.zookeeper.server.quorum.QuorumPeerMainTest.testQuorum(QuorumPeerMainTest.java:96)
	at org.apache.zookeeper.JUnit4ZKTestRunner$LoggedInvokeMethod.evaluate(JUnit4ZKTestRunner.java:79)


FAILED:  org.apache.zookeeper.server.quorum.QuorumPeerMainTest.testElectionFraud

Error Message:
Waiting too long

Stack Trace:
java.lang.RuntimeException: Waiting too long
	at org.apache.zookeeper.server.quorum.QuorumPeerMainTest.waitForAll(QuorumPeerMainTest.java:450)
	at org.apache.zookeeper.server.quorum.QuorumPeerMainTest.LaunchServers(QuorumPeerMainTest.java:505)
	at org.apache.zookeeper.server.quorum.QuorumPeerMainTest.testElectionFraud(QuorumPeerMainTest.java:366)
	at org.apache.zookeeper.JUnit4ZKTestRunner$LoggedInvokeMethod.evaluate(JUnit4ZKTestRunner.java:79)


FAILED:  org.apache.zookeeper.server.quorum.QuorumPeerMainTest.testBadPeerAddressInQuorum

Error Message:
complains about host

Stack Trace:
junit.framework.AssertionFailedError: complains about host
	at org.apache.zookeeper.server.quorum.QuorumPeerMainTest.testBadPeerAddressInQuorum(QuorumPeerMainTest.java:568)
	at org.apache.zookeeper.JUnit4ZKTestRunner$LoggedInvokeMethod.evaluate(JUnit4ZKTestRunner.java:79)


FAILED:  org.apache.zookeeper.server.quorum.QuorumRequestPipelineTest.testNull[2]

Error Message:
Timeout occurred. Please note the time in the report does not reflect the time until the timeout.

Stack Trace:
junit.framework.AssertionFailedError: Timeout occurred. Please note the time in the report does not reflect the time until the timeout.
	at java.lang.Thread.run(Thread.java:745)


FAILED:  org.apache.zookeeper.server.quorum.RaceConditionTest.testRaceConditionBetweenLeaderAndAckRequestProcessor

Error Message:
test timed out after 30000 milliseconds

Stack Trace:
org.junit.runners.model.TestTimedOutException: test timed out after 30000 milliseconds
	at java.lang.Thread.sleep(Native Method)
	at org.apache.zookeeper.test.ClientBase.waitForServerUp(ClientBase.java:300)
	at org.apache.zookeeper.test.ClientBase.waitForServerUp(ClientBase.java:275)
	at org.apache.zookeeper.server.quorum.RaceConditionTest.startQuorum(RaceConditionTest.java:133)
	at org.apache.zookeeper.server.quorum.RaceConditionTest.testRaceConditionBetweenLeaderAndAckRequestProcessor(RaceConditionTest.java:63)
	at org.apache.zookeeper.JUnit4ZKTestRunner$LoggedInvokeMethod.evaluate(JUnit4ZKTestRunner.java:79)
	at java.util.concurrent.FutureTask.run(FutureTask.java:262)
	at java.lang.Thread.run(Thread.java:745)


FAILED:  org.apache.zookeeper.server.quorum.ReconfigBackupTest.testReconfigCreateNewVersionFile

Error Message:
waiting for server 0 being up

Stack Trace:
junit.framework.AssertionFailedError: waiting for server 0 being up
	at org.apache.zookeeper.server.quorum.ReconfigBackupTest.testReconfigCreateNewVersionFile(ReconfigBackupTest.java:169)
	at org.apache.zookeeper.JUnit4ZKTestRunner$LoggedInvokeMethod.evaluate(JUnit4ZKTestRunner.java:79)


FAILED:  org.apache.zookeeper.server.quorum.ReconfigBackupTest.testVersionOfDynamicFilename

Error Message:
waiting for server 0 being up

Stack Trace:
junit.framework.AssertionFailedError: waiting for server 0 being up
	at org.apache.zookeeper.server.quorum.ReconfigBackupTest.testVersionOfDynamicFilename(ReconfigBackupTest.java:320)
	at org.apache.zookeeper.JUnit4ZKTestRunner$LoggedInvokeMethod.evaluate(JUnit4ZKTestRunner.java:79)


FAILED:  org.apache.zookeeper.server.quorum.ReconfigBackupTest.testBackupStatic

Error Message:
waiting for server 0 being up

Stack Trace:
junit.framework.AssertionFailedError: waiting for server 0 being up
	at org.apache.zookeeper.server.quorum.ReconfigBackupTest.testBackupStatic(ReconfigBackupTest.java:103)
	at org.apache.zookeeper.JUnit4ZKTestRunner$LoggedInvokeMethod.evaluate(JUnit4ZKTestRunner.java:79)


FAILED:  org.apache.zookeeper.server.quorum.ReconfigDuringLeaderSyncTest.testDuringLeaderSync

Error Message:
null

Stack Trace:
java.lang.NullPointerException
	at org.apache.zookeeper.server.quorum.ReconfigDuringLeaderSyncTest.tearDown(ReconfigDuringLeaderSyncTest.java:199)


FAILED:  org.apache.zookeeper.server.quorum.ReconfigFailureCasesTest.testTooFewRemainingPariticipants

Error Message:
waiting for server up

Stack Trace:
junit.framework.AssertionFailedError: waiting for server up
	at org.apache.zookeeper.test.QuorumUtil.startAll(QuorumUtil.java:151)
	at org.apache.zookeeper.server.quorum.ReconfigFailureCasesTest.testTooFewRemainingPariticipants(ReconfigFailureCasesTest.java:117)
	at org.apache.zookeeper.JUnit4ZKTestRunner$LoggedInvokeMethod.evaluate(JUnit4ZKTestRunner.java:79)


FAILED:  org.apache.zookeeper.server.quorum.ReconfigFailureCasesTest.testReconfigVersionConditionFails

Error Message:
waiting for server up

Stack Trace:
junit.framework.AssertionFailedError: waiting for server up
	at org.apache.zookeeper.test.QuorumUtil.startAll(QuorumUtil.java:151)
	at org.apache.zookeeper.server.quorum.ReconfigFailureCasesTest.testReconfigVersionConditionFails(ReconfigFailureCasesTest.java:144)
	at org.apache.zookeeper.JUnit4ZKTestRunner$LoggedInvokeMethod.evaluate(JUnit4ZKTestRunner.java:79)


FAILED:  org.apache.zookeeper.server.quorum.ReconfigFailureCasesTest.testIncrementalReconfigInvokedOnHiearchicalQS

Error Message:
waiting for server up

Stack Trace:
junit.framework.AssertionFailedError: waiting for server up
	at org.apache.zookeeper.test.QuorumUtil.startAll(QuorumUtil.java:151)
	at org.apache.zookeeper.server.quorum.ReconfigFailureCasesTest.testIncrementalReconfigInvokedOnHiearchicalQS(ReconfigFailureCasesTest.java:67)
	at org.apache.zookeeper.JUnit4ZKTestRunner$LoggedInvokeMethod.evaluate(JUnit4ZKTestRunner.java:79)


FAILED:  org.apache.zookeeper.server.quorum.ReconfigFailureCasesTest.testLeaderTimesoutOnNewQuorum

Error Message:
waiting for server up

Stack Trace:
junit.framework.AssertionFailedError: waiting for server up
	at org.apache.zookeeper.test.QuorumUtil.startAll(QuorumUtil.java:151)
	at org.apache.zookeeper.server.quorum.ReconfigFailureCasesTest.testLeaderTimesoutOnNewQuorum(ReconfigFailureCasesTest.java:171)
	at org.apache.zookeeper.JUnit4ZKTestRunner$LoggedInvokeMethod.evaluate(JUnit4ZKTestRunner.java:79)


FAILED:  org.apache.zookeeper.server.quorum.ReconfigFailureCasesTest.testObserverToParticipantConversionFails

Error Message:
waiting for server 1 being up

Stack Trace:
junit.framework.AssertionFailedError: waiting for server 1 being up
	at org.apache.zookeeper.server.quorum.ReconfigFailureCasesTest.testObserverToParticipantConversionFails(ReconfigFailureCasesTest.java:253)
	at org.apache.zookeeper.JUnit4ZKTestRunner$LoggedInvokeMethod.evaluate(JUnit4ZKTestRunner.java:79)


FAILED:  org.apache.zookeeper.server.quorum.ReconfigLegacyTest.testReconfigRemoveClientFromStatic

Error Message:
waiting for server 0 being up

Stack Trace:
junit.framework.AssertionFailedError: waiting for server 0 being up
	at org.apache.zookeeper.server.quorum.ReconfigLegacyTest.testReconfigRemoveClientFromStatic(ReconfigLegacyTest.java:194)
	at org.apache.zookeeper.JUnit4ZKTestRunner$LoggedInvokeMethod.evaluate(JUnit4ZKTestRunner.java:79)


FAILED:  org.apache.zookeeper.server.quorum.ReconfigLegacyTest.testRestartZooKeeperServer

Error Message:
waiting for server 0 being up

Stack Trace:
junit.framework.AssertionFailedError: waiting for server 0 being up
	at org.apache.zookeeper.server.quorum.ReconfigLegacyTest.testRestartZooKeeperServer(ReconfigLegacyTest.java:277)
	at org.apache.zookeeper.JUnit4ZKTestRunner$LoggedInvokeMethod.evaluate(JUnit4ZKTestRunner.java:79)
	at java.util.concurrent.FutureTask.run(FutureTask.java:262)
	at java.lang.Thread.run(Thread.java:745)


FAILED:  org.apache.zookeeper.server.quorum.ReconfigLegacyTest.testConfigFileBackwardCompatibility

Error Message:
waiting for server 0 being up

Stack Trace:
junit.framework.AssertionFailedError: waiting for server 0 being up
	at org.apache.zookeeper.server.quorum.ReconfigLegacyTest.testConfigFileBackwardCompatibility(ReconfigLegacyTest.java:90)
	at org.apache.zookeeper.JUnit4ZKTestRunner$LoggedInvokeMethod.evaluate(JUnit4ZKTestRunner.java:79)


FAILED:  org.apache.zookeeper.server.quorum.ReconfigRecoveryTest.testNextConfigAlreadyActive

Error Message:
waiting for server 2 being up

Stack Trace:
junit.framework.AssertionFailedError: waiting for server 2 being up
	at org.apache.zookeeper.server.quorum.ReconfigRecoveryTest.testNextConfigAlreadyActive(ReconfigRecoveryTest.java:340)
	at org.apache.zookeeper.JUnit4ZKTestRunner$LoggedInvokeMethod.evaluate(JUnit4ZKTestRunner.java:79)


FAILED:  org.apache.zookeeper.server.quorum.ReconfigRecoveryTest.testObserverConvertedToParticipantDuringFLE

Error Message:
waiting for server 2 being up

Stack Trace:
junit.framework.AssertionFailedError: waiting for server 2 being up
	at org.apache.zookeeper.server.quorum.ReconfigRecoveryTest.testObserverConvertedToParticipantDuringFLE(ReconfigRecoveryTest.java:437)
	at org.apache.zookeeper.JUnit4ZKTestRunner$LoggedInvokeMethod.evaluate(JUnit4ZKTestRunner.java:79)


FAILED:  org.apache.zookeeper.server.quorum.ReconfigRecoveryTest.testCurrentObserverIsParticipantInNewConfig

Error Message:
client could not connect to reestablished quorum: giving up after 30+ seconds.

Stack Trace:
junit.framework.AssertionFailedError: client could not connect to reestablished quorum: giving up after 30+ seconds.
	at org.apache.zookeeper.test.ReconfigTest.testNormalOperation(ReconfigTest.java:183)
	at org.apache.zookeeper.server.quorum.ReconfigRecoveryTest.testCurrentObserverIsParticipantInNewConfig(ReconfigRecoveryTest.java:494)
	at org.apache.zookeeper.JUnit4ZKTestRunner$LoggedInvokeMethod.evaluate(JUnit4ZKTestRunner.java:79)


FAILED:  org.apache.zookeeper.server.quorum.ReconfigRecoveryTest.testCurrentServersAreObserversInNextConfig

Error Message:
waiting for server 0 being up

Stack Trace:
junit.framework.AssertionFailedError: waiting for server 0 being up
	at org.apache.zookeeper.server.quorum.ReconfigRecoveryTest.testCurrentServersAreObserversInNextConfig(ReconfigRecoveryTest.java:186)
	at org.apache.zookeeper.JUnit4ZKTestRunner$LoggedInvokeMethod.evaluate(JUnit4ZKTestRunner.java:79)


FAILED:  org.apache.zookeeper.server.quorum.ReconfigRecoveryTest.testNextConfigCompletion

Error Message:
waiting for server 0 being up

Stack Trace:
junit.framework.AssertionFailedError: waiting for server 0 being up
	at org.apache.zookeeper.server.quorum.ReconfigRecoveryTest.testNextConfigCompletion(ReconfigRecoveryTest.java:88)
	at org.apache.zookeeper.JUnit4ZKTestRunner$LoggedInvokeMethod.evaluate(JUnit4ZKTestRunner.java:79)


FAILED:  org.apache.zookeeper.server.quorum.ReconfigRollingRestartCompatibilityTest.testRollingRestartWithMembershipChange

Error Message:
waiting for server 0 being up

Stack Trace:
junit.framework.AssertionFailedError: waiting for server 0 being up
	at org.apache.zookeeper.server.quorum.ReconfigRollingRestartCompatibilityTest.testRollingRestartWithMembershipChange(ReconfigRollingRestartCompatibilityTest.java:179)
	at org.apache.zookeeper.JUnit4ZKTestRunner$LoggedInvokeMethod.evaluate(JUnit4ZKTestRunner.java:79)
	at java.util.concurrent.FutureTask.run(FutureTask.java:262)
	at java.lang.Thread.run(Thread.java:745)


FAILED:  org.apache.zookeeper.server.quorum.ReconfigRollingRestartCompatibilityTest.testRollingRestartWithoutMembershipChange

Error Message:
waiting for server 0 being up

Stack Trace:
junit.framework.AssertionFailedError: waiting for server 0 being up
	at org.apache.zookeeper.server.quorum.ReconfigRollingRestartCompatibilityTest.testRollingRestartWithoutMembershipChange(ReconfigRollingRestartCompatibilityTest.java:144)
	at org.apache.zookeeper.JUnit4ZKTestRunner$LoggedInvokeMethod.evaluate(JUnit4ZKTestRunner.java:79)
	at java.util.concurrent.FutureTask.run(FutureTask.java:262)
	at java.lang.Thread.run(Thread.java:745)


FAILED:  org.apache.zookeeper.server.quorum.ReconfigRollingRestartCompatibilityTest.testNoLocalDynamicConfigAndBackupFiles

Error Message:
waiting for server 0 being up

Stack Trace:
junit.framework.AssertionFailedError: waiting for server 0 being up
	at org.apache.zookeeper.server.quorum.ReconfigRollingRestartCompatibilityTest.testNoLocalDynamicConfigAndBackupFiles(ReconfigRollingRestartCompatibilityTest.java:109)
	at org.apache.zookeeper.JUnit4ZKTestRunner$LoggedInvokeMethod.evaluate(JUnit4ZKTestRunner.java:79)
	at java.util.concurrent.FutureTask.run(FutureTask.java:262)
	at java.lang.Thread.run(Thread.java:745)


FAILED:  org.apache.zookeeper.server.quorum.StandaloneDisabledTest.startSingleServerTest

Error Message:
Server 1 is not up

Stack Trace:
junit.framework.AssertionFailedError: Server 1 is not up
	at org.apache.zookeeper.server.quorum.StandaloneDisabledTest.startServer(StandaloneDisabledTest.java:175)
	at org.apache.zookeeper.server.quorum.StandaloneDisabledTest.startFollowers(StandaloneDisabledTest.java:206)
	at org.apache.zookeeper.server.quorum.StandaloneDisabledTest.startSingleServerTest(StandaloneDisabledTest.java:66)
	at org.apache.zookeeper.JUnit4ZKTestRunner$LoggedInvokeMethod.evaluate(JUnit4ZKTestRunner.java:79)


FAILED:  org.apache.zookeeper.server.quorum.auth.QuorumAuthUpgradeTest.testAuthLearnerAgainstNullAuthServer

Error Message:
test timed out after 30000 milliseconds

Stack Trace:
org.junit.runners.model.TestTimedOutException: test timed out after 30000 milliseconds
	at java.lang.Thread.sleep(Native Method)
	at org.apache.zookeeper.test.ClientBase.waitForServerUp(ClientBase.java:300)
	at org.apache.zookeeper.test.ClientBase.waitForServerUp(ClientBase.java:275)
	at org.apache.zookeeper.server.quorum.auth.QuorumAuthTestBase.startQuorum(QuorumAuthTestBase.java:74)
	at org.apache.zookeeper.server.quorum.auth.QuorumAuthUpgradeTest.testAuthLearnerAgainstNullAuthServer(QuorumAuthUpgradeTest.java:106)
	at org.apache.zookeeper.JUnit4ZKTestRunner$LoggedInvokeMethod.evaluate(JUnit4ZKTestRunner.java:79)
	at java.util.concurrent.FutureTask.run(FutureTask.java:262)
	at java.lang.Thread.run(Thread.java:745)


FAILED:  org.apache.zookeeper.server.quorum.auth.QuorumAuthUpgradeTest.testRollingUpgrade

Error Message:
waiting for server 0 being up

Stack Trace:
junit.framework.AssertionFailedError: waiting for server 0 being up
	at org.apache.zookeeper.server.quorum.auth.QuorumAuthTestBase.startQuorum(QuorumAuthTestBase.java:74)
	at org.apache.zookeeper.server.quorum.auth.QuorumAuthUpgradeTest.testRollingUpgrade(QuorumAuthUpgradeTest.java:181)
	at org.apache.zookeeper.JUnit4ZKTestRunner$LoggedInvokeMethod.evaluate(JUnit4ZKTestRunner.java:79)
	at java.util.concurrent.FutureTask.run(FutureTask.java:262)
	at java.lang.Thread.run(Thread.java:745)


FAILED:  org.apache.zookeeper.server.quorum.auth.QuorumAuthUpgradeTest.testNullAuthLearnerServer

Error Message:
test timed out after 30000 milliseconds

Stack Trace:
org.junit.runners.model.TestTimedOutException: test timed out after 30000 milliseconds
	at java.lang.Thread.sleep(Native Method)
	at org.apache.zookeeper.test.ClientBase.waitForServerUp(ClientBase.java:300)
	at org.apache.zookeeper.test.ClientBase.waitForServerUp(ClientBase.java:275)
	at org.apache.zookeeper.server.quorum.auth.QuorumAuthTestBase.startQuorum(QuorumAuthTestBase.java:74)
	at org.apache.zookeeper.server.quorum.auth.QuorumAuthUpgradeTest.testNullAuthLearnerServer(QuorumAuthUpgradeTest.java:86)
	at org.apache.zookeeper.JUnit4ZKTestRunner$LoggedInvokeMethod.evaluate(JUnit4ZKTestRunner.java:79)
	at java.util.concurrent.FutureTask.run(FutureTask.java:262)
	at java.lang.Thread.run(Thread.java:745)


FAILED:  org.apache.zookeeper.server.quorum.auth.QuorumAuthUpgradeTest.testAuthLearnerAgainstNoAuthRequiredServer

Error Message:
test timed out after 30000 milliseconds

Stack Trace:
org.junit.runners.model.TestTimedOutException: test timed out after 30000 milliseconds
	at java.lang.Thread.sleep(Native Method)
	at org.apache.zookeeper.test.ClientBase.waitForServerUp(ClientBase.java:300)
	at org.apache.zookeeper.test.ClientBase.waitForServerUp(ClientBase.java:275)
	at org.apache.zookeeper.server.quorum.auth.QuorumAuthTestBase.startQuorum(QuorumAuthTestBase.java:74)
	at org.apache.zookeeper.server.quorum.auth.QuorumAuthUpgradeTest.testAuthLearnerAgainstNoAuthRequiredServer(QuorumAuthUpgradeTest.java:126)
	at org.apache.zookeeper.JUnit4ZKTestRunner$LoggedInvokeMethod.evaluate(JUnit4ZKTestRunner.java:79)
	at java.util.concurrent.FutureTask.run(FutureTask.java:262)
	at java.lang.Thread.run(Thread.java:745)


FAILED:  org.apache.zookeeper.server.quorum.auth.QuorumAuthUpgradeTest.testAuthLearnerServer

Error Message:
test timed out after 30000 milliseconds

Stack Trace:
org.junit.runners.model.TestTimedOutException: test timed out after 30000 milliseconds
	at java.lang.Thread.sleep(Native Method)
	at org.apache.zookeeper.test.ClientBase.waitForServerUp(ClientBase.java:300)
	at org.apache.zookeeper.test.ClientBase.waitForServerUp(ClientBase.java:275)
	at org.apache.zookeeper.server.quorum.auth.QuorumAuthTestBase.startQuorum(QuorumAuthTestBase.java:74)
	at org.apache.zookeeper.server.quorum.auth.QuorumAuthUpgradeTest.testAuthLearnerServer(QuorumAuthUpgradeTest.java:148)
	at org.apache.zookeeper.JUnit4ZKTestRunner$LoggedInvokeMethod.evaluate(JUnit4ZKTestRunner.java:79)
	at java.util.concurrent.FutureTask.run(FutureTask.java:262)
	at java.lang.Thread.run(Thread.java:745)


FAILED:  org.apache.zookeeper.server.quorum.auth.QuorumDigestAuthTest.testSaslNotRequiredWithInvalidCredentials

Error Message:
test timed out after 30000 milliseconds

Stack Trace:
org.junit.runners.model.TestTimedOutException: test timed out after 30000 milliseconds
	at java.lang.Thread.sleep(Native Method)
	at org.apache.zookeeper.test.ClientBase.waitForServerUp(ClientBase.java:300)
	at org.apache.zookeeper.test.ClientBase.waitForServerUp(ClientBase.java:275)
	at org.apache.zookeeper.server.quorum.auth.QuorumAuthTestBase.startQuorum(QuorumAuthTestBase.java:74)
	at org.apache.zookeeper.server.quorum.auth.QuorumDigestAuthTest.testSaslNotRequiredWithInvalidCredentials(QuorumDigestAuthTest.java:105)
	at org.apache.zookeeper.JUnit4ZKTestRunner$LoggedInvokeMethod.evaluate(JUnit4ZKTestRunner.java:79)
	at java.util.concurrent.FutureTask.run(FutureTask.java:262)
	at java.lang.Thread.run(Thread.java:745)


FAILED:  org.apache.zookeeper.server.quorum.auth.QuorumDigestAuthTest.testValidCredentials

Error Message:
test timed out after 30000 milliseconds

Stack Trace:
org.junit.runners.model.TestTimedOutException: test timed out after 30000 milliseconds
	at java.lang.Thread.sleep(Native Method)
	at org.apache.zookeeper.test.ClientBase.waitForServerUp(ClientBase.java:300)
	at org.apache.zookeeper.test.ClientBase.waitForServerUp(ClientBase.java:275)
	at org.apache.zookeeper.server.quorum.auth.QuorumAuthTestBase.startQuorum(QuorumAuthTestBase.java:74)
	at org.apache.zookeeper.server.quorum.auth.QuorumDigestAuthTest.testValidCredentials(QuorumDigestAuthTest.java:82)
	at org.apache.zookeeper.JUnit4ZKTestRunner$LoggedInvokeMethod.evaluate(JUnit4ZKTestRunner.java:79)
	at java.util.concurrent.FutureTask.run(FutureTask.java:262)
	at java.lang.Thread.run(Thread.java:745)


FAILED:  org.apache.zookeeper.server.quorum.auth.QuorumKerberosAuthTest.testValidCredentials

Error Message:
waiting for server 0 being up

Stack Trace:
junit.framework.AssertionFailedError: waiting for server 0 being up
	at org.apache.zookeeper.server.quorum.auth.QuorumAuthTestBase.startQuorum(QuorumAuthTestBase.java:74)
	at org.apache.zookeeper.server.quorum.auth.QuorumKerberosAuthTest.testValidCredentials(QuorumKerberosAuthTest.java:101)
	at org.apache.zookeeper.JUnit4ZKTestRunner$LoggedInvokeMethod.evaluate(JUnit4ZKTestRunner.java:79)
	at java.util.concurrent.FutureTask.run(FutureTask.java:262)
	at java.lang.Thread.run(Thread.java:745)


FAILED:  org.apache.zookeeper.server.quorum.auth.QuorumKerberosHostBasedAuthTest.testConnectBadServer

Error Message:
waiting for server 0 being up

Stack Trace:
junit.framework.AssertionFailedError: waiting for server 0 being up
	at org.apache.zookeeper.server.quorum.auth.QuorumAuthTestBase.startQuorum(QuorumAuthTestBase.java:74)
	at org.apache.zookeeper.server.quorum.auth.QuorumKerberosHostBasedAuthTest.testConnectBadServer(QuorumKerberosHostBasedAuthTest.java:146)
	at org.apache.zookeeper.JUnit4ZKTestRunner$LoggedInvokeMethod.evaluate(JUnit4ZKTestRunner.java:79)
	at java.util.concurrent.FutureTask.run(FutureTask.java:262)
	at java.lang.Thread.run(Thread.java:745)


FAILED:  org.apache.zookeeper.server.quorum.auth.QuorumKerberosHostBasedAuthTest.testValidCredentials

Error Message:
waiting for server 0 being up

Stack Trace:
junit.framework.AssertionFailedError: waiting for server 0 being up
	at org.apache.zookeeper.server.quorum.auth.QuorumAuthTestBase.startQuorum(QuorumAuthTestBase.java:74)
	at org.apache.zookeeper.server.quorum.auth.QuorumKerberosHostBasedAuthTest.testValidCredentials(QuorumKerberosHostBasedAuthTest.java:125)
	at org.apache.zookeeper.JUnit4ZKTestRunner$LoggedInvokeMethod.evaluate(JUnit4ZKTestRunner.java:79)
	at java.util.concurrent.FutureTask.run(FutureTask.java:262)
	at java.lang.Thread.run(Thread.java:745)


FAILED:  org.apache.zookeeper.test.AsyncHammerTest.testHammer

Error Message:
waiting for server up

Stack Trace:
junit.framework.AssertionFailedError: waiting for server up
	at org.apache.zookeeper.test.QuorumBase.startServers(QuorumBase.java:224)
	at org.apache.zookeeper.test.QuorumBase.setUp(QuorumBase.java:121)
	at org.apache.zookeeper.test.AsyncHammerTest.setUp(AsyncHammerTest.java:52)
	at org.apache.zookeeper.test.AsyncHammerTest.testHammer(AsyncHammerTest.java:170)
	at org.apache.zookeeper.JUnit4ZKTestRunner$LoggedInvokeMethod.evaluate(JUnit4ZKTestRunner.java:79)


FAILED:  org.apache.zookeeper.test.AsyncHammerTest.testObserversHammer

Error Message:
waiting for server up

Stack Trace:
junit.framework.AssertionFailedError: waiting for server up
	at org.apache.zookeeper.test.QuorumBase.startServers(QuorumBase.java:224)
	at org.apache.zookeeper.test.QuorumBase.setUp(QuorumBase.java:121)
	at org.apache.zookeeper.test.AsyncHammerTest.setUp(AsyncHammerTest.java:52)
	at org.apache.zookeeper.test.AsyncHammerTest.testObserversHammer(AsyncHammerTest.java:202)
	at org.apache.zookeeper.JUnit4ZKTestRunner$LoggedInvokeMethod.evaluate(JUnit4ZKTestRunner.java:79)


FAILED:  org.apache.zookeeper.test.AsyncTest.testAsync

Error Message:
waiting for server up

Stack Trace:
junit.framework.AssertionFailedError: waiting for server up
	at org.apache.zookeeper.test.QuorumBase.startServers(QuorumBase.java:224)
	at org.apache.zookeeper.test.QuorumBase.setUp(QuorumBase.java:121)
	at org.apache.zookeeper.test.QuorumBase.setUp(QuorumBase.java:79)
	at org.apache.zookeeper.test.AsyncTest.setUp(AsyncTest.java:51)


FAILED:  org.apache.zookeeper.test.CnxManagerTest.testWorkerThreads

Error Message:
Tue Feb 06 11:28:33 UTC 2018 Incorrect number of Worker threads for sid=0 expected 4 found 0 expected null, but was:<Tue Feb 06 11:28:33 UTC 2018 Incorrect number of Worker threads for sid=0 expected 4 found 0>

Stack Trace:
junit.framework.AssertionFailedError: Tue Feb 06 11:28:33 UTC 2018 Incorrect number of Worker threads for sid=0 expected 4 found 0 expected null, but was:<Tue Feb 06 11:28:33 UTC 2018 Incorrect number of Worker threads for sid=0 expected 4 found 0>
	at org.apache.zookeeper.test.CnxManagerTest.testWorkerThreads(CnxManagerTest.java:382)
	at org.apache.zookeeper.JUnit4ZKTestRunner$LoggedInvokeMethod.evaluate(JUnit4ZKTestRunner.java:79)


FAILED:  org.apache.zookeeper.test.CnxManagerTest.testCnxManager

Error Message:
Exceeded number of retries

Stack Trace:
junit.framework.AssertionFailedError: Exceeded number of retries
	at org.apache.zookeeper.test.CnxManagerTest.testCnxManager(CnxManagerTest.java:174)
	at org.apache.zookeeper.JUnit4ZKTestRunner$LoggedInvokeMethod.evaluate(JUnit4ZKTestRunner.java:79)


FAILED:  org.apache.zookeeper.test.DuplicateLocalSessionUpgradeTest.testLocalSessionUpgradeOnFollower

Error Message:
waiting for server up

Stack Trace:
junit.framework.AssertionFailedError: waiting for server up
	at org.apache.zookeeper.test.QuorumBase.startServers(QuorumBase.java:224)
	at org.apache.zookeeper.test.QuorumBase.setUp(QuorumBase.java:121)
	at org.apache.zookeeper.test.QuorumBase.setUp(QuorumBase.java:79)
	at org.apache.zookeeper.test.DuplicateLocalSessionUpgradeTest.setUp(DuplicateLocalSessionUpgradeTest.java:53)


FAILED:  org.apache.zookeeper.test.DuplicateLocalSessionUpgradeTest.testLocalSessionUpgradeOnLeader

Error Message:
waiting for server up

Stack Trace:
junit.framework.AssertionFailedError: waiting for server up
	at org.apache.zookeeper.test.QuorumBase.startServers(QuorumBase.java:224)
	at org.apache.zookeeper.test.QuorumBase.setUp(QuorumBase.java:121)
	at org.apache.zookeeper.test.QuorumBase.setUp(QuorumBase.java:79)
	at org.apache.zookeeper.test.DuplicateLocalSessionUpgradeTest.setUp(DuplicateLocalSessionUpgradeTest.java:53)


FAILED:  org.apache.zookeeper.test.FLENewEpochTest.testLENewEpoch

Error Message:
First leader election failed

Stack Trace:
junit.framework.AssertionFailedError: First leader election failed
	at org.apache.zookeeper.test.FLENewEpochTest.testLENewEpoch(FLENewEpochTest.java:175)
	at org.apache.zookeeper.JUnit4ZKTestRunner$LoggedInvokeMethod.evaluate(JUnit4ZKTestRunner.java:79)


FAILED:  org.apache.zookeeper.test.FLERestartTest.testLERestart

Error Message:
Threads didn't join

Stack Trace:
junit.framework.AssertionFailedError: Threads didn't join
	at org.apache.zookeeper.test.FLERestartTest.testLERestart(FLERestartTest.java:184)
	at org.apache.zookeeper.JUnit4ZKTestRunner$LoggedInvokeMethod.evaluate(JUnit4ZKTestRunner.java:79)


FAILED:  org.apache.zookeeper.test.FLETest.testJoin

Error Message:
Unable to form cluster in 10000 ms

Stack Trace:
junit.framework.AssertionFailedError: Unable to form cluster in 10000 ms
	at org.apache.zookeeper.test.FLETest.testJoin(FLETest.java:441)
	at org.apache.zookeeper.JUnit4ZKTestRunner$LoggedInvokeMethod.evaluate(JUnit4ZKTestRunner.java:79)


FAILED:  org.apache.zookeeper.test.FLETest.testSingleElection

Error Message:
Fewer than a a majority has joined

Stack Trace:
junit.framework.AssertionFailedError: Fewer than a a majority has joined
	at org.apache.zookeeper.test.FLETest.runElection(FLETest.java:362)
	at org.apache.zookeeper.test.FLETest.testSingleElection(FLETest.java:268)
	at org.apache.zookeeper.JUnit4ZKTestRunner$LoggedInvokeMethod.evaluate(JUnit4ZKTestRunner.java:79)


FAILED:  org.apache.zookeeper.test.FLETest.testTripleElection

Error Message:
Fewer than a a majority has joined

Stack Trace:
junit.framework.AssertionFailedError: Fewer than a a majority has joined
	at org.apache.zookeeper.test.FLETest.runElection(FLETest.java:362)
	at org.apache.zookeeper.test.FLETest.testTripleElection(FLETest.java:287)
	at org.apache.zookeeper.JUnit4ZKTestRunner$LoggedInvokeMethod.evaluate(JUnit4ZKTestRunner.java:79)


FAILED:  org.apache.zookeeper.test.FLETest.testDoubleElection

Error Message:
Fewer than a a majority has joined

Stack Trace:
junit.framework.AssertionFailedError: Fewer than a a majority has joined
	at org.apache.zookeeper.test.FLETest.runElection(FLETest.java:362)
	at org.apache.zookeeper.test.FLETest.testDoubleElection(FLETest.java:278)
	at org.apache.zookeeper.JUnit4ZKTestRunner$LoggedInvokeMethod.evaluate(JUnit4ZKTestRunner.java:79)


FAILED:  org.apache.zookeeper.test.FLETest.testJoinInconsistentEnsemble

Error Message:
Unable to form cluster in 10000 ms

Stack Trace:
junit.framework.AssertionFailedError: Unable to form cluster in 10000 ms
	at org.apache.zookeeper.test.FLETest.testJoinInconsistentEnsemble(FLETest.java:500)
	at org.apache.zookeeper.JUnit4ZKTestRunner$LoggedInvokeMethod.evaluate(JUnit4ZKTestRunner.java:79)


FAILED:  org.apache.zookeeper.test.FLEZeroWeightTest.testZeroWeightQuorum

Error Message:
Threads didn't join

Stack Trace:
junit.framework.AssertionFailedError: Threads didn't join
	at org.apache.zookeeper.test.FLEZeroWeightTest.testZeroWeightQuorum(FLEZeroWeightTest.java:168)
	at org.apache.zookeeper.JUnit4ZKTestRunner$LoggedInvokeMethod.evaluate(JUnit4ZKTestRunner.java:79)


FAILED:  org.apache.zookeeper.test.FollowerResyncConcurrencyTest.testResyncByTxnlogThenDiffAfterFollowerCrashes

Error Message:
waiting for server up

Stack Trace:
junit.framework.AssertionFailedError: waiting for server up
	at org.apache.zookeeper.test.QuorumUtil.startAll(QuorumUtil.java:151)
	at org.apache.zookeeper.test.FollowerResyncConcurrencyTest.followerResyncCrashTest(FollowerResyncConcurrencyTest.java:200)
	at org.apache.zookeeper.test.FollowerResyncConcurrencyTest.testResyncByTxnlogThenDiffAfterFollowerCrashes(FollowerResyncConcurrencyTest.java:191)
	at org.apache.zookeeper.JUnit4ZKTestRunner$LoggedInvokeMethod.evaluate(JUnit4ZKTestRunner.java:79)


FAILED:  org.apache.zookeeper.test.FollowerResyncConcurrencyTest.testLaggingFollowerResyncsUnderNewEpoch

Error Message:
Waiting for server up

Stack Trace:
junit.framework.AssertionFailedError: Waiting for server up
	at org.apache.zookeeper.test.FollowerResyncConcurrencyTest.testLaggingFollowerResyncsUnderNewEpoch(FollowerResyncConcurrencyTest.java:104)
	at org.apache.zookeeper.JUnit4ZKTestRunner$LoggedInvokeMethod.evaluate(JUnit4ZKTestRunner.java:79)


FAILED:  org.apache.zookeeper.test.FollowerResyncConcurrencyTest.testResyncByDiffAfterFollowerCrashes

Error Message:
waiting for server up

Stack Trace:
junit.framework.AssertionFailedError: waiting for server up
	at org.apache.zookeeper.test.QuorumUtil.startAll(QuorumUtil.java:151)
	at org.apache.zookeeper.test.FollowerResyncConcurrencyTest.testResyncByDiffAfterFollowerCrashes(FollowerResyncConcurrencyTest.java:395)
	at org.apache.zookeeper.JUnit4ZKTestRunner$LoggedInvokeMethod.evaluate(JUnit4ZKTestRunner.java:79)


FAILED:  org.apache.zookeeper.test.FollowerResyncConcurrencyTest.testFollowerSendsLastZxid

Error Message:
waiting for server up

Stack Trace:
junit.framework.AssertionFailedError: waiting for server up
	at org.apache.zookeeper.test.QuorumUtil.startAll(QuorumUtil.java:151)
	at org.apache.zookeeper.test.FollowerResyncConcurrencyTest.testFollowerSendsLastZxid(FollowerResyncConcurrencyTest.java:672)
	at org.apache.zookeeper.JUnit4ZKTestRunner$LoggedInvokeMethod.evaluate(JUnit4ZKTestRunner.java:79)


FAILED:  org.apache.zookeeper.test.FollowerResyncConcurrencyTest.testResyncBySnapThenDiffAfterFollowerCrashes

Error Message:
waiting for server up

Stack Trace:
junit.framework.AssertionFailedError: waiting for server up
	at org.apache.zookeeper.test.QuorumUtil.startAll(QuorumUtil.java:151)
	at org.apache.zookeeper.test.FollowerResyncConcurrencyTest.followerResyncCrashTest(FollowerResyncConcurrencyTest.java:200)
	at org.apache.zookeeper.test.FollowerResyncConcurrencyTest.testResyncBySnapThenDiffAfterFollowerCrashes(FollowerResyncConcurrencyTest.java:176)
	at org.apache.zookeeper.JUnit4ZKTestRunner$LoggedInvokeMethod.evaluate(JUnit4ZKTestRunner.java:79)


FAILED:  org.apache.zookeeper.test.FollowerResyncConcurrencyTest.testFollowerWatcherResync

Error Message:
waiting for server up

Stack Trace:
junit.framework.AssertionFailedError: waiting for server up
	at org.apache.zookeeper.test.QuorumUtil.startAll(QuorumUtil.java:151)
	at org.apache.zookeeper.test.FollowerResyncConcurrencyTest.testFollowerWatcherResync(FollowerResyncConcurrencyTest.java:714)
	at org.apache.zookeeper.JUnit4ZKTestRunner$LoggedInvokeMethod.evaluate(JUnit4ZKTestRunner.java:79)


FAILED:  org.apache.zookeeper.test.FourLetterWordsQuorumTest.testFourLetterWords

Error Message:
waiting for server up

Stack Trace:
junit.framework.AssertionFailedError: waiting for server up
	at org.apache.zookeeper.test.QuorumBase.startServers(QuorumBase.java:224)
	at org.apache.zookeeper.test.QuorumBase.setUp(QuorumBase.java:121)
	at org.apache.zookeeper.test.QuorumBase.setUp(QuorumBase.java:79)


FAILED:  org.apache.zookeeper.test.FourLetterWordsQuorumTest.testNull

Error Message:
waiting for server up

Stack Trace:
junit.framework.AssertionFailedError: waiting for server up
	at org.apache.zookeeper.test.QuorumBase.startServers(QuorumBase.java:224)
	at org.apache.zookeeper.test.QuorumBase.setUp(QuorumBase.java:121)
	at org.apache.zookeeper.test.QuorumBase.setUp(QuorumBase.java:79)


FAILED:  org.apache.zookeeper.test.HierarchicalQuorumTest.testHierarchicalQuorum

Error Message:
waiting for server up

Stack Trace:
junit.framework.AssertionFailedError: waiting for server up
	at org.apache.zookeeper.test.HierarchicalQuorumTest.startServers(HierarchicalQuorumTest.java:224)
	at org.apache.zookeeper.test.HierarchicalQuorumTest.startServers(HierarchicalQuorumTest.java:135)
	at org.apache.zookeeper.test.HierarchicalQuorumTest.setUp(HierarchicalQuorumTest.java:121)


FAILED:  org.apache.zookeeper.test.LeaderSessionTrackerTest.testExpiredSessionWithLocalSession

Error Message:
waiting for server up

Stack Trace:
junit.framework.AssertionFailedError: waiting for server up
	at org.apache.zookeeper.test.QuorumUtil.startAll(QuorumUtil.java:151)
	at org.apache.zookeeper.test.LeaderSessionTrackerTest.testCreateEphemeral(LeaderSessionTrackerTest.java:88)
	at org.apache.zookeeper.test.LeaderSessionTrackerTest.testExpiredSessionWithLocalSession(LeaderSessionTrackerTest.java:68)
	at org.apache.zookeeper.JUnit4ZKTestRunner$LoggedInvokeMethod.evaluate(JUnit4ZKTestRunner.java:79)


FAILED:  org.apache.zookeeper.test.LeaderSessionTrackerTest.testExpiredSessionWithoutLocalSession

Error Message:
waiting for server up

Stack Trace:
junit.framework.AssertionFailedError: waiting for server up
	at org.apache.zookeeper.test.QuorumUtil.startAll(QuorumUtil.java:151)
	at org.apache.zookeeper.test.LeaderSessionTrackerTest.testCreateEphemeral(LeaderSessionTrackerTest.java:88)
	at org.apache.zookeeper.test.LeaderSessionTrackerTest.testExpiredSessionWithoutLocalSession(LeaderSessionTrackerTest.java:73)
	at org.apache.zookeeper.JUnit4ZKTestRunner$LoggedInvokeMethod.evaluate(JUnit4ZKTestRunner.java:79)


FAILED:  org.apache.zookeeper.test.LeaderSessionTrackerTest.testCreatePersistent

Error Message:
waiting for server up

Stack Trace:
junit.framework.AssertionFailedError: waiting for server up
	at org.apache.zookeeper.test.QuorumUtil.startAll(QuorumUtil.java:151)
	at org.apache.zookeeper.test.LeaderSessionTrackerTest.testCreatePersistent(LeaderSessionTrackerTest.java:129)
	at org.apache.zookeeper.JUnit4ZKTestRunner$LoggedInvokeMethod.evaluate(JUnit4ZKTestRunner.java:79)


FAILED:  org.apache.zookeeper.test.LocalSessionRequestTest.testLocalSessionsOnLeader

Error Message:
waiting for server up

Stack Trace:
junit.framework.AssertionFailedError: waiting for server up
	at org.apache.zookeeper.test.QuorumBase.startServers(QuorumBase.java:224)
	at org.apache.zookeeper.test.QuorumBase.setUp(QuorumBase.java:121)
	at org.apache.zookeeper.test.QuorumBase.setUp(QuorumBase.java:79)
	at org.apache.zookeeper.test.LocalSessionRequestTest.setUp(LocalSessionRequestTest.java:53)


FAILED:  org.apache.zookeeper.test.LocalSessionRequestTest.testLocalSessionsOnFollower

Error Message:
waiting for server up

Stack Trace:
junit.framework.AssertionFailedError: waiting for server up
	at org.apache.zookeeper.test.QuorumBase.startServers(QuorumBase.java:224)
	at org.apache.zookeeper.test.QuorumBase.setUp(QuorumBase.java:121)
	at org.apache.zookeeper.test.QuorumBase.setUp(QuorumBase.java:79)
	at org.apache.zookeeper.test.LocalSessionRequestTest.setUp(LocalSessionRequestTest.java:53)


FAILED:  org.apache.zookeeper.test.LocalSessionsOnlyTest.testLocalSessionsOnLeader

Error Message:
waiting for server up

Stack Trace:
junit.framework.AssertionFailedError: waiting for server up
	at org.apache.zookeeper.test.QuorumBase.startServers(QuorumBase.java:224)
	at org.apache.zookeeper.test.QuorumBase.setUp(QuorumBase.java:121)
	at org.apache.zookeeper.test.QuorumBase.setUp(QuorumBase.java:79)
	at org.apache.zookeeper.test.LocalSessionsOnlyTest.setUp(LocalSessionsOnlyTest.java:56)


FAILED:  org.apache.zookeeper.test.LocalSessionsOnlyTest.testLocalSessionsOnFollower

Error Message:
waiting for server up

Stack Trace:
junit.framework.AssertionFailedError: waiting for server up
	at org.apache.zookeeper.test.QuorumBase.startServers(QuorumBase.java:224)
	at org.apache.zookeeper.test.QuorumBase.setUp(QuorumBase.java:121)
	at org.apache.zookeeper.test.QuorumBase.setUp(QuorumBase.java:79)
	at org.apache.zookeeper.test.LocalSessionsOnlyTest.setUp(LocalSessionsOnlyTest.java:56)


FAILED:  org.apache.zookeeper.test.AsyncHammerTest.testHammer

Error Message:
waiting for server up

Stack Trace:
junit.framework.AssertionFailedError: waiting for server up
	at org.apache.zookeeper.test.QuorumBase.startServers(QuorumBase.java:224)
	at org.apache.zookeeper.test.QuorumBase.setUp(QuorumBase.java:121)
	at org.apache.zookeeper.test.AsyncHammerTest.setUp(AsyncHammerTest.java:52)
	at org.apache.zookeeper.test.AsyncHammerTest.testHammer(AsyncHammerTest.java:170)
	at org.apache.zookeeper.JUnit4ZKTestRunner$LoggedInvokeMethod.evaluate(JUnit4ZKTestRunner.java:79)


FAILED:  org.apache.zookeeper.test.AsyncHammerTest.testObserversHammer

Error Message:
waiting for server up

Stack Trace:
junit.framework.AssertionFailedError: waiting for server up
	at org.apache.zookeeper.test.QuorumBase.startServers(QuorumBase.java:224)
	at org.apache.zookeeper.test.QuorumBase.setUp(QuorumBase.java:121)
	at org.apache.zookeeper.test.AsyncHammerTest.setUp(AsyncHammerTest.java:52)
	at org.apache.zookeeper.test.AsyncHammerTest.testObserversHammer(AsyncHammerTest.java:202)
	at org.apache.zookeeper.JUnit4ZKTestRunner$LoggedInvokeMethod.evaluate(JUnit4ZKTestRunner.java:79)


FAILED:  org.apache.zookeeper.test.ReconfigTest.testQuorumSystemChange

Error Message:
waiting for server up

Stack Trace:
junit.framework.AssertionFailedError: waiting for server up
	at org.apache.zookeeper.test.QuorumUtil.startAll(QuorumUtil.java:151)
	at org.apache.zookeeper.test.ReconfigTest.testQuorumSystemChange(ReconfigTest.java:818)
	at org.apache.zookeeper.JUnit4ZKTestRunner$LoggedInvokeMethod.evaluate(JUnit4ZKTestRunner.java:79)


FAILED:  org.apache.zookeeper.test.ReconfigTest.testPortChange

Error Message:
waiting for server up

Stack Trace:
junit.framework.AssertionFailedError: waiting for server up
	at org.apache.zookeeper.test.QuorumUtil.startAll(QuorumUtil.java:151)
	at org.apache.zookeeper.test.ReconfigTest.testPortChange(ReconfigTest.java:591)
	at org.apache.zookeeper.JUnit4ZKTestRunner$LoggedInvokeMethod.evaluate(JUnit4ZKTestRunner.java:79)


FAILED:  org.apache.zookeeper.test.ReconfigTest.testPortChangeToBlockedPortLeader

Error Message:
waiting for server up

Stack Trace:
junit.framework.AssertionFailedError: waiting for server up
	at org.apache.zookeeper.test.QuorumUtil.startAll(QuorumUtil.java:151)
	at org.apache.zookeeper.test.ReconfigTest.testPortChangeToBlockedPort(ReconfigTest.java:724)
	at org.apache.zookeeper.test.ReconfigTest.testPortChangeToBlockedPortLeader(ReconfigTest.java:718)
	at org.apache.zookeeper.JUnit4ZKTestRunner$LoggedInvokeMethod.evaluate(JUnit4ZKTestRunner.java:79)


FAILED:  org.apache.zookeeper.test.ReconfigTest.testInitialConfigHasPositiveVersion

Error Message:
waiting for server up

Stack Trace:
junit.framework.AssertionFailedError: waiting for server up
	at org.apache.zookeeper.test.QuorumUtil.startAll(QuorumUtil.java:151)
	at org.apache.zookeeper.test.ReconfigTest.testInitialConfigHasPositiveVersion(ReconfigTest.java:895)
	at org.apache.zookeeper.JUnit4ZKTestRunner$LoggedInvokeMethod.evaluate(JUnit4ZKTestRunner.java:79)


FAILED:  org.apache.zookeeper.test.ReconfigTest.testRemoveAddOne

Error Message:
waiting for server up

Stack Trace:
junit.framework.AssertionFailedError: waiting for server up
	at org.apache.zookeeper.test.QuorumUtil.startAll(QuorumUtil.java:151)
	at org.apache.zookeeper.test.ReconfigTest.testRemoveAddOne(ReconfigTest.java:252)
	at org.apache.zookeeper.JUnit4ZKTestRunner$LoggedInvokeMethod.evaluate(JUnit4ZKTestRunner.java:79)


FAILED:  org.apache.zookeeper.test.ReconfigTest.testRemoveAddTwo

Error Message:
waiting for server up

Stack Trace:
junit.framework.AssertionFailedError: waiting for server up
	at org.apache.zookeeper.test.QuorumUtil.startAll(QuorumUtil.java:151)
	at org.apache.zookeeper.test.ReconfigTest.testRemoveAddTwo(ReconfigTest.java:334)
	at org.apache.zookeeper.JUnit4ZKTestRunner$LoggedInvokeMethod.evaluate(JUnit4ZKTestRunner.java:79)


FAILED:  org.apache.zookeeper.test.ReconfigTest.testPortChangeToBlockedPortFollower

Error Message:
waiting for server up

Stack Trace:
junit.framework.AssertionFailedError: waiting for server up
	at org.apache.zookeeper.test.QuorumUtil.startAll(QuorumUtil.java:151)
	at org.apache.zookeeper.test.ReconfigTest.testPortChangeToBlockedPort(ReconfigTest.java:724)
	at org.apache.zookeeper.test.ReconfigTest.testPortChangeToBlockedPortFollower(ReconfigTest.java:714)
	at org.apache.zookeeper.JUnit4ZKTestRunner$LoggedInvokeMethod.evaluate(JUnit4ZKTestRunner.java:79)


FAILED:  org.apache.zookeeper.test.ReconfigTest.testJMXBeanAfterRemoveAddOne

Error Message:
waiting for server up

Stack Trace:
junit.framework.AssertionFailedError: waiting for server up
	at org.apache.zookeeper.test.QuorumUtil.startAll(QuorumUtil.java:151)
	at org.apache.zookeeper.test.ReconfigTest.testJMXBeanAfterRemoveAddOne(ReconfigTest.java:914)
	at org.apache.zookeeper.JUnit4ZKTestRunner$LoggedInvokeMethod.evaluate(JUnit4ZKTestRunner.java:79)


FAILED:  org.apache.zookeeper.test.ReconfigTest.testRoleChange

Error Message:
waiting for server up

Stack Trace:
junit.framework.AssertionFailedError: waiting for server up
	at org.apache.zookeeper.test.QuorumUtil.startAll(QuorumUtil.java:151)
	at org.apache.zookeeper.test.ReconfigTest.testRoleChange(ReconfigTest.java:514)
	at org.apache.zookeeper.JUnit4ZKTestRunner$LoggedInvokeMethod.evaluate(JUnit4ZKTestRunner.java:79)


FAILED:  org.apache.zookeeper.test.ReconfigTest.testBulkReconfig

Error Message:
waiting for server up

Stack Trace:
junit.framework.AssertionFailedError: waiting for server up
	at org.apache.zookeeper.test.QuorumUtil.startAll(QuorumUtil.java:151)
	at org.apache.zookeeper.test.ReconfigTest.testBulkReconfig(ReconfigTest.java:434)
	at org.apache.zookeeper.JUnit4ZKTestRunner$LoggedInvokeMethod.evaluate(JUnit4ZKTestRunner.java:79)


FAILED:  org.apache.zookeeper.test.ReconfigTest.testJMXBeanAfterRoleChange

Error Message:
waiting for server up

Stack Trace:
junit.framework.AssertionFailedError: waiting for server up
	at org.apache.zookeeper.test.QuorumUtil.startAll(QuorumUtil.java:151)
	at org.apache.zookeeper.test.ReconfigTest.testJMXBeanAfterRoleChange(ReconfigTest.java:993)
	at org.apache.zookeeper.JUnit4ZKTestRunner$LoggedInvokeMethod.evaluate(JUnit4ZKTestRunner.java:79)


FAILED:  org.apache.zookeeper.test.ReconfigTest.testRemoveOneAsynchronous

Error Message:
waiting for server up

Stack Trace:
junit.framework.AssertionFailedError: waiting for server up
	at org.apache.zookeeper.test.QuorumUtil.startAll(QuorumUtil.java:151)
	at org.apache.zookeeper.test.ReconfigTest.testRemoveOneAsynchronous(ReconfigTest.java:473)
	at org.apache.zookeeper.JUnit4ZKTestRunner$LoggedInvokeMethod.evaluate(JUnit4ZKTestRunner.java:79)


FAILED:  org.apache.zookeeper.test.AsyncHammerTest.testHammer

Error Message:
waiting for server up

Stack Trace:
junit.framework.AssertionFailedError: waiting for server up
	at org.apache.zookeeper.test.QuorumBase.startServers(QuorumBase.java:224)
	at org.apache.zookeeper.test.QuorumBase.setUp(QuorumBase.java:121)
	at org.apache.zookeeper.test.AsyncHammerTest.setUp(AsyncHammerTest.java:52)
	at org.apache.zookeeper.test.AsyncHammerTest.testHammer(AsyncHammerTest.java:170)
	at org.apache.zookeeper.JUnit4ZKTestRunner$LoggedInvokeMethod.evaluate(JUnit4ZKTestRunner.java:79)


FAILED:  org.apache.zookeeper.test.AsyncHammerTest.testObserversHammer

Error Message:
waiting for server up

Stack Trace:
junit.framework.AssertionFailedError: waiting for server up
	at org.apache.zookeeper.test.QuorumBase.startServers(QuorumBase.java:224)
	at org.apache.zookeeper.test.QuorumBase.setUp(QuorumBase.java:121)
	at org.apache.zookeeper.test.AsyncHammerTest.setUp(AsyncHammerTest.java:52)
	at org.apache.zookeeper.test.AsyncHammerTest.testObserversHammer(AsyncHammerTest.java:202)
	at org.apache.zookeeper.JUnit4ZKTestRunner$LoggedInvokeMethod.evaluate(JUnit4ZKTestRunner.java:79)


FAILED:  org.apache.zookeeper.test.ReconfigTest.testQuorumSystemChange

Error Message:
waiting for server up

Stack Trace:
junit.framework.AssertionFailedError: waiting for server up
	at org.apache.zookeeper.test.QuorumUtil.startAll(QuorumUtil.java:151)
	at org.apache.zookeeper.test.ReconfigTest.testQuorumSystemChange(ReconfigTest.java:818)
	at org.apache.zookeeper.JUnit4ZKTestRunner$LoggedInvokeMethod.evaluate(JUnit4ZKTestRunner.java:79)


FAILED:  org.apache.zookeeper.test.ReconfigTest.testPortChange

Error Message:
waiting for server up

Stack Trace:
junit.framework.AssertionFailedError: waiting for server up
	at org.apache.zookeeper.test.QuorumUtil.startAll(QuorumUtil.java:151)
	at org.apache.zookeeper.test.ReconfigTest.testPortChange(ReconfigTest.java:591)
	at org.apache.zookeeper.JUnit4ZKTestRunner$LoggedInvokeMethod.evaluate(JUnit4ZKTestRunner.java:79)


FAILED:  org.apache.zookeeper.test.ReconfigTest.testPortChangeToBlockedPortLeader

Error Message:
waiting for server up

Stack Trace:
junit.framework.AssertionFailedError: waiting for server up
	at org.apache.zookeeper.test.QuorumUtil.startAll(QuorumUtil.java:151)
	at org.apache.zookeeper.test.ReconfigTest.testPortChangeToBlockedPort(ReconfigTest.java:724)
	at org.apache.zookeeper.test.ReconfigTest.testPortChangeToBlockedPortLeader(ReconfigTest.java:718)
	at org.apache.zookeeper.JUnit4ZKTestRunner$LoggedInvokeMethod.evaluate(JUnit4ZKTestRunner.java:79)


FAILED:  org.apache.zookeeper.test.ReconfigTest.testInitialConfigHasPositiveVersion

Error Message:
waiting for server up

Stack Trace:
junit.framework.AssertionFailedError: waiting for server up
	at org.apache.zookeeper.test.QuorumUtil.startAll(QuorumUtil.java:151)
	at org.apache.zookeeper.test.ReconfigTest.testInitialConfigHasPositiveVersion(ReconfigTest.java:895)
	at org.apache.zookeeper.JUnit4ZKTestRunner$LoggedInvokeMethod.evaluate(JUnit4ZKTestRunner.java:79)


FAILED:  org.apache.zookeeper.test.ReconfigTest.testRemoveAddOne

Error Message:
waiting for server up

Stack Trace:
junit.framework.AssertionFailedError: waiting for server up
	at org.apache.zookeeper.test.QuorumUtil.startAll(QuorumUtil.java:151)
	at org.apache.zookeeper.test.ReconfigTest.testRemoveAddOne(ReconfigTest.java:252)
	at org.apache.zookeeper.JUnit4ZKTestRunner$LoggedInvokeMethod.evaluate(JUnit4ZKTestRunner.java:79)


FAILED:  org.apache.zookeeper.test.ReconfigTest.testRemoveAddTwo

Error Message:
waiting for server up

Stack Trace:
junit.framework.AssertionFailedError: waiting for server up
	at org.apache.zookeeper.test.QuorumUtil.startAll(QuorumUtil.java:151)
	at org.apache.zookeeper.test.ReconfigTest.testRemoveAddTwo(ReconfigTest.java:334)
	at org.apache.zookeeper.JUnit4ZKTestRunner$LoggedInvokeMethod.evaluate(JUnit4ZKTestRunner.java:79)


FAILED:  org.apache.zookeeper.test.ReconfigTest.testPortChangeToBlockedPortFollower

Error Message:
waiting for server up

Stack Trace:
junit.framework.AssertionFailedError: waiting for server up
	at org.apache.zookeeper.test.QuorumUtil.startAll(QuorumUtil.java:151)
	at org.apache.zookeeper.test.ReconfigTest.testPortChangeToBlockedPort(ReconfigTest.java:724)
	at org.apache.zookeeper.test.ReconfigTest.testPortChangeToBlockedPortFollower(ReconfigTest.java:714)
	at org.apache.zookeeper.JUnit4ZKTestRunner$LoggedInvokeMethod.evaluate(JUnit4ZKTestRunner.java:79)


FAILED:  org.apache.zookeeper.test.ReconfigTest.testJMXBeanAfterRemoveAddOne

Error Message:
waiting for server up

Stack Trace:
junit.framework.AssertionFailedError: waiting for server up
	at org.apache.zookeeper.test.QuorumUtil.startAll(QuorumUtil.java:151)
	at org.apache.zookeeper.test.ReconfigTest.testJMXBeanAfterRemoveAddOne(ReconfigTest.java:914)
	at org.apache.zookeeper.JUnit4ZKTestRunner$LoggedInvokeMethod.evaluate(JUnit4ZKTestRunner.java:79)


FAILED:  org.apache.zookeeper.test.ReconfigTest.testRoleChange

Error Message:
waiting for server up

Stack Trace:
junit.framework.AssertionFailedError: waiting for server up
	at org.apache.zookeeper.test.QuorumUtil.startAll(QuorumUtil.java:151)
	at org.apache.zookeeper.test.ReconfigTest.testRoleChange(ReconfigTest.java:514)
	at org.apache.zookeeper.JUnit4ZKTestRunner$LoggedInvokeMethod.evaluate(JUnit4ZKTestRunner.java:79)


FAILED:  org.apache.zookeeper.test.ReconfigTest.testBulkReconfig

Error Message:
waiting for server up

Stack Trace:
junit.framework.AssertionFailedError: waiting for server up
	at org.apache.zookeeper.test.QuorumUtil.startAll(QuorumUtil.java:151)
	at org.apache.zookeeper.test.ReconfigTest.testBulkReconfig(ReconfigTest.java:434)
	at org.apache.zookeeper.JUnit4ZKTestRunner$LoggedInvokeMethod.evaluate(JUnit4ZKTestRunner.java:79)


FAILED:  org.apache.zookeeper.test.ReconfigTest.testJMXBeanAfterRoleChange

Error Message:
waiting for server up

Stack Trace:
junit.framework.AssertionFailedError: waiting for server up
	at org.apache.zookeeper.test.QuorumUtil.startAll(QuorumUtil.java:151)
	at org.apache.zookeeper.test.ReconfigTest.testJMXBeanAfterRoleChange(ReconfigTest.java:993)
	at org.apache.zookeeper.JUnit4ZKTestRunner$LoggedInvokeMethod.evaluate(JUnit4ZKTestRunner.java:79)


FAILED:  org.apache.zookeeper.test.ReconfigTest.testRemoveOneAsynchronous

Error Message:
waiting for server up

Stack Trace:
junit.framework.AssertionFailedError: waiting for server up
	at org.apache.zookeeper.test.QuorumUtil.startAll(QuorumUtil.java:151)
	at org.apache.zookeeper.test.ReconfigTest.testRemoveOneAsynchronous(ReconfigTest.java:473)
	at org.apache.zookeeper.JUnit4ZKTestRunner$LoggedInvokeMethod.evaluate(JUnit4ZKTestRunner.java:79)


FAILED:  org.apache.zookeeper.test.NonRecoverableErrorTest.testZooKeeperServiceAvailableOnLeader

Error Message:
test timed out after 30000 milliseconds

Stack Trace:
org.junit.runners.model.TestTimedOutException: test timed out after 30000 milliseconds
	at java.lang.Thread.sleep(Native Method)
	at org.apache.zookeeper.test.ClientBase.waitForServerUp(ClientBase.java:300)
	at org.apache.zookeeper.test.ClientBase.waitForServerUp(ClientBase.java:275)
	at org.apache.zookeeper.test.NonRecoverableErrorTest.testZooKeeperServiceAvailableOnLeader(NonRecoverableErrorTest.java:77)
	at org.apache.zookeeper.JUnit4ZKTestRunner$LoggedInvokeMethod.evaluate(JUnit4ZKTestRunner.java:79)
	at java.util.concurrent.FutureTask.run(FutureTask.java:262)
	at java.lang.Thread.run(Thread.java:745)


FAILED:  org.apache.zookeeper.test.ObserverHierarchicalQuorumTest.testHierarchicalQuorum

Error Message:
waiting for server up

Stack Trace:
junit.framework.AssertionFailedError: waiting for server up
	at org.apache.zookeeper.test.HierarchicalQuorumTest.startServers(HierarchicalQuorumTest.java:224)
	at org.apache.zookeeper.test.ObserverHierarchicalQuorumTest.startServers(ObserverHierarchicalQuorumTest.java:28)
	at org.apache.zookeeper.test.HierarchicalQuorumTest.setUp(HierarchicalQuorumTest.java:121)


FAILED:  org.apache.zookeeper.test.ObserverLETest.testLEWithObserver

Error Message:
waiting for server up

Stack Trace:
junit.framework.AssertionFailedError: waiting for server up
	at org.apache.zookeeper.test.QuorumBase.startServers(QuorumBase.java:224)
	at org.apache.zookeeper.test.QuorumBase.setUp(QuorumBase.java:121)
	at org.apache.zookeeper.test.ObserverLETest.establishThreeParticipantOneObserverEnsemble(ObserverLETest.java:37)


FAILED:  org.apache.zookeeper.test.ObserverQuorumHammerTest.testHammerBasic

Error Message:
waiting for server up

Stack Trace:
junit.framework.AssertionFailedError: waiting for server up
	at org.apache.zookeeper.test.QuorumBase.startServers(QuorumBase.java:224)
	at org.apache.zookeeper.test.QuorumBase.setUp(QuorumBase.java:121)
	at org.apache.zookeeper.test.ObserverQuorumHammerTest.setUp(ObserverQuorumHammerTest.java:30)


FAILED:  org.apache.zookeeper.test.ObserverTest.testObserver

Error Message:
waiting for server 1 being up

Stack Trace:
junit.framework.AssertionFailedError: waiting for server 1 being up
	at org.apache.zookeeper.test.ObserverTest.testObserver(ObserverTest.java:88)
	at org.apache.zookeeper.JUnit4ZKTestRunner$LoggedInvokeMethod.evaluate(JUnit4ZKTestRunner.java:79)


FAILED:  org.apache.zookeeper.test.QuorumHammerTest.testHammerBasic

Error Message:
waiting for server up

Stack Trace:
junit.framework.AssertionFailedError: waiting for server up
	at org.apache.zookeeper.test.QuorumBase.startServers(QuorumBase.java:224)
	at org.apache.zookeeper.test.QuorumBase.setUp(QuorumBase.java:121)
	at org.apache.zookeeper.test.QuorumBase.setUp(QuorumBase.java:79)
	at org.apache.zookeeper.test.QuorumHammerTest.setUp(QuorumHammerTest.java:36)


FAILED:  org.apache.zookeeper.test.QuorumMajorityTest.testMajQuorums

Error Message:
waiting for server up

Stack Trace:
junit.framework.AssertionFailedError: waiting for server up
	at org.apache.zookeeper.test.QuorumBase.startServers(QuorumBase.java:224)
	at org.apache.zookeeper.test.QuorumBase.setUp(QuorumBase.java:121)
	at org.apache.zookeeper.test.QuorumBase.setUp(QuorumBase.java:79)


FAILED:  org.apache.zookeeper.test.QuorumMajorityTest.testNull

Error Message:
waiting for server up

Stack Trace:
junit.framework.AssertionFailedError: waiting for server up
	at org.apache.zookeeper.test.QuorumBase.startServers(QuorumBase.java:224)
	at org.apache.zookeeper.test.QuorumBase.setUp(QuorumBase.java:121)
	at org.apache.zookeeper.test.QuorumBase.setUp(QuorumBase.java:79)


FAILED:  org.apache.zookeeper.test.QuorumQuotaTest.testQuotaWithQuorum

Error Message:
waiting for server up

Stack Trace:
junit.framework.AssertionFailedError: waiting for server up
	at org.apache.zookeeper.test.QuorumBase.startServers(QuorumBase.java:224)
	at org.apache.zookeeper.test.QuorumBase.setUp(QuorumBase.java:121)
	at org.apache.zookeeper.test.QuorumBase.setUp(QuorumBase.java:79)


FAILED:  org.apache.zookeeper.test.QuorumQuotaTest.testNull

Error Message:
waiting for server up

Stack Trace:
junit.framework.AssertionFailedError: waiting for server up
	at org.apache.zookeeper.test.QuorumBase.startServers(QuorumBase.java:224)
	at org.apache.zookeeper.test.QuorumBase.setUp(QuorumBase.java:121)
	at org.apache.zookeeper.test.QuorumBase.setUp(QuorumBase.java:79)


FAILED:  org.apache.zookeeper.test.QuorumTest.testLeaderShutdown

Error Message:
waiting for server up

Stack Trace:
junit.framework.AssertionFailedError: waiting for server up
	at org.apache.zookeeper.test.QuorumBase.startServers(QuorumBase.java:224)
	at org.apache.zookeeper.test.QuorumBase.setUp(QuorumBase.java:121)
	at org.apache.zookeeper.test.QuorumBase.setUp(QuorumBase.java:79)
	at org.apache.zookeeper.test.QuorumTest.setUp(QuorumTest.java:60)


FAILED:  org.apache.zookeeper.test.QuorumTest.testACLs

Error Message:
waiting for server up

Stack Trace:
junit.framework.AssertionFailedError: waiting for server up
	at org.apache.zookeeper.test.QuorumBase.startServers(QuorumBase.java:224)
	at org.apache.zookeeper.test.QuorumBase.setUp(QuorumBase.java:121)
	at org.apache.zookeeper.test.QuorumBase.setUp(QuorumBase.java:79)
	at org.apache.zookeeper.test.QuorumTest.setUp(QuorumTest.java:60)


FAILED:  org.apache.zookeeper.test.QuorumTest.testPing

Error Message:
waiting for server up

Stack Trace:
junit.framework.AssertionFailedError: waiting for server up
	at org.apache.zookeeper.test.QuorumBase.startServers(QuorumBase.java:224)
	at org.apache.zookeeper.test.QuorumBase.setUp(QuorumBase.java:121)
	at org.apache.zookeeper.test.QuorumBase.setUp(QuorumBase.java:79)
	at org.apache.zookeeper.test.QuorumTest.setUp(QuorumTest.java:60)


FAILED:  org.apache.zookeeper.test.QuorumTest.testClientwithoutWatcherObj

Error Message:
waiting for server up

Stack Trace:
junit.framework.AssertionFailedError: waiting for server up
	at org.apache.zookeeper.test.QuorumBase.startServers(QuorumBase.java:224)
	at org.apache.zookeeper.test.QuorumBase.setUp(QuorumBase.java:121)
	at org.apache.zookeeper.test.QuorumBase.setUp(QuorumBase.java:79)
	at org.apache.zookeeper.test.QuorumTest.setUp(QuorumTest.java:60)


FAILED:  org.apache.zookeeper.test.QuorumTest.testGetView

Error Message:
waiting for server up

Stack Trace:
junit.framework.AssertionFailedError: waiting for server up
	at org.apache.zookeeper.test.QuorumBase.startServers(QuorumBase.java:224)
	at org.apache.zookeeper.test.QuorumBase.setUp(QuorumBase.java:121)
	at org.apache.zookeeper.test.QuorumBase.setUp(QuorumBase.java:79)
	at org.apache.zookeeper.test.QuorumTest.setUp(QuorumTest.java:60)


FAILED:  org.apache.zookeeper.test.QuorumTest.testSequentialNodeNames

Error Message:
waiting for server up

Stack Trace:
junit.framework.AssertionFailedError: waiting for server up
	at org.apache.zookeeper.test.QuorumBase.startServers(QuorumBase.java:224)
	at org.apache.zookeeper.test.QuorumBase.setUp(QuorumBase.java:121)
	at org.apache.zookeeper.test.QuorumBase.setUp(QuorumBase.java:79)
	at org.apache.zookeeper.test.QuorumTest.setUp(QuorumTest.java:60)


FAILED:  org.apache.zookeeper.test.QuorumTest.testViewContains

Error Message:
waiting for server up

Stack Trace:
junit.framework.AssertionFailedError: waiting for server up
	at org.apache.zookeeper.test.QuorumBase.startServers(QuorumBase.java:224)
	at org.apache.zookeeper.test.QuorumBase.setUp(QuorumBase.java:121)
	at org.apache.zookeeper.test.QuorumBase.setUp(QuorumBase.java:79)
	at org.apache.zookeeper.test.QuorumTest.setUp(QuorumTest.java:60)


FAILED:  org.apache.zookeeper.test.QuorumTest.testSessionMoved

Error Message:
waiting for server up

Stack Trace:
junit.framework.AssertionFailedError: waiting for server up
	at org.apache.zookeeper.test.QuorumBase.startServers(QuorumBase.java:224)
	at org.apache.zookeeper.test.QuorumBase.setUp(QuorumBase.java:121)
	at org.apache.zookeeper.test.QuorumBase.setUp(QuorumBase.java:79)
	at org.apache.zookeeper.test.QuorumTest.setUp(QuorumTest.java:60)


FAILED:  org.apache.zookeeper.test.QuorumTest.testClientWithWatcherObj

Error Message:
waiting for server up

Stack Trace:
junit.framework.AssertionFailedError: waiting for server up
	at org.apache.zookeeper.test.QuorumBase.startServers(QuorumBase.java:224)
	at org.apache.zookeeper.test.QuorumBase.setUp(QuorumBase.java:121)
	at org.apache.zookeeper.test.QuorumBase.setUp(QuorumBase.java:79)
	at org.apache.zookeeper.test.QuorumTest.setUp(QuorumTest.java:60)


FAILED:  org.apache.zookeeper.test.QuorumTest.testMultiToFollower

Error Message:
waiting for server up

Stack Trace:
junit.framework.AssertionFailedError: waiting for server up
	at org.apache.zookeeper.test.QuorumBase.startServers(QuorumBase.java:224)
	at org.apache.zookeeper.test.QuorumBase.setUp(QuorumBase.java:121)
	at org.apache.zookeeper.test.QuorumBase.setUp(QuorumBase.java:79)
	at org.apache.zookeeper.test.QuorumTest.setUp(QuorumTest.java:60)


FAILED:  org.apache.zookeeper.test.QuorumTest.testDeleteWithChildren

Error Message:
waiting for server up

Stack Trace:
junit.framework.AssertionFailedError: waiting for server up
	at org.apache.zookeeper.test.QuorumBase.startServers(QuorumBase.java:224)
	at org.apache.zookeeper.test.QuorumBase.setUp(QuorumBase.java:121)
	at org.apache.zookeeper.test.QuorumBase.setUp(QuorumBase.java:79)
	at org.apache.zookeeper.test.QuorumTest.setUp(QuorumTest.java:60)


FAILED:  org.apache.zookeeper.test.QuorumTest.testMultipleWatcherObjs

Error Message:
waiting for server up

Stack Trace:
junit.framework.AssertionFailedError: waiting for server up
	at org.apache.zookeeper.test.QuorumBase.startServers(QuorumBase.java:224)
	at org.apache.zookeeper.test.QuorumBase.setUp(QuorumBase.java:121)
	at org.apache.zookeeper.test.QuorumBase.setUp(QuorumBase.java:79)
	at org.apache.zookeeper.test.QuorumTest.setUp(QuorumTest.java:60)


FAILED:  org.apache.zookeeper.test.QuorumTest.testFollowersStartAfterLeader

Error Message:
waiting for server up

Stack Trace:
junit.framework.AssertionFailedError: waiting for server up
	at org.apache.zookeeper.test.QuorumBase.startServers(QuorumBase.java:224)
	at org.apache.zookeeper.test.QuorumBase.setUp(QuorumBase.java:121)
	at org.apache.zookeeper.test.QuorumBase.setUp(QuorumBase.java:79)
	at org.apache.zookeeper.test.QuorumTest.setUp(QuorumTest.java:60)


FAILED:  org.apache.zookeeper.test.QuorumUtilTest.validateAllMXBeanAreUnregistered

Error Message:
waiting for server up

Stack Trace:
junit.framework.AssertionFailedError: waiting for server up
	at org.apache.zookeeper.test.QuorumUtil.startAll(QuorumUtil.java:151)
	at org.apache.zookeeper.test.QuorumUtilTest.validateAllMXBeanAreUnregistered(QuorumUtilTest.java:53)
	at org.apache.zookeeper.JUnit4ZKTestRunner$LoggedInvokeMethod.evaluate(JUnit4ZKTestRunner.java:79)


FAILED:  org.apache.zookeeper.test.QuorumZxidSyncTest.testBehindLeader

Error Message:
waiting for server up

Stack Trace:
junit.framework.AssertionFailedError: waiting for server up
	at org.apache.zookeeper.test.QuorumBase.startServers(QuorumBase.java:224)
	at org.apache.zookeeper.test.QuorumBase.setUp(QuorumBase.java:121)
	at org.apache.zookeeper.test.QuorumBase.setUp(QuorumBase.java:79)
	at org.apache.zookeeper.test.QuorumZxidSyncTest.setUp(QuorumZxidSyncTest.java:40)


FAILED:  org.apache.zookeeper.test.QuorumZxidSyncTest.testLateLogs

Error Message:
waiting for server up

Stack Trace:
junit.framework.AssertionFailedError: waiting for server up
	at org.apache.zookeeper.test.QuorumBase.startServers(QuorumBase.java:224)
	at org.apache.zookeeper.test.QuorumBase.setUp(QuorumBase.java:121)
	at org.apache.zookeeper.test.QuorumBase.setUp(QuorumBase.java:79)
	at org.apache.zookeeper.test.QuorumZxidSyncTest.setUp(QuorumZxidSyncTest.java:40)


FAILED:  org.apache.zookeeper.test.ReadOnlyModeTest.testSessionEstablishment

Error Message:
Waiting for server up

Stack Trace:
junit.framework.AssertionFailedError: Waiting for server up
	at org.apache.zookeeper.test.QuorumUtil.startQuorum(QuorumUtil.java:196)
	at org.apache.zookeeper.test.ReadOnlyModeTest.setUp(ReadOnlyModeTest.java:61)


FAILED:  org.apache.zookeeper.test.ReadOnlyModeTest.testSeekForRwServer

Error Message:
Waiting for server up

Stack Trace:
junit.framework.AssertionFailedError: Waiting for server up
	at org.apache.zookeeper.test.QuorumUtil.startQuorum(QuorumUtil.java:196)
	at org.apache.zookeeper.test.ReadOnlyModeTest.setUp(ReadOnlyModeTest.java:61)


FAILED:  org.apache.zookeeper.test.ReadOnlyModeTest.testReadOnlyClient

Error Message:
Waiting for server up

Stack Trace:
junit.framework.AssertionFailedError: Waiting for server up
	at org.apache.zookeeper.test.QuorumUtil.startQuorum(QuorumUtil.java:196)
	at org.apache.zookeeper.test.ReadOnlyModeTest.setUp(ReadOnlyModeTest.java:61)


FAILED:  org.apache.zookeeper.test.ReadOnlyModeTest.testConnectionEvents

Error Message:
Waiting for server up

Stack Trace:
junit.framework.AssertionFailedError: Waiting for server up
	at org.apache.zookeeper.test.QuorumUtil.startQuorum(QuorumUtil.java:196)
	at org.apache.zookeeper.test.ReadOnlyModeTest.setUp(ReadOnlyModeTest.java:61)


FAILED:  org.apache.zookeeper.test.ReadOnlyModeTest.testMultiTransaction

Error Message:
Waiting for server up

Stack Trace:
junit.framework.AssertionFailedError: Waiting for server up
	at org.apache.zookeeper.test.QuorumUtil.startQuorum(QuorumUtil.java:196)
	at org.apache.zookeeper.test.ReadOnlyModeTest.setUp(ReadOnlyModeTest.java:61)


FAILED:  org.apache.zookeeper.test.ReconfigExceptionTest.testReconfigFailWithAuthWithNoACL

Error Message:
waiting for server up

Stack Trace:
junit.framework.AssertionFailedError: waiting for server up
	at org.apache.zookeeper.test.QuorumUtil.startAll(QuorumUtil.java:151)
	at org.apache.zookeeper.test.ReconfigExceptionTest.setup(ReconfigExceptionTest.java:67)


FAILED:  org.apache.zookeeper.test.ReconfigExceptionTest.testReconfigEnabledWithAuthAndWrongACL

Error Message:
waiting for server up

Stack Trace:
junit.framework.AssertionFailedError: waiting for server up
	at org.apache.zookeeper.test.QuorumUtil.startAll(QuorumUtil.java:151)
	at org.apache.zookeeper.test.ReconfigExceptionTest.setup(ReconfigExceptionTest.java:67)


FAILED:  org.apache.zookeeper.test.ReconfigExceptionTest.testReconfigDisabled

Error Message:
waiting for server up

Stack Trace:
junit.framework.AssertionFailedError: waiting for server up
	at org.apache.zookeeper.test.QuorumUtil.startAll(QuorumUtil.java:151)
	at org.apache.zookeeper.test.ReconfigExceptionTest.setup(ReconfigExceptionTest.java:67)


FAILED:  org.apache.zookeeper.test.ReconfigExceptionTest.testReconfigEnabledWithAuthAndACL

Error Message:
waiting for server up

Stack Trace:
junit.framework.AssertionFailedError: waiting for server up
	at org.apache.zookeeper.test.QuorumUtil.startAll(QuorumUtil.java:151)
	at org.apache.zookeeper.test.ReconfigExceptionTest.setup(ReconfigExceptionTest.java:67)


FAILED:  org.apache.zookeeper.test.ReconfigExceptionTest.testReconfigFailWithoutAuth

Error Message:
waiting for server up

Stack Trace:
junit.framework.AssertionFailedError: waiting for server up
	at org.apache.zookeeper.test.QuorumUtil.startAll(QuorumUtil.java:151)
	at org.apache.zookeeper.test.ReconfigExceptionTest.setup(ReconfigExceptionTest.java:67)


FAILED:  org.apache.zookeeper.test.ReconfigExceptionTest.testReconfigEnabledWithSuperUser

Error Message:
waiting for server up

Stack Trace:
junit.framework.AssertionFailedError: waiting for server up
	at org.apache.zookeeper.test.QuorumUtil.startAll(QuorumUtil.java:151)
	at org.apache.zookeeper.test.ReconfigExceptionTest.setup(ReconfigExceptionTest.java:67)


FAILED:  org.apache.zookeeper.test.ReconfigMisconfigTest.testReconfigFailWithoutSuperuserPasswordConfiguredOnServer

Error Message:
waiting for server up

Stack Trace:
junit.framework.AssertionFailedError: waiting for server up
	at org.apache.zookeeper.test.QuorumUtil.startAll(QuorumUtil.java:151)
	at org.apache.zookeeper.test.ReconfigMisconfigTest.setup(ReconfigMisconfigTest.java:53)


FAILED:  org.apache.zookeeper.test.ReconfigTest.testQuorumSystemChange

Error Message:
waiting for server up

Stack Trace:
junit.framework.AssertionFailedError: waiting for server up
	at org.apache.zookeeper.test.QuorumUtil.startAll(QuorumUtil.java:151)
	at org.apache.zookeeper.test.ReconfigTest.testQuorumSystemChange(ReconfigTest.java:818)
	at org.apache.zookeeper.JUnit4ZKTestRunner$LoggedInvokeMethod.evaluate(JUnit4ZKTestRunner.java:79)


FAILED:  org.apache.zookeeper.test.ReconfigTest.testPortChange

Error Message:
waiting for server up

Stack Trace:
junit.framework.AssertionFailedError: waiting for server up
	at org.apache.zookeeper.test.QuorumUtil.startAll(QuorumUtil.java:151)
	at org.apache.zookeeper.test.ReconfigTest.testPortChange(ReconfigTest.java:591)
	at org.apache.zookeeper.JUnit4ZKTestRunner$LoggedInvokeMethod.evaluate(JUnit4ZKTestRunner.java:79)


FAILED:  org.apache.zookeeper.test.ReconfigTest.testPortChangeToBlockedPortLeader

Error Message:
waiting for server up

Stack Trace:
junit.framework.AssertionFailedError: waiting for server up
	at org.apache.zookeeper.test.QuorumUtil.startAll(QuorumUtil.java:151)
	at org.apache.zookeeper.test.ReconfigTest.testPortChangeToBlockedPort(ReconfigTest.java:724)
	at org.apache.zookeeper.test.ReconfigTest.testPortChangeToBlockedPortLeader(ReconfigTest.java:718)
	at org.apache.zookeeper.JUnit4ZKTestRunner$LoggedInvokeMethod.evaluate(JUnit4ZKTestRunner.java:79)


FAILED:  org.apache.zookeeper.test.ReconfigTest.testInitialConfigHasPositiveVersion

Error Message:
waiting for server up

Stack Trace:
junit.framework.AssertionFailedError: waiting for server up
	at org.apache.zookeeper.test.QuorumUtil.startAll(QuorumUtil.java:151)
	at org.apache.zookeeper.test.ReconfigTest.testInitialConfigHasPositiveVersion(ReconfigTest.java:895)
	at org.apache.zookeeper.JUnit4ZKTestRunner$LoggedInvokeMethod.evaluate(JUnit4ZKTestRunner.java:79)


FAILED:  org.apache.zookeeper.test.ReconfigTest.testRemoveAddOne

Error Message:
waiting for server up

Stack Trace:
junit.framework.AssertionFailedError: waiting for server up
	at org.apache.zookeeper.test.QuorumUtil.startAll(QuorumUtil.java:151)
	at org.apache.zookeeper.test.ReconfigTest.testRemoveAddOne(ReconfigTest.java:252)
	at org.apache.zookeeper.JUnit4ZKTestRunner$LoggedInvokeMethod.evaluate(JUnit4ZKTestRunner.java:79)


FAILED:  org.apache.zookeeper.test.ReconfigTest.testRemoveAddTwo

Error Message:
waiting for server up

Stack Trace:
junit.framework.AssertionFailedError: waiting for server up
	at org.apache.zookeeper.test.QuorumUtil.startAll(QuorumUtil.java:151)
	at org.apache.zookeeper.test.ReconfigTest.testRemoveAddTwo(ReconfigTest.java:334)
	at org.apache.zookeeper.JUnit4ZKTestRunner$LoggedInvokeMethod.evaluate(JUnit4ZKTestRunner.java:79)


FAILED:  org.apache.zookeeper.test.ReconfigTest.testPortChangeToBlockedPortFollower

Error Message:
waiting for server up

Stack Trace:
junit.framework.AssertionFailedError: waiting for server up
	at org.apache.zookeeper.test.QuorumUtil.startAll(QuorumUtil.java:151)
	at org.apache.zookeeper.test.ReconfigTest.testPortChangeToBlockedPort(ReconfigTest.java:724)
	at org.apache.zookeeper.test.ReconfigTest.testPortChangeToBlockedPortFollower(ReconfigTest.java:714)
	at org.apache.zookeeper.JUnit4ZKTestRunner$LoggedInvokeMethod.evaluate(JUnit4ZKTestRunner.java:79)


FAILED:  org.apache.zookeeper.test.ReconfigTest.testJMXBeanAfterRemoveAddOne

Error Message:
waiting for server up

Stack Trace:
junit.framework.AssertionFailedError: waiting for server up
	at org.apache.zookeeper.test.QuorumUtil.startAll(QuorumUtil.java:151)
	at org.apache.zookeeper.test.ReconfigTest.testJMXBeanAfterRemoveAddOne(ReconfigTest.java:914)
	at org.apache.zookeeper.JUnit4ZKTestRunner$LoggedInvokeMethod.evaluate(JUnit4ZKTestRunner.java:79)


FAILED:  org.apache.zookeeper.test.ReconfigTest.testRoleChange

Error Message:
waiting for server up

Stack Trace:
junit.framework.AssertionFailedError: waiting for server up
	at org.apache.zookeeper.test.QuorumUtil.startAll(QuorumUtil.java:151)
	at org.apache.zookeeper.test.ReconfigTest.testRoleChange(ReconfigTest.java:514)
	at org.apache.zookeeper.JUnit4ZKTestRunner$LoggedInvokeMethod.evaluate(JUnit4ZKTestRunner.java:79)


FAILED:  org.apache.zookeeper.test.ReconfigTest.testBulkReconfig

Error Message:
waiting for server up

Stack Trace:
junit.framework.AssertionFailedError: waiting for server up
	at org.apache.zookeeper.test.QuorumUtil.startAll(QuorumUtil.java:151)
	at org.apache.zookeeper.test.ReconfigTest.testBulkReconfig(ReconfigTest.java:434)
	at org.apache.zookeeper.JUnit4ZKTestRunner$LoggedInvokeMethod.evaluate(JUnit4ZKTestRunner.java:79)


FAILED:  org.apache.zookeeper.test.ReconfigTest.testJMXBeanAfterRoleChange

Error Message:
waiting for server up

Stack Trace:
junit.framework.AssertionFailedError: waiting for server up
	at org.apache.zookeeper.test.QuorumUtil.startAll(QuorumUtil.java:151)
	at org.apache.zookeeper.test.ReconfigTest.testJMXBeanAfterRoleChange(ReconfigTest.java:993)
	at org.apache.zookeeper.JUnit4ZKTestRunner$LoggedInvokeMethod.evaluate(JUnit4ZKTestRunner.java:79)


FAILED:  org.apache.zookeeper.test.ReconfigTest.testRemoveOneAsynchronous

Error Message:
waiting for server up

Stack Trace:
junit.framework.AssertionFailedError: waiting for server up
	at org.apache.zookeeper.test.QuorumUtil.startAll(QuorumUtil.java:151)
	at org.apache.zookeeper.test.ReconfigTest.testRemoveOneAsynchronous(ReconfigTest.java:473)
	at org.apache.zookeeper.JUnit4ZKTestRunner$LoggedInvokeMethod.evaluate(JUnit4ZKTestRunner.java:79)


FAILED:  org.apache.zookeeper.test.RepeatStartupTest.testFail

Error Message:
waiting for server up

Stack Trace:
junit.framework.AssertionFailedError: waiting for server up
	at org.apache.zookeeper.test.QuorumBase.startServers(QuorumBase.java:224)
	at org.apache.zookeeper.test.QuorumBase.setUp(QuorumBase.java:121)
	at org.apache.zookeeper.test.QuorumBase.setUp(QuorumBase.java:79)
	at org.apache.zookeeper.test.RepeatStartupTest.testFail(RepeatStartupTest.java:40)
	at org.apache.zookeeper.JUnit4ZKTestRunner$LoggedInvokeMethod.evaluate(JUnit4ZKTestRunner.java:79)


FAILED:  org.apache.zookeeper.test.SSLTest.testSecureQuorumServer

Error Message:
waiting for server 0 being up

Stack Trace:
junit.framework.AssertionFailedError: waiting for server 0 being up
	at org.apache.zookeeper.test.SSLTest.testSecureQuorumServer(SSLTest.java:96)
	at org.apache.zookeeper.JUnit4ZKTestRunner$LoggedInvokeMethod.evaluate(JUnit4ZKTestRunner.java:79)


FAILED:  org.apache.zookeeper.test.SessionUpgradeTest.testLocalSessionsWithoutEphemeralOnFollower

Error Message:
waiting for server up

Stack Trace:
junit.framework.AssertionFailedError: waiting for server up
	at org.apache.zookeeper.test.QuorumBase.startServers(QuorumBase.java:224)
	at org.apache.zookeeper.test.QuorumBase.setUp(QuorumBase.java:121)
	at org.apache.zookeeper.test.QuorumBase.setUp(QuorumBase.java:79)
	at org.apache.zookeeper.test.SessionUpgradeTest.setUp(SessionUpgradeTest.java:52)


FAILED:  org.apache.zookeeper.test.SessionUpgradeTest.testLocalSessionsWithoutEphemeralOnLeader

Error Message:
waiting for server up

Stack Trace:
junit.framework.AssertionFailedError: waiting for server up
	at org.apache.zookeeper.test.QuorumBase.startServers(QuorumBase.java:224)
	at org.apache.zookeeper.test.QuorumBase.setUp(QuorumBase.java:121)
	at org.apache.zookeeper.test.QuorumBase.setUp(QuorumBase.java:79)
	at org.apache.zookeeper.test.SessionUpgradeTest.setUp(SessionUpgradeTest.java:52)


FAILED:  org.apache.zookeeper.test.SessionUpgradeTest.testUpgradeWithEphemeralOnLeader

Error Message:
waiting for server up

Stack Trace:
junit.framework.AssertionFailedError: waiting for server up
	at org.apache.zookeeper.test.QuorumBase.startServers(QuorumBase.java:224)
	at org.apache.zookeeper.test.QuorumBase.setUp(QuorumBase.java:121)
	at org.apache.zookeeper.test.QuorumBase.setUp(QuorumBase.java:79)
	at org.apache.zookeeper.test.SessionUpgradeTest.setUp(SessionUpgradeTest.java:52)


FAILED:  org.apache.zookeeper.test.SessionUpgradeTest.testUpgradeWithEphemeralOnFollower

Error Message:
waiting for server up

Stack Trace:
junit.framework.AssertionFailedError: waiting for server up
	at org.apache.zookeeper.test.QuorumBase.startServers(QuorumBase.java:224)
	at org.apache.zookeeper.test.QuorumBase.setUp(QuorumBase.java:121)
	at org.apache.zookeeper.test.QuorumBase.setUp(QuorumBase.java:79)
	at org.apache.zookeeper.test.SessionUpgradeTest.setUp(SessionUpgradeTest.java:52)


FAILED:  org.apache.zookeeper.test.TruncateTest.testTruncate

Error Message:
ZooKeeper client can not connect to 127.0.0.1:21996

Stack Trace:
junit.framework.AssertionFailedError: ZooKeeper client can not connect to 127.0.0.1:21996
	at org.apache.zookeeper.test.ClientBase.createZKClient(ClientBase.java:761)
	at org.apache.zookeeper.test.TruncateTest.testTruncate(TruncateTest.java:212)
	at org.apache.zookeeper.JUnit4ZKTestRunner$LoggedInvokeMethod.evaluate(JUnit4ZKTestRunner.java:79)


FAILED:  org.apache.zookeeper.test.WatchEventWhenAutoResetTest.testNodeChildrenChanged

Error Message:
waiting for server up

Stack Trace:
junit.framework.AssertionFailedError: waiting for server up
	at org.apache.zookeeper.test.QuorumUtil.startAll(QuorumUtil.java:151)
	at org.apache.zookeeper.test.WatchEventWhenAutoResetTest.testNodeChildrenChanged(WatchEventWhenAutoResetTest.java:197)
	at org.apache.zookeeper.JUnit4ZKTestRunner$LoggedInvokeMethod.evaluate(JUnit4ZKTestRunner.java:79)


FAILED:  org.apache.zookeeper.test.WatchEventWhenAutoResetTest.testNodeDataChanged

Error Message:
waiting for server up

Stack Trace:
junit.framework.AssertionFailedError: waiting for server up
	at org.apache.zookeeper.test.QuorumUtil.startAll(QuorumUtil.java:151)
	at org.apache.zookeeper.test.WatchEventWhenAutoResetTest.testNodeDataChanged(WatchEventWhenAutoResetTest.java:100)
	at org.apache.zookeeper.JUnit4ZKTestRunner$LoggedInvokeMethod.evaluate(JUnit4ZKTestRunner.java:79)


FAILED:  org.apache.zookeeper.test.WatchEventWhenAutoResetTest.testNodeCreated

Error Message:
waiting for server up

Stack Trace:
junit.framework.AssertionFailedError: waiting for server up
	at org.apache.zookeeper.test.QuorumUtil.startAll(QuorumUtil.java:151)
	at org.apache.zookeeper.test.WatchEventWhenAutoResetTest.testNodeCreated(WatchEventWhenAutoResetTest.java:134)
	at org.apache.zookeeper.JUnit4ZKTestRunner$LoggedInvokeMethod.evaluate(JUnit4ZKTestRunner.java:79)


FAILED:  org.apache.zookeeper.test.WatchEventWhenAutoResetTest.testNodeDeleted

Error Message:
waiting for server up

Stack Trace:
junit.framework.AssertionFailedError: waiting for server up
	at org.apache.zookeeper.test.QuorumUtil.startAll(QuorumUtil.java:151)
	at org.apache.zookeeper.test.WatchEventWhenAutoResetTest.testNodeDeleted(WatchEventWhenAutoResetTest.java:156)
	at org.apache.zookeeper.JUnit4ZKTestRunner$LoggedInvokeMethod.evaluate(JUnit4ZKTestRunner.java:79)


FAILED:  org.apache.zookeeper.test.ZkDatabaseCorruptionTest.testCorruption

Error Message:
waiting for server up

Stack Trace:
junit.framework.AssertionFailedError: waiting for server up
	at org.apache.zookeeper.test.QuorumBase.startServers(QuorumBase.java:224)
	at org.apache.zookeeper.test.QuorumBase.setUp(QuorumBase.java:121)
	at org.apache.zookeeper.test.QuorumBase.setUp(QuorumBase.java:79)
	at org.apache.zookeeper.test.ZkDatabaseCorruptionTest.setUp(ZkDatabaseCorruptionTest.java:51)


FAILED:  org.apache.zookeeper.server.quorum.EphemeralNodeDeletionTest.testEphemeralNodeDeletion

Error Message:
waiting for server 0 being up

Stack Trace:
junit.framework.AssertionFailedError: waiting for server 0 being up
	at org.apache.zookeeper.server.quorum.EphemeralNodeDeletionTest.testEphemeralNodeDeletion(EphemeralNodeDeletionTest.java:81)
	at org.apache.zookeeper.JUnit4ZKTestRunner$LoggedInvokeMethod.evaluate(JUnit4ZKTestRunner.java:79)
	at java.util.concurrent.FutureTask.run(FutureTask.java:262)
	at java.lang.Thread.run(Thread.java:745)

Success: ZOOKEEPER- PreCommit Build #1448

Posted by Apache Jenkins Server <je...@builds.apache.org>.
Build: https://builds.apache.org/job/PreCommit-ZOOKEEPER-github-pr-build/1448/

###################################################################################
########################## LAST 60 LINES OF THE CONSOLE ###########################
[...truncated 77.61 MB...]
     [exec] 
     [exec]     +1 javadoc.  The javadoc tool did not generate any warning messages.
     [exec] 
     [exec]     +1 javac.  The applied patch does not increase the total number of javac compiler warnings.
     [exec] 
     [exec]     +1 findbugs.  The patch does not introduce any new Findbugs (version 3.0.1) warnings.
     [exec] 
     [exec]     +1 release audit.  The applied patch does not increase the total number of release audit warnings.
     [exec] 
     [exec]     +1 core tests.  The patch passed core unit tests.
     [exec] 
     [exec]     +1 contrib tests.  The patch passed contrib unit tests.
     [exec] 
     [exec] Test results: https://builds.apache.org/job/PreCommit-ZOOKEEPER-github-pr-build/1448//testReport/
     [exec] Findbugs warnings: https://builds.apache.org/job/PreCommit-ZOOKEEPER-github-pr-build/1448//artifact/trunk/build/test/findbugs/newPatchFindbugsWarnings.html
     [exec] Console output: https://builds.apache.org/job/PreCommit-ZOOKEEPER-github-pr-build/1448//console
     [exec] 
     [exec] This message is automatically generated.
     [exec] 
     [exec] 
     [exec] ======================================================================
     [exec] ======================================================================
     [exec]     Adding comment to Jira.
     [exec] ======================================================================
     [exec] ======================================================================
     [exec] 
     [exec] 
     [exec] Unable to log in to server: https://issues.apache.org/jira/rpc/soap/jirasoapservice-v2 with user: hadoopqa.
     [exec]  Cause: ; nested exception is: 
     [exec] 	javax.net.ssl.SSLException: Received fatal alert: protocol_version
     [exec] 
     [exec] 
     [exec] ======================================================================
     [exec] ======================================================================
     [exec]     Finished build.
     [exec] ======================================================================
     [exec] ======================================================================
     [exec] 
     [exec] 
     [exec] Unable to log in to server: https://issues.apache.org/jira/rpc/soap/jirasoapservice-v2 with user: hadoopqa.
     [exec]  Cause: ; nested exception is: 
     [exec] 	javax.net.ssl.SSLException: Received fatal alert: protocol_version
     [exec] mv: '/home/jenkins/jenkins-slave/workspace/PreCommit-ZOOKEEPER-github-pr-build/patchprocess' and '/home/jenkins/jenkins-slave/workspace/PreCommit-ZOOKEEPER-github-pr-build/patchprocess' are the same file

BUILD SUCCESSFUL
Total time: 18 minutes 7 seconds
Archiving artifacts
Setting JDK_1_7_LATEST__HOME=/home/jenkins/tools/java/latest1.7
Recording test results
Setting JDK_1_7_LATEST__HOME=/home/jenkins/tools/java/latest1.7
Setting JDK_1_7_LATEST__HOME=/home/jenkins/tools/java/latest1.7
[description-setter] Description set: ZOOKEEPER-2930
Putting comment on the pull request
Setting JDK_1_7_LATEST__HOME=/home/jenkins/tools/java/latest1.7
Email was triggered for: Success
Sending email for trigger: Success
Setting JDK_1_7_LATEST__HOME=/home/jenkins/tools/java/latest1.7
Setting JDK_1_7_LATEST__HOME=/home/jenkins/tools/java/latest1.7
Setting JDK_1_7_LATEST__HOME=/home/jenkins/tools/java/latest1.7



###################################################################################
############################## FAILED TESTS (if any) ##############################
All tests passed