You are viewing a plain text version of this content. The canonical link for it is here.
Posted to dev@lucene.apache.org by Policeman Jenkins Server <je...@thetaphi.de> on 2017/02/12 06:41:47 UTC
[JENKINS] Lucene-Solr-master-Linux (64bit/jdk1.8.0_121) - Build #
18946 - Failure!
Build: https://jenkins.thetaphi.de/job/Lucene-Solr-master-Linux/18946/
Java: 64bit/jdk1.8.0_121 -XX:-UseCompressedOops -XX:+UseConcMarkSweepGC
All tests passed
Build Log:
[...truncated 75277 lines...]
-documentation-lint:
[jtidy] Checking for broken html (such as invalid tags)...
[delete] Deleting directory /home/jenkins/workspace/Lucene-Solr-master-Linux/lucene/build/jtidy_tmp
[echo] Checking for broken links...
[exec]
[exec] Crawl/parse...
[exec]
[exec] Verify...
[echo] Checking for malformed docs...
[exec]
[exec] /home/jenkins/workspace/Lucene-Solr-master-Linux/solr/build/docs/solr-solrj/overview-summary.html
[exec] missing: org.apache.solr.client.solrj.io.eval
[exec]
[exec] Missing javadocs were found!
BUILD FAILED
/home/jenkins/workspace/Lucene-Solr-master-Linux/build.xml:775: The following error occurred while executing this line:
/home/jenkins/workspace/Lucene-Solr-master-Linux/build.xml:101: The following error occurred while executing this line:
/home/jenkins/workspace/Lucene-Solr-master-Linux/solr/build.xml:654: The following error occurred while executing this line:
/home/jenkins/workspace/Lucene-Solr-master-Linux/solr/build.xml:670: The following error occurred while executing this line:
/home/jenkins/workspace/Lucene-Solr-master-Linux/lucene/common-build.xml:2493: exec returned: 1
Total time: 70 minutes 40 seconds
Build step 'Invoke Ant' marked build as failure
Archiving artifacts
[WARNINGS] Skipping publisher since build result is FAILURE
Recording test results
Email was triggered for: Failure - Any
Sending email for trigger: Failure - Any
[JENKINS-EA] Lucene-Solr-master-Linux (64bit/jdk-9-ea+155) - Build
# 18949 - Still Unstable!
Posted by Policeman Jenkins Server <je...@thetaphi.de>.
Build: https://jenkins.thetaphi.de/job/Lucene-Solr-master-Linux/18949/
Java: 64bit/jdk-9-ea+155 -XX:+UseCompressedOops -XX:+UseG1GC
2 tests failed.
FAILED: org.apache.solr.handler.admin.TestApiFramework.testFramework
Error Message:
Could not initialize class org.easymock.internal.ClassProxyFactory$2
Stack Trace:
java.lang.NoClassDefFoundError: Could not initialize class org.easymock.internal.ClassProxyFactory$2
at __randomizedtesting.SeedInfo.seed([7D9EC94F5DE52E79:6AE803685B31C244]:0)
at org.easymock.internal.ClassProxyFactory.createEnhancer(ClassProxyFactory.java:259)
at org.easymock.internal.ClassProxyFactory.createProxy(ClassProxyFactory.java:174)
at org.easymock.internal.MocksControl.createMock(MocksControl.java:60)
at org.easymock.EasyMock.createMock(EasyMock.java:104)
at org.apache.solr.handler.admin.TestCoreAdminApis.getCoreContainerMock(TestCoreAdminApis.java:76)
at org.apache.solr.handler.admin.TestApiFramework.testFramework(TestApiFramework.java:59)
at java.base/jdk.internal.reflect.NativeMethodAccessorImpl.invoke0(Native Method)
at java.base/jdk.internal.reflect.NativeMethodAccessorImpl.invoke(NativeMethodAccessorImpl.java:62)
at java.base/jdk.internal.reflect.DelegatingMethodAccessorImpl.invoke(DelegatingMethodAccessorImpl.java:43)
at java.base/java.lang.reflect.Method.invoke(Method.java:543)
at com.carrotsearch.randomizedtesting.RandomizedRunner.invoke(RandomizedRunner.java:1713)
at com.carrotsearch.randomizedtesting.RandomizedRunner$8.evaluate(RandomizedRunner.java:907)
at com.carrotsearch.randomizedtesting.RandomizedRunner$9.evaluate(RandomizedRunner.java:943)
at com.carrotsearch.randomizedtesting.RandomizedRunner$10.evaluate(RandomizedRunner.java:957)
at com.carrotsearch.randomizedtesting.rules.SystemPropertiesRestoreRule$1.evaluate(SystemPropertiesRestoreRule.java:57)
at org.apache.lucene.util.TestRuleSetupTeardownChained$1.evaluate(TestRuleSetupTeardownChained.java:49)
at org.apache.lucene.util.AbstractBeforeAfterRule$1.evaluate(AbstractBeforeAfterRule.java:45)
at org.apache.lucene.util.TestRuleThreadAndTestName$1.evaluate(TestRuleThreadAndTestName.java:48)
at org.apache.lucene.util.TestRuleIgnoreAfterMaxFailures$1.evaluate(TestRuleIgnoreAfterMaxFailures.java:64)
at org.apache.lucene.util.TestRuleMarkFailure$1.evaluate(TestRuleMarkFailure.java:47)
at com.carrotsearch.randomizedtesting.rules.StatementAdapter.evaluate(StatementAdapter.java:36)
at com.carrotsearch.randomizedtesting.ThreadLeakControl$StatementRunner.run(ThreadLeakControl.java:368)
at com.carrotsearch.randomizedtesting.ThreadLeakControl.forkTimeoutingTask(ThreadLeakControl.java:817)
at com.carrotsearch.randomizedtesting.ThreadLeakControl$3.evaluate(ThreadLeakControl.java:468)
at com.carrotsearch.randomizedtesting.RandomizedRunner.runSingleTest(RandomizedRunner.java:916)
at com.carrotsearch.randomizedtesting.RandomizedRunner$5.evaluate(RandomizedRunner.java:802)
at com.carrotsearch.randomizedtesting.RandomizedRunner$6.evaluate(RandomizedRunner.java:852)
at com.carrotsearch.randomizedtesting.RandomizedRunner$7.evaluate(RandomizedRunner.java:863)
at com.carrotsearch.randomizedtesting.rules.StatementAdapter.evaluate(StatementAdapter.java:36)
at com.carrotsearch.randomizedtesting.rules.SystemPropertiesRestoreRule$1.evaluate(SystemPropertiesRestoreRule.java:57)
at org.apache.lucene.util.AbstractBeforeAfterRule$1.evaluate(AbstractBeforeAfterRule.java:45)
at com.carrotsearch.randomizedtesting.rules.StatementAdapter.evaluate(StatementAdapter.java:36)
at org.apache.lucene.util.TestRuleStoreClassName$1.evaluate(TestRuleStoreClassName.java:41)
at com.carrotsearch.randomizedtesting.rules.NoShadowingOrOverridesOnMethodsRule$1.evaluate(NoShadowingOrOverridesOnMethodsRule.java:40)
at com.carrotsearch.randomizedtesting.rules.NoShadowingOrOverridesOnMethodsRule$1.evaluate(NoShadowingOrOverridesOnMethodsRule.java:40)
at com.carrotsearch.randomizedtesting.rules.StatementAdapter.evaluate(StatementAdapter.java:36)
at com.carrotsearch.randomizedtesting.rules.StatementAdapter.evaluate(StatementAdapter.java:36)
at org.apache.lucene.util.TestRuleAssertionsRequired$1.evaluate(TestRuleAssertionsRequired.java:53)
at org.apache.lucene.util.TestRuleMarkFailure$1.evaluate(TestRuleMarkFailure.java:47)
at org.apache.lucene.util.TestRuleIgnoreAfterMaxFailures$1.evaluate(TestRuleIgnoreAfterMaxFailures.java:64)
at org.apache.lucene.util.TestRuleIgnoreTestSuites$1.evaluate(TestRuleIgnoreTestSuites.java:54)
at com.carrotsearch.randomizedtesting.rules.StatementAdapter.evaluate(StatementAdapter.java:36)
at com.carrotsearch.randomizedtesting.ThreadLeakControl$StatementRunner.run(ThreadLeakControl.java:368)
at java.base/java.lang.Thread.run(Thread.java:844)
FAILED: org.apache.solr.handler.admin.TestCoreAdminApis.testCalls
Error Message:
Stack Trace:
java.lang.ExceptionInInitializerError
at __randomizedtesting.SeedInfo.seed([7D9EC94F5DE52E79:4F5FD624D8699DDE]:0)
at net.sf.cglib.core.KeyFactory$Generator.generateClass(KeyFactory.java:166)
at net.sf.cglib.core.DefaultGeneratorStrategy.generate(DefaultGeneratorStrategy.java:25)
at net.sf.cglib.core.AbstractClassGenerator.create(AbstractClassGenerator.java:216)
at net.sf.cglib.core.KeyFactory$Generator.create(KeyFactory.java:144)
at net.sf.cglib.core.KeyFactory.create(KeyFactory.java:116)
at net.sf.cglib.core.KeyFactory.create(KeyFactory.java:108)
at net.sf.cglib.core.KeyFactory.create(KeyFactory.java:104)
at net.sf.cglib.proxy.Enhancer.<clinit>(Enhancer.java:69)
at org.easymock.internal.ClassProxyFactory.createEnhancer(ClassProxyFactory.java:259)
at org.easymock.internal.ClassProxyFactory.createProxy(ClassProxyFactory.java:174)
at org.easymock.internal.MocksControl.createMock(MocksControl.java:60)
at org.easymock.EasyMock.createMock(EasyMock.java:104)
at org.apache.solr.handler.admin.TestCoreAdminApis.getCoreContainerMock(TestCoreAdminApis.java:76)
at org.apache.solr.handler.admin.TestCoreAdminApis.testCalls(TestCoreAdminApis.java:43)
at java.base/jdk.internal.reflect.NativeMethodAccessorImpl.invoke0(Native Method)
at java.base/jdk.internal.reflect.NativeMethodAccessorImpl.invoke(NativeMethodAccessorImpl.java:62)
at java.base/jdk.internal.reflect.DelegatingMethodAccessorImpl.invoke(DelegatingMethodAccessorImpl.java:43)
at java.base/java.lang.reflect.Method.invoke(Method.java:543)
at com.carrotsearch.randomizedtesting.RandomizedRunner.invoke(RandomizedRunner.java:1713)
at com.carrotsearch.randomizedtesting.RandomizedRunner$8.evaluate(RandomizedRunner.java:907)
at com.carrotsearch.randomizedtesting.RandomizedRunner$9.evaluate(RandomizedRunner.java:943)
at com.carrotsearch.randomizedtesting.RandomizedRunner$10.evaluate(RandomizedRunner.java:957)
at com.carrotsearch.randomizedtesting.rules.SystemPropertiesRestoreRule$1.evaluate(SystemPropertiesRestoreRule.java:57)
at org.apache.lucene.util.TestRuleSetupTeardownChained$1.evaluate(TestRuleSetupTeardownChained.java:49)
at org.apache.lucene.util.AbstractBeforeAfterRule$1.evaluate(AbstractBeforeAfterRule.java:45)
at org.apache.lucene.util.TestRuleThreadAndTestName$1.evaluate(TestRuleThreadAndTestName.java:48)
at org.apache.lucene.util.TestRuleIgnoreAfterMaxFailures$1.evaluate(TestRuleIgnoreAfterMaxFailures.java:64)
at org.apache.lucene.util.TestRuleMarkFailure$1.evaluate(TestRuleMarkFailure.java:47)
at com.carrotsearch.randomizedtesting.rules.StatementAdapter.evaluate(StatementAdapter.java:36)
at com.carrotsearch.randomizedtesting.ThreadLeakControl$StatementRunner.run(ThreadLeakControl.java:368)
at com.carrotsearch.randomizedtesting.ThreadLeakControl.forkTimeoutingTask(ThreadLeakControl.java:817)
at com.carrotsearch.randomizedtesting.ThreadLeakControl$3.evaluate(ThreadLeakControl.java:468)
at com.carrotsearch.randomizedtesting.RandomizedRunner.runSingleTest(RandomizedRunner.java:916)
at com.carrotsearch.randomizedtesting.RandomizedRunner$5.evaluate(RandomizedRunner.java:802)
at com.carrotsearch.randomizedtesting.RandomizedRunner$6.evaluate(RandomizedRunner.java:852)
at com.carrotsearch.randomizedtesting.RandomizedRunner$7.evaluate(RandomizedRunner.java:863)
at com.carrotsearch.randomizedtesting.rules.StatementAdapter.evaluate(StatementAdapter.java:36)
at com.carrotsearch.randomizedtesting.rules.SystemPropertiesRestoreRule$1.evaluate(SystemPropertiesRestoreRule.java:57)
at org.apache.lucene.util.AbstractBeforeAfterRule$1.evaluate(AbstractBeforeAfterRule.java:45)
at com.carrotsearch.randomizedtesting.rules.StatementAdapter.evaluate(StatementAdapter.java:36)
at org.apache.lucene.util.TestRuleStoreClassName$1.evaluate(TestRuleStoreClassName.java:41)
at com.carrotsearch.randomizedtesting.rules.NoShadowingOrOverridesOnMethodsRule$1.evaluate(NoShadowingOrOverridesOnMethodsRule.java:40)
at com.carrotsearch.randomizedtesting.rules.NoShadowingOrOverridesOnMethodsRule$1.evaluate(NoShadowingOrOverridesOnMethodsRule.java:40)
at com.carrotsearch.randomizedtesting.rules.StatementAdapter.evaluate(StatementAdapter.java:36)
at com.carrotsearch.randomizedtesting.rules.StatementAdapter.evaluate(StatementAdapter.java:36)
at org.apache.lucene.util.TestRuleAssertionsRequired$1.evaluate(TestRuleAssertionsRequired.java:53)
at org.apache.lucene.util.TestRuleMarkFailure$1.evaluate(TestRuleMarkFailure.java:47)
at org.apache.lucene.util.TestRuleIgnoreAfterMaxFailures$1.evaluate(TestRuleIgnoreAfterMaxFailures.java:64)
at org.apache.lucene.util.TestRuleIgnoreTestSuites$1.evaluate(TestRuleIgnoreTestSuites.java:54)
at com.carrotsearch.randomizedtesting.rules.StatementAdapter.evaluate(StatementAdapter.java:36)
at com.carrotsearch.randomizedtesting.ThreadLeakControl$StatementRunner.run(ThreadLeakControl.java:368)
at java.base/java.lang.Thread.run(Thread.java:844)
Caused by: java.lang.reflect.InaccessibleObjectException: Unable to make protected final java.lang.Class java.lang.ClassLoader.defineClass(java.lang.String,byte[],int,int,java.security.ProtectionDomain) throws java.lang.ClassFormatError accessible: module java.base does not "opens java.lang" to unnamed module @277f88ee
at java.base/java.lang.reflect.AccessibleObject.checkCanSetAccessible(AccessibleObject.java:207)
at java.base/java.lang.reflect.Method.checkCanSetAccessible(Method.java:192)
at java.base/java.lang.reflect.Method.setAccessible(Method.java:186)
at net.sf.cglib.core.ReflectUtils$2.run(ReflectUtils.java:56)
at java.base/java.security.AccessController.doPrivileged(Native Method)
at net.sf.cglib.core.ReflectUtils.<clinit>(ReflectUtils.java:46)
... 52 more
Build Log:
[...truncated 11590 lines...]
[junit4] Suite: org.apache.solr.handler.admin.TestCoreAdminApis
[junit4] 2> Creating dataDir: /home/jenkins/workspace/Lucene-Solr-master-Linux/solr/build/solr-core/test/J2/temp/solr.handler.admin.TestCoreAdminApis_7D9EC94F5DE52E79-001/init-core-data-001
[junit4] 2> 755335 INFO (SUITE-TestCoreAdminApis-seed#[7D9EC94F5DE52E79]-worker) [ ] o.a.s.SolrTestCaseJ4 Using TrieFields
[junit4] 2> 755338 INFO (SUITE-TestCoreAdminApis-seed#[7D9EC94F5DE52E79]-worker) [ ] o.a.s.SolrTestCaseJ4 Randomized ssl (true) and clientAuth (false) via: @org.apache.solr.util.RandomizeSSL(reason="", ssl=0.0/0.0, value=0.0/0.0, clientAuth=0.0/0.0)
[junit4] 2> 755341 INFO (TEST-TestCoreAdminApis.testCalls-seed#[7D9EC94F5DE52E79]) [ ] o.a.s.SolrTestCaseJ4 ###Starting testCalls
[junit4] 2> 755395 INFO (TEST-TestCoreAdminApis.testCalls-seed#[7D9EC94F5DE52E79]) [ ] o.a.s.SolrTestCaseJ4 ###Ending testCalls
[junit4] 2> NOTE: reproduce with: ant test -Dtestcase=TestCoreAdminApis -Dtests.method=testCalls -Dtests.seed=7D9EC94F5DE52E79 -Dtests.multiplier=3 -Dtests.slow=true -Dtests.locale=hy-AM -Dtests.timezone=America/Indiana/Tell_City -Dtests.asserts=true -Dtests.file.encoding=UTF-8
[junit4] ERROR 0.06s J2 | TestCoreAdminApis.testCalls <<<
[junit4] > Throwable #1: java.lang.ExceptionInInitializerError
[junit4] > at __randomizedtesting.SeedInfo.seed([7D9EC94F5DE52E79:4F5FD624D8699DDE]:0)
[junit4] > at net.sf.cglib.core.KeyFactory$Generator.generateClass(KeyFactory.java:166)
[junit4] > at net.sf.cglib.core.DefaultGeneratorStrategy.generate(DefaultGeneratorStrategy.java:25)
[junit4] > at net.sf.cglib.core.AbstractClassGenerator.create(AbstractClassGenerator.java:216)
[junit4] > at net.sf.cglib.core.KeyFactory$Generator.create(KeyFactory.java:144)
[junit4] > at net.sf.cglib.core.KeyFactory.create(KeyFactory.java:116)
[junit4] > at net.sf.cglib.core.KeyFactory.create(KeyFactory.java:108)
[junit4] > at net.sf.cglib.core.KeyFactory.create(KeyFactory.java:104)
[junit4] > at net.sf.cglib.proxy.Enhancer.<clinit>(Enhancer.java:69)
[junit4] > at org.easymock.internal.ClassProxyFactory.createEnhancer(ClassProxyFactory.java:259)
[junit4] > at org.easymock.internal.ClassProxyFactory.createProxy(ClassProxyFactory.java:174)
[junit4] > at org.easymock.internal.MocksControl.createMock(MocksControl.java:60)
[junit4] > at org.easymock.EasyMock.createMock(EasyMock.java:104)
[junit4] > at org.apache.solr.handler.admin.TestCoreAdminApis.getCoreContainerMock(TestCoreAdminApis.java:76)
[junit4] > at org.apache.solr.handler.admin.TestCoreAdminApis.testCalls(TestCoreAdminApis.java:43)
[junit4] > at java.base/jdk.internal.reflect.NativeMethodAccessorImpl.invoke0(Native Method)
[junit4] > at java.base/jdk.internal.reflect.NativeMethodAccessorImpl.invoke(NativeMethodAccessorImpl.java:62)
[junit4] > at java.base/jdk.internal.reflect.DelegatingMethodAccessorImpl.invoke(DelegatingMethodAccessorImpl.java:43)
[junit4] > at java.base/java.lang.reflect.Method.invoke(Method.java:543)
[junit4] > at java.base/java.lang.Thread.run(Thread.java:844)
[junit4] > Caused by: java.lang.reflect.InaccessibleObjectException: Unable to make protected final java.lang.Class java.lang.ClassLoader.defineClass(java.lang.String,byte[],int,int,java.security.ProtectionDomain) throws java.lang.ClassFormatError accessible: module java.base does not "opens java.lang" to unnamed module @277f88ee
[junit4] > at java.base/java.lang.reflect.AccessibleObject.checkCanSetAccessible(AccessibleObject.java:207)
[junit4] > at java.base/java.lang.reflect.Method.checkCanSetAccessible(Method.java:192)
[junit4] > at java.base/java.lang.reflect.Method.setAccessible(Method.java:186)
[junit4] > at net.sf.cglib.core.ReflectUtils$2.run(ReflectUtils.java:56)
[junit4] > at java.base/java.security.AccessController.doPrivileged(Native Method)
[junit4] > at net.sf.cglib.core.ReflectUtils.<clinit>(ReflectUtils.java:46)
[junit4] > ... 52 more
[junit4] 2> 755397 INFO (SUITE-TestCoreAdminApis-seed#[7D9EC94F5DE52E79]-worker) [ ] o.a.s.SolrTestCaseJ4 ###deleteCore
[junit4] 2> NOTE: leaving temporary files on disk at: /home/jenkins/workspace/Lucene-Solr-master-Linux/solr/build/solr-core/test/J2/temp/solr.handler.admin.TestCoreAdminApis_7D9EC94F5DE52E79-001
[junit4] 2> NOTE: test params are: codec=CheapBastard, sim=RandomSimilarity(queryNorm=false): {}, locale=hy-AM, timezone=America/Indiana/Tell_City
[junit4] 2> NOTE: Linux 4.4.0-53-generic amd64/Oracle Corporation 9-ea (64-bit)/cpus=12,threads=1,free=435834800,total=536870912
[junit4] 2> NOTE: All tests run in this JVM: [AnalyticsMergeStrategyTest, TlogReplayBufferedWhileIndexingTest, TestManagedSchemaThreadSafety, ClassificationUpdateProcessorFactoryTest, UpdateParamsTest, BlockJoinFacetDistribTest, CoreMergeIndexesAdminHandlerTest, TestComplexPhraseLeadingWildcard, TestCSVResponseWriter, TestDocTermOrds, TestIBSimilarityFactory, WrapperMergePolicyFactoryTest, PreAnalyzedFieldManagedSchemaCloudTest, TestCloudManagedSchema, CustomCollectionTest, FullHLLTest, SolrXmlInZkTest, TestTolerantSearch, TestDocBasedVersionConstraints, SimpleCollectionCreateDeleteTest, SubstringBytesRefFilterTest, TestRestoreCore, TestImpersonationWithHadoopAuth, TestPHPSerializedResponseWriter, FullSolrCloudDistribCmdsTest, TestClassicSimilarityFactory, SparseHLLTest, TestOrdValues, TestExtendedDismaxParser, SuggesterWFSTTest, TestSolrJ, ShowFileRequestHandlerTest, TestSort, RequestHandlersTest, SynonymTokenizerTest, TestPivotHelperCode, TestLeaderElectionWithEmptyReplica, TestSolrQueryParserDefaultOperatorResource, OverseerRolesTest, TestGroupingSearch, TestConfigSets, TestSubQueryTransformer, TestFieldCacheVsDocValues, SecurityConfHandlerTest, ResourceLoaderTest, TestMacroExpander, BaseCdcrDistributedZkTest, BooleanFieldTest, TestFastOutputStream, TestDownShardTolerantSearch, TestPerFieldSimilarityWithDefaultOverride, TestSmileRequest, TermVectorComponentDistributedTest, SolrGraphiteReporterTest, TestQuerySenderNoQuery, TestBulkSchemaAPI, HdfsUnloadDistributedZkTest, UUIDUpdateProcessorFallbackTest, BasicDistributedZk2Test, ReplaceNodeTest, PrimitiveFieldTypeTest, TestCoreDiscovery, DistributedFacetPivotSmallAdvancedTest, HighlighterMaxOffsetTest, LukeRequestHandlerTest, TestCollationFieldDocValues, TestSolrCloudWithSecureImpersonation, ShufflingReplicaListTransformerTest, TestTestInjection, AddBlockUpdateTest, TestBlendedInfixSuggestions, BadIndexSchemaTest, PKIAuthenticationIntegrationTest, MissingSegmentRecoveryTest, TestZkChroot, TestDefaultSearchFieldResource, TestLMDirichletSimilarityFactory, TestTrieFacet, URLClassifyProcessorTest, TestStressLiveNodes, SuggesterTSTTest, TestConfig, ResponseHeaderTest, TestIndexSearcher, DateFieldTest, TestCollationField, TestSolrQueryParser, VersionInfoTest, DirectUpdateHandlerTest, TestRandomFlRTGCloud, TestCloudInspectUtil, TestJsonFacetRefinement, TestShardHandlerFactory, CloneFieldUpdateProcessorFactoryTest, ConfigSetsAPITest, LeaderInitiatedRecoveryOnCommitTest, PeerSyncReplicationTest, CoreSorterTest, JvmMetricsTest, TestSchemaSimilarityResource, TestDocSet, DistributedQueryComponentCustomSortTest, TestReloadDeadlock, StatsComponentTest, TestConfigOverlay, BlobRepositoryCloudTest, SolrTestCaseJ4Test, TestFieldCollectionResource, TestFieldSortValues, TestJavabinTupleStreamParser, GraphQueryTest, TestCoreAdminApis]
[junit4] Completed [268/694 (1!)] on J2 in 0.12s, 1 test, 1 error <<< FAILURES!
[...truncated 1096 lines...]
[junit4] Suite: org.apache.solr.handler.admin.TestApiFramework
[junit4] 2> Creating dataDir: /home/jenkins/workspace/Lucene-Solr-master-Linux/solr/build/solr-core/test/J2/temp/solr.handler.admin.TestApiFramework_7D9EC94F5DE52E79-001/init-core-data-001
[junit4] 2> 2115254 INFO (SUITE-TestApiFramework-seed#[7D9EC94F5DE52E79]-worker) [ ] o.a.s.SolrTestCaseJ4 Using PointFields
[junit4] 2> 2115255 INFO (SUITE-TestApiFramework-seed#[7D9EC94F5DE52E79]-worker) [ ] o.a.s.SolrTestCaseJ4 Randomized ssl (true) and clientAuth (true) via: @org.apache.solr.util.RandomizeSSL(reason="", ssl=0.0/0.0, value=0.0/0.0, clientAuth=0.0/0.0)
[junit4] 2> 2115258 INFO (TEST-TestApiFramework.testFramework-seed#[7D9EC94F5DE52E79]) [ ] o.a.s.SolrTestCaseJ4 ###Starting testFramework
[junit4] 2> 2115259 INFO (TEST-TestApiFramework.testFramework-seed#[7D9EC94F5DE52E79]) [ ] o.a.s.SolrTestCaseJ4 ###Ending testFramework
[junit4] 2> NOTE: reproduce with: ant test -Dtestcase=TestApiFramework -Dtests.method=testFramework -Dtests.seed=7D9EC94F5DE52E79 -Dtests.multiplier=3 -Dtests.slow=true -Dtests.locale=fur-IT -Dtests.timezone=Asia/Macau -Dtests.asserts=true -Dtests.file.encoding=UTF-8
[junit4] ERROR 0.00s J2 | TestApiFramework.testFramework <<<
[junit4] > Throwable #1: java.lang.NoClassDefFoundError: Could not initialize class org.easymock.internal.ClassProxyFactory$2
[junit4] > at __randomizedtesting.SeedInfo.seed([7D9EC94F5DE52E79:6AE803685B31C244]:0)
[junit4] > at org.easymock.internal.ClassProxyFactory.createEnhancer(ClassProxyFactory.java:259)
[junit4] > at org.easymock.internal.ClassProxyFactory.createProxy(ClassProxyFactory.java:174)
[junit4] > at org.easymock.internal.MocksControl.createMock(MocksControl.java:60)
[junit4] > at org.easymock.EasyMock.createMock(EasyMock.java:104)
[junit4] > at org.apache.solr.handler.admin.TestCoreAdminApis.getCoreContainerMock(TestCoreAdminApis.java:76)
[junit4] > at org.apache.solr.handler.admin.TestApiFramework.testFramework(TestApiFramework.java:59)
[junit4] > at java.base/jdk.internal.reflect.NativeMethodAccessorImpl.invoke0(Native Method)
[junit4] > at java.base/jdk.internal.reflect.NativeMethodAccessorImpl.invoke(NativeMethodAccessorImpl.java:62)
[junit4] > at java.base/jdk.internal.reflect.DelegatingMethodAccessorImpl.invoke(DelegatingMethodAccessorImpl.java:43)
[junit4] > at java.base/java.lang.reflect.Method.invoke(Method.java:543)
[junit4] > at java.base/java.lang.Thread.run(Thread.java:844)
[junit4] 2> 2115260 INFO (TEST-TestApiFramework.testTrailingTemplatePaths-seed#[7D9EC94F5DE52E79]) [ ] o.a.s.SolrTestCaseJ4 ###Starting testTrailingTemplatePaths
[junit4] 2> 2115261 INFO (TEST-TestApiFramework.testTrailingTemplatePaths-seed#[7D9EC94F5DE52E79]) [ ] o.a.s.SolrTestCaseJ4 ###Ending testTrailingTemplatePaths
[junit4] 2> 2115261 INFO (SUITE-TestApiFramework-seed#[7D9EC94F5DE52E79]-worker) [ ] o.a.s.SolrTestCaseJ4 ###deleteCore
[junit4] 2> NOTE: leaving temporary files on disk at: /home/jenkins/workspace/Lucene-Solr-master-Linux/solr/build/solr-core/test/J2/temp/solr.handler.admin.TestApiFramework_7D9EC94F5DE52E79-001
[junit4] 2> NOTE: test params are: codec=Asserting(Lucene70): {}, docValues:{}, maxPointsInLeafNode=1164, maxMBSortInHeap=6.274211925064918, sim=RandomSimilarity(queryNorm=true): {}, locale=fur-IT, timezone=Asia/Macau
[junit4] 2> NOTE: Linux 4.4.0-53-generic amd64/Oracle Corporation 9-ea (64-bit)/cpus=12,threads=1,free=188432312,total=536870912
[junit4] 2> NOTE: All tests run in this JVM: [AnalyticsMergeStrategyTest, TlogReplayBufferedWhileIndexingTest, TestManagedSchemaThreadSafety, ClassificationUpdateProcessorFactoryTest, UpdateParamsTest, BlockJoinFacetDistribTest, CoreMergeIndexesAdminHandlerTest, TestComplexPhraseLeadingWildcard, TestCSVResponseWriter, TestDocTermOrds, TestIBSimilarityFactory, WrapperMergePolicyFactoryTest, PreAnalyzedFieldManagedSchemaCloudTest, TestCloudManagedSchema, CustomCollectionTest, FullHLLTest, SolrXmlInZkTest, TestTolerantSearch, TestDocBasedVersionConstraints, SimpleCollectionCreateDeleteTest, SubstringBytesRefFilterTest, TestRestoreCore, TestImpersonationWithHadoopAuth, TestPHPSerializedResponseWriter, FullSolrCloudDistribCmdsTest, TestClassicSimilarityFactory, SparseHLLTest, TestOrdValues, TestExtendedDismaxParser, SuggesterWFSTTest, TestSolrJ, ShowFileRequestHandlerTest, TestSort, RequestHandlersTest, SynonymTokenizerTest, TestPivotHelperCode, TestLeaderElectionWithEmptyReplica, TestSolrQueryParserDefaultOperatorResource, OverseerRolesTest, TestGroupingSearch, TestConfigSets, TestSubQueryTransformer, TestFieldCacheVsDocValues, SecurityConfHandlerTest, ResourceLoaderTest, TestMacroExpander, BaseCdcrDistributedZkTest, BooleanFieldTest, TestFastOutputStream, TestDownShardTolerantSearch, TestPerFieldSimilarityWithDefaultOverride, TestSmileRequest, TermVectorComponentDistributedTest, SolrGraphiteReporterTest, TestQuerySenderNoQuery, TestBulkSchemaAPI, HdfsUnloadDistributedZkTest, UUIDUpdateProcessorFallbackTest, BasicDistributedZk2Test, ReplaceNodeTest, PrimitiveFieldTypeTest, TestCoreDiscovery, DistributedFacetPivotSmallAdvancedTest, HighlighterMaxOffsetTest, LukeRequestHandlerTest, TestCollationFieldDocValues, TestSolrCloudWithSecureImpersonation, ShufflingReplicaListTransformerTest, TestTestInjection, AddBlockUpdateTest, TestBlendedInfixSuggestions, BadIndexSchemaTest, PKIAuthenticationIntegrationTest, MissingSegmentRecoveryTest, TestZkChroot, TestDefaultSearchFieldResource, TestLMDirichletSimilarityFactory, TestTrieFacet, URLClassifyProcessorTest, TestStressLiveNodes, SuggesterTSTTest, TestConfig, ResponseHeaderTest, TestIndexSearcher, DateFieldTest, TestCollationField, TestSolrQueryParser, VersionInfoTest, DirectUpdateHandlerTest, TestRandomFlRTGCloud, TestCloudInspectUtil, TestJsonFacetRefinement, TestShardHandlerFactory, CloneFieldUpdateProcessorFactoryTest, ConfigSetsAPITest, LeaderInitiatedRecoveryOnCommitTest, PeerSyncReplicationTest, CoreSorterTest, JvmMetricsTest, TestSchemaSimilarityResource, TestDocSet, DistributedQueryComponentCustomSortTest, TestReloadDeadlock, StatsComponentTest, TestConfigOverlay, BlobRepositoryCloudTest, SolrTestCaseJ4Test, TestFieldCollectionResource, TestFieldSortValues, TestJavabinTupleStreamParser, GraphQueryTest, TestCoreAdminApis, LeaderElectionContextKeyTest, ChaosMonkeySafeLeaderTest, UnloadDistributedZkTest, SyncSliceTest, OverseerTest, BasicZkTest, RecoveryZkTest, TestReplicationHandler, TestRandomDVFaceting, TestRecovery, TestStressReorder, HardAutoCommitTest, SimpleFacetsTest, TestSolr4Spatial, QueryElevationComponentTest, CurrencyFieldXmlFileTest, SolrIndexSplitterTest, AnalysisAfterCoreReloadTest, CoreAdminHandlerTest, NoCacheHeaderTest, WordBreakSolrSpellCheckerTest, SolrCoreCheckLockOnStartupTest, TestAtomicUpdateErrorCases, DefaultValueUpdateProcessorTest, SortByFunctionTest, DocValuesMultiTest, TestSolrDeletionPolicy1, IndexBasedSpellCheckerTest, TestReversedWildcardFilterFactory, TestOmitPositions, DocumentBuilderTest, PathHierarchyTokenizerFactoryTest, TestIndexingPerformance, FieldAnalysisRequestHandlerTest, SolrPluginUtilsTest, UniqFieldsUpdateProcessorFactoryTest, TestPartialUpdateDeduplication, SearchHandlerTest, TestBinaryField, MinimalSchemaTest, TestFuzzyAnalyzedSuggestions, DirectSolrConnectionTest, TestLuceneMatchVersion, SpellPossibilityIteratorTest, TestCodecSupport, PluginInfoTest, TestFastLRUCache, PreAnalyzedFieldTest, TestUtils, SliceStateTest, CircularListTest, TestRTGBase, TestDistributedMissingSort, TestEmbeddedSolrServerConstructors, TestJettySolrRunner, ConnectionReuseTest, CdcrBootstrapTest, CreateCollectionCleanupTest, DeleteReplicaTest, DistribJoinFromCollectionTest, MigrateRouteKeyTest, OverriddenZkACLAndCredentialsProvidersTest, OverseerTaskQueueTest, ShardSplitTest, TestHdfsBackupRestoreCore, TestReplicationHandlerBackup, V2ApiIntegrationTest, CoreAdminRequestStatusTest, StatsReloadRaceTest, TestApiFramework]
[junit4] Completed [583/694 (2!)] on J2 in 0.02s, 2 tests, 1 error <<< FAILURES!
[...truncated 51965 lines...]
[JENKINS-EA] Lucene-Solr-master-Linux (64bit/jdk-9-ea+155) - Build
# 18948 - Still Unstable!
Posted by Policeman Jenkins Server <je...@thetaphi.de>.
Build: https://jenkins.thetaphi.de/job/Lucene-Solr-master-Linux/18948/
Java: 64bit/jdk-9-ea+155 -XX:+UseCompressedOops -XX:+UseConcMarkSweepGC
2 tests failed.
FAILED: org.apache.solr.handler.admin.TestApiFramework.testFramework
Error Message:
Stack Trace:
java.lang.ExceptionInInitializerError
at __randomizedtesting.SeedInfo.seed([2B4EF0651B7E92BF:3C383A421DAA7E82]:0)
at net.sf.cglib.core.KeyFactory$Generator.generateClass(KeyFactory.java:166)
at net.sf.cglib.core.DefaultGeneratorStrategy.generate(DefaultGeneratorStrategy.java:25)
at net.sf.cglib.core.AbstractClassGenerator.create(AbstractClassGenerator.java:216)
at net.sf.cglib.core.KeyFactory$Generator.create(KeyFactory.java:144)
at net.sf.cglib.core.KeyFactory.create(KeyFactory.java:116)
at net.sf.cglib.core.KeyFactory.create(KeyFactory.java:108)
at net.sf.cglib.core.KeyFactory.create(KeyFactory.java:104)
at net.sf.cglib.proxy.Enhancer.<clinit>(Enhancer.java:69)
at org.easymock.internal.ClassProxyFactory.createEnhancer(ClassProxyFactory.java:259)
at org.easymock.internal.ClassProxyFactory.createProxy(ClassProxyFactory.java:174)
at org.easymock.internal.MocksControl.createMock(MocksControl.java:60)
at org.easymock.EasyMock.createMock(EasyMock.java:104)
at org.apache.solr.handler.admin.TestCoreAdminApis.getCoreContainerMock(TestCoreAdminApis.java:76)
at org.apache.solr.handler.admin.TestApiFramework.testFramework(TestApiFramework.java:59)
at java.base/jdk.internal.reflect.NativeMethodAccessorImpl.invoke0(Native Method)
at java.base/jdk.internal.reflect.NativeMethodAccessorImpl.invoke(NativeMethodAccessorImpl.java:62)
at java.base/jdk.internal.reflect.DelegatingMethodAccessorImpl.invoke(DelegatingMethodAccessorImpl.java:43)
at java.base/java.lang.reflect.Method.invoke(Method.java:543)
at com.carrotsearch.randomizedtesting.RandomizedRunner.invoke(RandomizedRunner.java:1713)
at com.carrotsearch.randomizedtesting.RandomizedRunner$8.evaluate(RandomizedRunner.java:907)
at com.carrotsearch.randomizedtesting.RandomizedRunner$9.evaluate(RandomizedRunner.java:943)
at com.carrotsearch.randomizedtesting.RandomizedRunner$10.evaluate(RandomizedRunner.java:957)
at com.carrotsearch.randomizedtesting.rules.SystemPropertiesRestoreRule$1.evaluate(SystemPropertiesRestoreRule.java:57)
at org.apache.lucene.util.TestRuleSetupTeardownChained$1.evaluate(TestRuleSetupTeardownChained.java:49)
at org.apache.lucene.util.AbstractBeforeAfterRule$1.evaluate(AbstractBeforeAfterRule.java:45)
at org.apache.lucene.util.TestRuleThreadAndTestName$1.evaluate(TestRuleThreadAndTestName.java:48)
at org.apache.lucene.util.TestRuleIgnoreAfterMaxFailures$1.evaluate(TestRuleIgnoreAfterMaxFailures.java:64)
at org.apache.lucene.util.TestRuleMarkFailure$1.evaluate(TestRuleMarkFailure.java:47)
at com.carrotsearch.randomizedtesting.rules.StatementAdapter.evaluate(StatementAdapter.java:36)
at com.carrotsearch.randomizedtesting.ThreadLeakControl$StatementRunner.run(ThreadLeakControl.java:368)
at com.carrotsearch.randomizedtesting.ThreadLeakControl.forkTimeoutingTask(ThreadLeakControl.java:817)
at com.carrotsearch.randomizedtesting.ThreadLeakControl$3.evaluate(ThreadLeakControl.java:468)
at com.carrotsearch.randomizedtesting.RandomizedRunner.runSingleTest(RandomizedRunner.java:916)
at com.carrotsearch.randomizedtesting.RandomizedRunner$5.evaluate(RandomizedRunner.java:802)
at com.carrotsearch.randomizedtesting.RandomizedRunner$6.evaluate(RandomizedRunner.java:852)
at com.carrotsearch.randomizedtesting.RandomizedRunner$7.evaluate(RandomizedRunner.java:863)
at com.carrotsearch.randomizedtesting.rules.StatementAdapter.evaluate(StatementAdapter.java:36)
at com.carrotsearch.randomizedtesting.rules.SystemPropertiesRestoreRule$1.evaluate(SystemPropertiesRestoreRule.java:57)
at org.apache.lucene.util.AbstractBeforeAfterRule$1.evaluate(AbstractBeforeAfterRule.java:45)
at com.carrotsearch.randomizedtesting.rules.StatementAdapter.evaluate(StatementAdapter.java:36)
at org.apache.lucene.util.TestRuleStoreClassName$1.evaluate(TestRuleStoreClassName.java:41)
at com.carrotsearch.randomizedtesting.rules.NoShadowingOrOverridesOnMethodsRule$1.evaluate(NoShadowingOrOverridesOnMethodsRule.java:40)
at com.carrotsearch.randomizedtesting.rules.NoShadowingOrOverridesOnMethodsRule$1.evaluate(NoShadowingOrOverridesOnMethodsRule.java:40)
at com.carrotsearch.randomizedtesting.rules.StatementAdapter.evaluate(StatementAdapter.java:36)
at com.carrotsearch.randomizedtesting.rules.StatementAdapter.evaluate(StatementAdapter.java:36)
at org.apache.lucene.util.TestRuleAssertionsRequired$1.evaluate(TestRuleAssertionsRequired.java:53)
at org.apache.lucene.util.TestRuleMarkFailure$1.evaluate(TestRuleMarkFailure.java:47)
at org.apache.lucene.util.TestRuleIgnoreAfterMaxFailures$1.evaluate(TestRuleIgnoreAfterMaxFailures.java:64)
at org.apache.lucene.util.TestRuleIgnoreTestSuites$1.evaluate(TestRuleIgnoreTestSuites.java:54)
at com.carrotsearch.randomizedtesting.rules.StatementAdapter.evaluate(StatementAdapter.java:36)
at com.carrotsearch.randomizedtesting.ThreadLeakControl$StatementRunner.run(ThreadLeakControl.java:368)
at java.base/java.lang.Thread.run(Thread.java:844)
Caused by: java.lang.reflect.InaccessibleObjectException: Unable to make protected final java.lang.Class java.lang.ClassLoader.defineClass(java.lang.String,byte[],int,int,java.security.ProtectionDomain) throws java.lang.ClassFormatError accessible: module java.base does not "opens java.lang" to unnamed module @1027a4b0
at java.base/java.lang.reflect.AccessibleObject.checkCanSetAccessible(AccessibleObject.java:207)
at java.base/java.lang.reflect.Method.checkCanSetAccessible(Method.java:192)
at java.base/java.lang.reflect.Method.setAccessible(Method.java:186)
at net.sf.cglib.core.ReflectUtils$2.run(ReflectUtils.java:56)
at java.base/java.security.AccessController.doPrivileged(Native Method)
at net.sf.cglib.core.ReflectUtils.<clinit>(ReflectUtils.java:46)
... 52 more
FAILED: org.apache.solr.handler.admin.TestCoreAdminApis.testCalls
Error Message:
Stack Trace:
java.lang.ExceptionInInitializerError
at __randomizedtesting.SeedInfo.seed([2B4EF0651B7E92BF:198FEF0E9EF22118]:0)
at net.sf.cglib.core.KeyFactory$Generator.generateClass(KeyFactory.java:166)
at net.sf.cglib.core.DefaultGeneratorStrategy.generate(DefaultGeneratorStrategy.java:25)
at net.sf.cglib.core.AbstractClassGenerator.create(AbstractClassGenerator.java:216)
at net.sf.cglib.core.KeyFactory$Generator.create(KeyFactory.java:144)
at net.sf.cglib.core.KeyFactory.create(KeyFactory.java:116)
at net.sf.cglib.core.KeyFactory.create(KeyFactory.java:108)
at net.sf.cglib.core.KeyFactory.create(KeyFactory.java:104)
at net.sf.cglib.proxy.Enhancer.<clinit>(Enhancer.java:69)
at org.easymock.internal.ClassProxyFactory.createEnhancer(ClassProxyFactory.java:259)
at org.easymock.internal.ClassProxyFactory.createProxy(ClassProxyFactory.java:174)
at org.easymock.internal.MocksControl.createMock(MocksControl.java:60)
at org.easymock.EasyMock.createMock(EasyMock.java:104)
at org.apache.solr.handler.admin.TestCoreAdminApis.getCoreContainerMock(TestCoreAdminApis.java:76)
at org.apache.solr.handler.admin.TestCoreAdminApis.testCalls(TestCoreAdminApis.java:43)
at java.base/jdk.internal.reflect.NativeMethodAccessorImpl.invoke0(Native Method)
at java.base/jdk.internal.reflect.NativeMethodAccessorImpl.invoke(NativeMethodAccessorImpl.java:62)
at java.base/jdk.internal.reflect.DelegatingMethodAccessorImpl.invoke(DelegatingMethodAccessorImpl.java:43)
at java.base/java.lang.reflect.Method.invoke(Method.java:543)
at com.carrotsearch.randomizedtesting.RandomizedRunner.invoke(RandomizedRunner.java:1713)
at com.carrotsearch.randomizedtesting.RandomizedRunner$8.evaluate(RandomizedRunner.java:907)
at com.carrotsearch.randomizedtesting.RandomizedRunner$9.evaluate(RandomizedRunner.java:943)
at com.carrotsearch.randomizedtesting.RandomizedRunner$10.evaluate(RandomizedRunner.java:957)
at com.carrotsearch.randomizedtesting.rules.SystemPropertiesRestoreRule$1.evaluate(SystemPropertiesRestoreRule.java:57)
at org.apache.lucene.util.TestRuleSetupTeardownChained$1.evaluate(TestRuleSetupTeardownChained.java:49)
at org.apache.lucene.util.AbstractBeforeAfterRule$1.evaluate(AbstractBeforeAfterRule.java:45)
at org.apache.lucene.util.TestRuleThreadAndTestName$1.evaluate(TestRuleThreadAndTestName.java:48)
at org.apache.lucene.util.TestRuleIgnoreAfterMaxFailures$1.evaluate(TestRuleIgnoreAfterMaxFailures.java:64)
at org.apache.lucene.util.TestRuleMarkFailure$1.evaluate(TestRuleMarkFailure.java:47)
at com.carrotsearch.randomizedtesting.rules.StatementAdapter.evaluate(StatementAdapter.java:36)
at com.carrotsearch.randomizedtesting.ThreadLeakControl$StatementRunner.run(ThreadLeakControl.java:368)
at com.carrotsearch.randomizedtesting.ThreadLeakControl.forkTimeoutingTask(ThreadLeakControl.java:817)
at com.carrotsearch.randomizedtesting.ThreadLeakControl$3.evaluate(ThreadLeakControl.java:468)
at com.carrotsearch.randomizedtesting.RandomizedRunner.runSingleTest(RandomizedRunner.java:916)
at com.carrotsearch.randomizedtesting.RandomizedRunner$5.evaluate(RandomizedRunner.java:802)
at com.carrotsearch.randomizedtesting.RandomizedRunner$6.evaluate(RandomizedRunner.java:852)
at com.carrotsearch.randomizedtesting.RandomizedRunner$7.evaluate(RandomizedRunner.java:863)
at com.carrotsearch.randomizedtesting.rules.StatementAdapter.evaluate(StatementAdapter.java:36)
at com.carrotsearch.randomizedtesting.rules.SystemPropertiesRestoreRule$1.evaluate(SystemPropertiesRestoreRule.java:57)
at org.apache.lucene.util.AbstractBeforeAfterRule$1.evaluate(AbstractBeforeAfterRule.java:45)
at com.carrotsearch.randomizedtesting.rules.StatementAdapter.evaluate(StatementAdapter.java:36)
at org.apache.lucene.util.TestRuleStoreClassName$1.evaluate(TestRuleStoreClassName.java:41)
at com.carrotsearch.randomizedtesting.rules.NoShadowingOrOverridesOnMethodsRule$1.evaluate(NoShadowingOrOverridesOnMethodsRule.java:40)
at com.carrotsearch.randomizedtesting.rules.NoShadowingOrOverridesOnMethodsRule$1.evaluate(NoShadowingOrOverridesOnMethodsRule.java:40)
at com.carrotsearch.randomizedtesting.rules.StatementAdapter.evaluate(StatementAdapter.java:36)
at com.carrotsearch.randomizedtesting.rules.StatementAdapter.evaluate(StatementAdapter.java:36)
at org.apache.lucene.util.TestRuleAssertionsRequired$1.evaluate(TestRuleAssertionsRequired.java:53)
at org.apache.lucene.util.TestRuleMarkFailure$1.evaluate(TestRuleMarkFailure.java:47)
at org.apache.lucene.util.TestRuleIgnoreAfterMaxFailures$1.evaluate(TestRuleIgnoreAfterMaxFailures.java:64)
at org.apache.lucene.util.TestRuleIgnoreTestSuites$1.evaluate(TestRuleIgnoreTestSuites.java:54)
at com.carrotsearch.randomizedtesting.rules.StatementAdapter.evaluate(StatementAdapter.java:36)
at com.carrotsearch.randomizedtesting.ThreadLeakControl$StatementRunner.run(ThreadLeakControl.java:368)
at java.base/java.lang.Thread.run(Thread.java:844)
Caused by: java.lang.reflect.InaccessibleObjectException: Unable to make protected final java.lang.Class java.lang.ClassLoader.defineClass(java.lang.String,byte[],int,int,java.security.ProtectionDomain) throws java.lang.ClassFormatError accessible: module java.base does not "opens java.lang" to unnamed module @3bd029dd
at java.base/java.lang.reflect.AccessibleObject.checkCanSetAccessible(AccessibleObject.java:207)
at java.base/java.lang.reflect.Method.checkCanSetAccessible(Method.java:192)
at java.base/java.lang.reflect.Method.setAccessible(Method.java:186)
at net.sf.cglib.core.ReflectUtils$2.run(ReflectUtils.java:56)
at java.base/java.security.AccessController.doPrivileged(Native Method)
at net.sf.cglib.core.ReflectUtils.<clinit>(ReflectUtils.java:46)
... 52 more
Build Log:
[...truncated 1669 lines...]
[junit4] JVM J1: stderr was not empty, see: /home/jenkins/workspace/Lucene-Solr-master-Linux/lucene/build/core/test/temp/junit4-J1-20170212_133124_49916509431451318053301.syserr
[junit4] >>> JVM J1 emitted unexpected output (verbatim) ----
[junit4] Java HotSpot(TM) 64-Bit Server VM warning: Option UseConcMarkSweepGC was deprecated in version 9.0 and will likely be removed in a future release.
[junit4] <<< JVM J1: EOF ----
[...truncated 5 lines...]
[junit4] JVM J0: stderr was not empty, see: /home/jenkins/workspace/Lucene-Solr-master-Linux/lucene/build/core/test/temp/junit4-J0-20170212_133124_49817800606699273277600.syserr
[junit4] >>> JVM J0 emitted unexpected output (verbatim) ----
[junit4] Java HotSpot(TM) 64-Bit Server VM warning: Option UseConcMarkSweepGC was deprecated in version 9.0 and will likely be removed in a future release.
[junit4] <<< JVM J0: EOF ----
[...truncated 3 lines...]
[junit4] JVM J2: stderr was not empty, see: /home/jenkins/workspace/Lucene-Solr-master-Linux/lucene/build/core/test/temp/junit4-J2-20170212_133124_49818319944808948186210.syserr
[junit4] >>> JVM J2 emitted unexpected output (verbatim) ----
[junit4] Java HotSpot(TM) 64-Bit Server VM warning: Option UseConcMarkSweepGC was deprecated in version 9.0 and will likely be removed in a future release.
[junit4] <<< JVM J2: EOF ----
[...truncated 286 lines...]
[junit4] JVM J2: stderr was not empty, see: /home/jenkins/workspace/Lucene-Solr-master-Linux/lucene/build/test-framework/test/temp/junit4-J2-20170212_133945_38510512523970877933726.syserr
[junit4] >>> JVM J2 emitted unexpected output (verbatim) ----
[junit4] Java HotSpot(TM) 64-Bit Server VM warning: Option UseConcMarkSweepGC was deprecated in version 9.0 and will likely be removed in a future release.
[junit4] <<< JVM J2: EOF ----
[junit4] JVM J0: stderr was not empty, see: /home/jenkins/workspace/Lucene-Solr-master-Linux/lucene/build/test-framework/test/temp/junit4-J0-20170212_133945_38516554716675216887303.syserr
[junit4] >>> JVM J0 emitted unexpected output (verbatim) ----
[junit4] Java HotSpot(TM) 64-Bit Server VM warning: Option UseConcMarkSweepGC was deprecated in version 9.0 and will likely be removed in a future release.
[junit4] <<< JVM J0: EOF ----
[...truncated 3 lines...]
[junit4] JVM J1: stderr was not empty, see: /home/jenkins/workspace/Lucene-Solr-master-Linux/lucene/build/test-framework/test/temp/junit4-J1-20170212_133945_3858140574620879769020.syserr
[junit4] >>> JVM J1 emitted unexpected output (verbatim) ----
[junit4] Java HotSpot(TM) 64-Bit Server VM warning: Option UseConcMarkSweepGC was deprecated in version 9.0 and will likely be removed in a future release.
[junit4] <<< JVM J1: EOF ----
[...truncated 1024 lines...]
[junit4] JVM J0: stderr was not empty, see: /home/jenkins/workspace/Lucene-Solr-master-Linux/lucene/build/analysis/common/test/temp/junit4-J0-20170212_134316_75810356359385942500693.syserr
[junit4] >>> JVM J0 emitted unexpected output (verbatim) ----
[junit4] Java HotSpot(TM) 64-Bit Server VM warning: Option UseConcMarkSweepGC was deprecated in version 9.0 and will likely be removed in a future release.
[junit4] <<< JVM J0: EOF ----
[...truncated 3 lines...]
[junit4] JVM J1: stderr was not empty, see: /home/jenkins/workspace/Lucene-Solr-master-Linux/lucene/build/analysis/common/test/temp/junit4-J1-20170212_134316_75815557460063240116801.syserr
[junit4] >>> JVM J1 emitted unexpected output (verbatim) ----
[junit4] Java HotSpot(TM) 64-Bit Server VM warning: Option UseConcMarkSweepGC was deprecated in version 9.0 and will likely be removed in a future release.
[junit4] <<< JVM J1: EOF ----
[...truncated 3 lines...]
[junit4] JVM J2: stderr was not empty, see: /home/jenkins/workspace/Lucene-Solr-master-Linux/lucene/build/analysis/common/test/temp/junit4-J2-20170212_134316_7591405484394375560653.syserr
[junit4] >>> JVM J2 emitted unexpected output (verbatim) ----
[junit4] Java HotSpot(TM) 64-Bit Server VM warning: Option UseConcMarkSweepGC was deprecated in version 9.0 and will likely be removed in a future release.
[junit4] <<< JVM J2: EOF ----
[...truncated 207 lines...]
[junit4] JVM J2: stderr was not empty, see: /home/jenkins/workspace/Lucene-Solr-master-Linux/lucene/build/analysis/icu/test/temp/junit4-J2-20170212_134549_58310639194046830317900.syserr
[junit4] >>> JVM J2 emitted unexpected output (verbatim) ----
[junit4] Java HotSpot(TM) 64-Bit Server VM warning: Option UseConcMarkSweepGC was deprecated in version 9.0 and will likely be removed in a future release.
[junit4] <<< JVM J2: EOF ----
[...truncated 3 lines...]
[junit4] JVM J1: stderr was not empty, see: /home/jenkins/workspace/Lucene-Solr-master-Linux/lucene/build/analysis/icu/test/temp/junit4-J1-20170212_134549_5804276444161928060227.syserr
[junit4] >>> JVM J1 emitted unexpected output (verbatim) ----
[junit4] Java HotSpot(TM) 64-Bit Server VM warning: Option UseConcMarkSweepGC was deprecated in version 9.0 and will likely be removed in a future release.
[junit4] <<< JVM J1: EOF ----
[...truncated 11 lines...]
[junit4] JVM J0: stderr was not empty, see: /home/jenkins/workspace/Lucene-Solr-master-Linux/lucene/build/analysis/icu/test/temp/junit4-J0-20170212_134549_57916131097953263538171.syserr
[junit4] >>> JVM J0 emitted unexpected output (verbatim) ----
[junit4] Java HotSpot(TM) 64-Bit Server VM warning: Option UseConcMarkSweepGC was deprecated in version 9.0 and will likely be removed in a future release.
[junit4] <<< JVM J0: EOF ----
[...truncated 237 lines...]
[junit4] JVM J0: stderr was not empty, see: /home/jenkins/workspace/Lucene-Solr-master-Linux/lucene/build/analysis/kuromoji/test/temp/junit4-J0-20170212_134605_04913392640548464480067.syserr
[junit4] >>> JVM J0 emitted unexpected output (verbatim) ----
[junit4] Java HotSpot(TM) 64-Bit Server VM warning: Option UseConcMarkSweepGC was deprecated in version 9.0 and will likely be removed in a future release.
[junit4] <<< JVM J0: EOF ----
[...truncated 3 lines...]
[junit4] JVM J2: stderr was not empty, see: /home/jenkins/workspace/Lucene-Solr-master-Linux/lucene/build/analysis/kuromoji/test/temp/junit4-J2-20170212_134605_0492470325075206990410.syserr
[junit4] >>> JVM J2 emitted unexpected output (verbatim) ----
[junit4] Java HotSpot(TM) 64-Bit Server VM warning: Option UseConcMarkSweepGC was deprecated in version 9.0 and will likely be removed in a future release.
[junit4] <<< JVM J2: EOF ----
[...truncated 3 lines...]
[junit4] JVM J1: stderr was not empty, see: /home/jenkins/workspace/Lucene-Solr-master-Linux/lucene/build/analysis/kuromoji/test/temp/junit4-J1-20170212_134605_0495676695877986265370.syserr
[junit4] >>> JVM J1 emitted unexpected output (verbatim) ----
[junit4] Java HotSpot(TM) 64-Bit Server VM warning: Option UseConcMarkSweepGC was deprecated in version 9.0 and will likely be removed in a future release.
[junit4] <<< JVM J1: EOF ----
[...truncated 146 lines...]
[junit4] JVM J1: stderr was not empty, see: /home/jenkins/workspace/Lucene-Solr-master-Linux/lucene/build/analysis/morfologik/test/temp/junit4-J1-20170212_134634_6412963125819390376716.syserr
[junit4] >>> JVM J1 emitted unexpected output (verbatim) ----
[junit4] Java HotSpot(TM) 64-Bit Server VM warning: Option UseConcMarkSweepGC was deprecated in version 9.0 and will likely be removed in a future release.
[junit4] <<< JVM J1: EOF ----
[...truncated 3 lines...]
[junit4] JVM J2: stderr was not empty, see: /home/jenkins/workspace/Lucene-Solr-master-Linux/lucene/build/analysis/morfologik/test/temp/junit4-J2-20170212_134634_64112997170788860665469.syserr
[junit4] >>> JVM J2 emitted unexpected output (verbatim) ----
[junit4] Java HotSpot(TM) 64-Bit Server VM warning: Option UseConcMarkSweepGC was deprecated in version 9.0 and will likely be removed in a future release.
[junit4] <<< JVM J2: EOF ----
[...truncated 3 lines...]
[junit4] JVM J0: stderr was not empty, see: /home/jenkins/workspace/Lucene-Solr-master-Linux/lucene/build/analysis/morfologik/test/temp/junit4-J0-20170212_134634_64113459784996405781381.syserr
[junit4] >>> JVM J0 emitted unexpected output (verbatim) ----
[junit4] Java HotSpot(TM) 64-Bit Server VM warning: Option UseConcMarkSweepGC was deprecated in version 9.0 and will likely be removed in a future release.
[junit4] <<< JVM J0: EOF ----
[...truncated 158 lines...]
[junit4] JVM J2: stderr was not empty, see: /home/jenkins/workspace/Lucene-Solr-master-Linux/lucene/build/analysis/phonetic/test/temp/junit4-J2-20170212_134639_43112654428794546852206.syserr
[junit4] >>> JVM J2 emitted unexpected output (verbatim) ----
[junit4] Java HotSpot(TM) 64-Bit Server VM warning: Option UseConcMarkSweepGC was deprecated in version 9.0 and will likely be removed in a future release.
[junit4] <<< JVM J2: EOF ----
[...truncated 3 lines...]
[junit4] JVM J0: stderr was not empty, see: /home/jenkins/workspace/Lucene-Solr-master-Linux/lucene/build/analysis/phonetic/test/temp/junit4-J0-20170212_134639_43110235276533455145490.syserr
[junit4] >>> JVM J0 emitted unexpected output (verbatim) ----
[junit4] Java HotSpot(TM) 64-Bit Server VM warning: Option UseConcMarkSweepGC was deprecated in version 9.0 and will likely be removed in a future release.
[junit4] <<< JVM J0: EOF ----
[...truncated 3 lines...]
[junit4] JVM J1: stderr was not empty, see: /home/jenkins/workspace/Lucene-Solr-master-Linux/lucene/build/analysis/phonetic/test/temp/junit4-J1-20170212_134639_4314227161745652108345.syserr
[junit4] >>> JVM J1 emitted unexpected output (verbatim) ----
[junit4] Java HotSpot(TM) 64-Bit Server VM warning: Option UseConcMarkSweepGC was deprecated in version 9.0 and will likely be removed in a future release.
[junit4] <<< JVM J1: EOF ----
[...truncated 145 lines...]
[junit4] JVM J1: stderr was not empty, see: /home/jenkins/workspace/Lucene-Solr-master-Linux/lucene/build/analysis/smartcn/test/temp/junit4-J1-20170212_134656_75612598346375602157022.syserr
[junit4] >>> JVM J1 emitted unexpected output (verbatim) ----
[junit4] Java HotSpot(TM) 64-Bit Server VM warning: Option UseConcMarkSweepGC was deprecated in version 9.0 and will likely be removed in a future release.
[junit4] <<< JVM J1: EOF ----
[...truncated 3 lines...]
[junit4] JVM J0: stderr was not empty, see: /home/jenkins/workspace/Lucene-Solr-master-Linux/lucene/build/analysis/smartcn/test/temp/junit4-J0-20170212_134656_75612277072140672720977.syserr
[junit4] >>> JVM J0 emitted unexpected output (verbatim) ----
[junit4] Java HotSpot(TM) 64-Bit Server VM warning: Option UseConcMarkSweepGC was deprecated in version 9.0 and will likely be removed in a future release.
[junit4] <<< JVM J0: EOF ----
[...truncated 149 lines...]
[junit4] JVM J2: stderr was not empty, see: /home/jenkins/workspace/Lucene-Solr-master-Linux/lucene/build/analysis/stempel/test/temp/junit4-J2-20170212_134705_2909032053191769005051.syserr
[junit4] >>> JVM J2 emitted unexpected output (verbatim) ----
[junit4] Java HotSpot(TM) 64-Bit Server VM warning: Option UseConcMarkSweepGC was deprecated in version 9.0 and will likely be removed in a future release.
[junit4] <<< JVM J2: EOF ----
[junit4] JVM J1: stderr was not empty, see: /home/jenkins/workspace/Lucene-Solr-master-Linux/lucene/build/analysis/stempel/test/temp/junit4-J1-20170212_134705_2896577591363673478495.syserr
[junit4] >>> JVM J1 emitted unexpected output (verbatim) ----
[junit4] Java HotSpot(TM) 64-Bit Server VM warning: Option UseConcMarkSweepGC was deprecated in version 9.0 and will likely be removed in a future release.
[junit4] <<< JVM J1: EOF ----
[...truncated 3 lines...]
[junit4] JVM J0: stderr was not empty, see: /home/jenkins/workspace/Lucene-Solr-master-Linux/lucene/build/analysis/stempel/test/temp/junit4-J0-20170212_134705_2897179358295703437459.syserr
[junit4] >>> JVM J0 emitted unexpected output (verbatim) ----
[junit4] Java HotSpot(TM) 64-Bit Server VM warning: Option UseConcMarkSweepGC was deprecated in version 9.0 and will likely be removed in a future release.
[junit4] <<< JVM J0: EOF ----
[...truncated 161 lines...]
[junit4] JVM J0: stderr was not empty, see: /home/jenkins/workspace/Lucene-Solr-master-Linux/lucene/build/analysis/uima/test/temp/junit4-J0-20170212_134708_7437457878102057453615.syserr
[junit4] >>> JVM J0 emitted unexpected output (verbatim) ----
[junit4] Java HotSpot(TM) 64-Bit Server VM warning: Option UseConcMarkSweepGC was deprecated in version 9.0 and will likely be removed in a future release.
[junit4] <<< JVM J0: EOF ----
[...truncated 194 lines...]
[junit4] JVM J0: stderr was not empty, see: /home/jenkins/workspace/Lucene-Solr-master-Linux/lucene/build/backward-codecs/test/temp/junit4-J0-20170212_134718_9337631082201932481567.syserr
[junit4] >>> JVM J0 emitted unexpected output (verbatim) ----
[junit4] Java HotSpot(TM) 64-Bit Server VM warning: Option UseConcMarkSweepGC was deprecated in version 9.0 and will likely be removed in a future release.
[junit4] <<< JVM J0: EOF ----
[...truncated 29 lines...]
[junit4] JVM J2: stderr was not empty, see: /home/jenkins/workspace/Lucene-Solr-master-Linux/lucene/build/backward-codecs/test/temp/junit4-J2-20170212_134718_9335009633194506301770.syserr
[junit4] >>> JVM J2 emitted unexpected output (verbatim) ----
[junit4] Java HotSpot(TM) 64-Bit Server VM warning: Option UseConcMarkSweepGC was deprecated in version 9.0 and will likely be removed in a future release.
[junit4] <<< JVM J2: EOF ----
[...truncated 9 lines...]
[junit4] JVM J1: stderr was not empty, see: /home/jenkins/workspace/Lucene-Solr-master-Linux/lucene/build/backward-codecs/test/temp/junit4-J1-20170212_134718_9336496366730190944490.syserr
[junit4] >>> JVM J1 emitted unexpected output (verbatim) ----
[junit4] Java HotSpot(TM) 64-Bit Server VM warning: Option UseConcMarkSweepGC was deprecated in version 9.0 and will likely be removed in a future release.
[junit4] <<< JVM J1: EOF ----
[...truncated 1352 lines...]
[junit4] JVM J1: stderr was not empty, see: /home/jenkins/workspace/Lucene-Solr-master-Linux/lucene/build/benchmark/test/temp/junit4-J1-20170212_135012_5219764135119590158369.syserr
[junit4] >>> JVM J1 emitted unexpected output (verbatim) ----
[junit4] Java HotSpot(TM) 64-Bit Server VM warning: Option UseConcMarkSweepGC was deprecated in version 9.0 and will likely be removed in a future release.
[junit4] <<< JVM J1: EOF ----
[junit4] JVM J2: stderr was not empty, see: /home/jenkins/workspace/Lucene-Solr-master-Linux/lucene/build/benchmark/test/temp/junit4-J2-20170212_135012_5234685476352494963091.syserr
[junit4] >>> JVM J2 emitted unexpected output (verbatim) ----
[junit4] Java HotSpot(TM) 64-Bit Server VM warning: Option UseConcMarkSweepGC was deprecated in version 9.0 and will likely be removed in a future release.
[junit4] <<< JVM J2: EOF ----
[...truncated 3 lines...]
[junit4] JVM J0: stderr was not empty, see: /home/jenkins/workspace/Lucene-Solr-master-Linux/lucene/build/benchmark/test/temp/junit4-J0-20170212_135012_5212485680974680287253.syserr
[junit4] >>> JVM J0 emitted unexpected output (verbatim) ----
[junit4] Java HotSpot(TM) 64-Bit Server VM warning: Option UseConcMarkSweepGC was deprecated in version 9.0 and will likely be removed in a future release.
[junit4] <<< JVM J0: EOF ----
[...truncated 223 lines...]
[junit4] JVM J0: stderr was not empty, see: /home/jenkins/workspace/Lucene-Solr-master-Linux/lucene/build/classification/test/temp/junit4-J0-20170212_135021_90010494685660811947519.syserr
[junit4] >>> JVM J0 emitted unexpected output (verbatim) ----
[junit4] Java HotSpot(TM) 64-Bit Server VM warning: Option UseConcMarkSweepGC was deprecated in version 9.0 and will likely be removed in a future release.
[junit4] <<< JVM J0: EOF ----
[...truncated 3 lines...]
[junit4] JVM J1: stderr was not empty, see: /home/jenkins/workspace/Lucene-Solr-master-Linux/lucene/build/classification/test/temp/junit4-J1-20170212_135021_90012546177789609922323.syserr
[junit4] >>> JVM J1 emitted unexpected output (verbatim) ----
[junit4] Java HotSpot(TM) 64-Bit Server VM warning: Option UseConcMarkSweepGC was deprecated in version 9.0 and will likely be removed in a future release.
[junit4] <<< JVM J1: EOF ----
[...truncated 3 lines...]
[junit4] JVM J2: stderr was not empty, see: /home/jenkins/workspace/Lucene-Solr-master-Linux/lucene/build/classification/test/temp/junit4-J2-20170212_135021_9007097680706278775824.syserr
[junit4] >>> JVM J2 emitted unexpected output (verbatim) ----
[junit4] Java HotSpot(TM) 64-Bit Server VM warning: Option UseConcMarkSweepGC was deprecated in version 9.0 and will likely be removed in a future release.
[junit4] <<< JVM J2: EOF ----
[...truncated 243 lines...]
[junit4] JVM J2: stderr was not empty, see: /home/jenkins/workspace/Lucene-Solr-master-Linux/lucene/build/codecs/test/temp/junit4-J2-20170212_135031_64013050793546901736569.syserr
[junit4] >>> JVM J2 emitted unexpected output (verbatim) ----
[junit4] Java HotSpot(TM) 64-Bit Server VM warning: Option UseConcMarkSweepGC was deprecated in version 9.0 and will likely be removed in a future release.
[junit4] <<< JVM J2: EOF ----
[...truncated 3 lines...]
[junit4] JVM J1: stderr was not empty, see: /home/jenkins/workspace/Lucene-Solr-master-Linux/lucene/build/codecs/test/temp/junit4-J1-20170212_135031_640540046170827895996.syserr
[junit4] >>> JVM J1 emitted unexpected output (verbatim) ----
[junit4] Java HotSpot(TM) 64-Bit Server VM warning: Option UseConcMarkSweepGC was deprecated in version 9.0 and will likely be removed in a future release.
[junit4] <<< JVM J1: EOF ----
[...truncated 12 lines...]
[junit4] JVM J0: stderr was not empty, see: /home/jenkins/workspace/Lucene-Solr-master-Linux/lucene/build/codecs/test/temp/junit4-J0-20170212_135031_64012902826587088504392.syserr
[junit4] >>> JVM J0 emitted unexpected output (verbatim) ----
[junit4] Java HotSpot(TM) 64-Bit Server VM warning: Option UseConcMarkSweepGC was deprecated in version 9.0 and will likely be removed in a future release.
[junit4] <<< JVM J0: EOF ----
[...truncated 229 lines...]
[junit4] JVM J1: stderr was not empty, see: /home/jenkins/workspace/Lucene-Solr-master-Linux/lucene/build/demo/test/temp/junit4-J1-20170212_135402_2142552464104187450229.syserr
[junit4] >>> JVM J1 emitted unexpected output (verbatim) ----
[junit4] Java HotSpot(TM) 64-Bit Server VM warning: Option UseConcMarkSweepGC was deprecated in version 9.0 and will likely be removed in a future release.
[junit4] <<< JVM J1: EOF ----
[junit4] JVM J2: stderr was not empty, see: /home/jenkins/workspace/Lucene-Solr-master-Linux/lucene/build/demo/test/temp/junit4-J2-20170212_135402_2148423257938974987126.syserr
[junit4] >>> JVM J2 emitted unexpected output (verbatim) ----
[junit4] Java HotSpot(TM) 64-Bit Server VM warning: Option UseConcMarkSweepGC was deprecated in version 9.0 and will likely be removed in a future release.
[junit4] <<< JVM J2: EOF ----
[junit4] JVM J0: stderr was not empty, see: /home/jenkins/workspace/Lucene-Solr-master-Linux/lucene/build/demo/test/temp/junit4-J0-20170212_135402_2145161572746456472559.syserr
[junit4] >>> JVM J0 emitted unexpected output (verbatim) ----
[junit4] Java HotSpot(TM) 64-Bit Server VM warning: Option UseConcMarkSweepGC was deprecated in version 9.0 and will likely be removed in a future release.
[junit4] <<< JVM J0: EOF ----
[...truncated 165 lines...]
[junit4] JVM J1: stderr was not empty, see: /home/jenkins/workspace/Lucene-Solr-master-Linux/lucene/build/expressions/test/temp/junit4-J1-20170212_135405_58616643859573807212801.syserr
[junit4] >>> JVM J1 emitted unexpected output (verbatim) ----
[junit4] Java HotSpot(TM) 64-Bit Server VM warning: Option UseConcMarkSweepGC was deprecated in version 9.0 and will likely be removed in a future release.
[junit4] <<< JVM J1: EOF ----
[junit4] JVM J2: stderr was not empty, see: /home/jenkins/workspace/Lucene-Solr-master-Linux/lucene/build/expressions/test/temp/junit4-J2-20170212_135405_58610478701875942037767.syserr
[junit4] >>> JVM J2 emitted unexpected output (verbatim) ----
[junit4] Java HotSpot(TM) 64-Bit Server VM warning: Option UseConcMarkSweepGC was deprecated in version 9.0 and will likely be removed in a future release.
[junit4] <<< JVM J2: EOF ----
[...truncated 3 lines...]
[junit4] JVM J0: stderr was not empty, see: /home/jenkins/workspace/Lucene-Solr-master-Linux/lucene/build/expressions/test/temp/junit4-J0-20170212_135405_58512740839829851010909.syserr
[junit4] >>> JVM J0 emitted unexpected output (verbatim) ----
[junit4] Java HotSpot(TM) 64-Bit Server VM warning: Option UseConcMarkSweepGC was deprecated in version 9.0 and will likely be removed in a future release.
[junit4] <<< JVM J0: EOF ----
[...truncated 198 lines...]
[junit4] JVM J2: stderr was not empty, see: /home/jenkins/workspace/Lucene-Solr-master-Linux/lucene/build/facet/test/temp/junit4-J2-20170212_135413_18515143669239936924383.syserr
[junit4] >>> JVM J2 emitted unexpected output (verbatim) ----
[junit4] Java HotSpot(TM) 64-Bit Server VM warning: Option UseConcMarkSweepGC was deprecated in version 9.0 and will likely be removed in a future release.
[junit4] <<< JVM J2: EOF ----
[...truncated 3 lines...]
[junit4] JVM J0: stderr was not empty, see: /home/jenkins/workspace/Lucene-Solr-master-Linux/lucene/build/facet/test/temp/junit4-J0-20170212_135413_1838821914192782680652.syserr
[junit4] >>> JVM J0 emitted unexpected output (verbatim) ----
[junit4] Java HotSpot(TM) 64-Bit Server VM warning: Option UseConcMarkSweepGC was deprecated in version 9.0 and will likely be removed in a future release.
[junit4] <<< JVM J0: EOF ----
[...truncated 12 lines...]
[junit4] JVM J1: stderr was not empty, see: /home/jenkins/workspace/Lucene-Solr-master-Linux/lucene/build/facet/test/temp/junit4-J1-20170212_135413_18411370184060912356186.syserr
[junit4] >>> JVM J1 emitted unexpected output (verbatim) ----
[junit4] Java HotSpot(TM) 64-Bit Server VM warning: Option UseConcMarkSweepGC was deprecated in version 9.0 and will likely be removed in a future release.
[junit4] <<< JVM J1: EOF ----
[...truncated 159 lines...]
[junit4] JVM J1: stderr was not empty, see: /home/jenkins/workspace/Lucene-Solr-master-Linux/lucene/build/grouping/test/temp/junit4-J1-20170212_135443_10310136445768285897786.syserr
[junit4] >>> JVM J1 emitted unexpected output (verbatim) ----
[junit4] Java HotSpot(TM) 64-Bit Server VM warning: Option UseConcMarkSweepGC was deprecated in version 9.0 and will likely be removed in a future release.
[junit4] <<< JVM J1: EOF ----
[junit4] JVM J2: stderr was not empty, see: /home/jenkins/workspace/Lucene-Solr-master-Linux/lucene/build/grouping/test/temp/junit4-J2-20170212_135443_10316438107541786760374.syserr
[junit4] >>> JVM J2 emitted unexpected output (verbatim) ----
[junit4] Java HotSpot(TM) 64-Bit Server VM warning: Option UseConcMarkSweepGC was deprecated in version 9.0 and will likely be removed in a future release.
[junit4] <<< JVM J2: EOF ----
[...truncated 3 lines...]
[junit4] JVM J0: stderr was not empty, see: /home/jenkins/workspace/Lucene-Solr-master-Linux/lucene/build/grouping/test/temp/junit4-J0-20170212_135443_1034311153647375017130.syserr
[junit4] >>> JVM J0 emitted unexpected output (verbatim) ----
[junit4] Java HotSpot(TM) 64-Bit Server VM warning: Option UseConcMarkSweepGC was deprecated in version 9.0 and will likely be removed in a future release.
[junit4] <<< JVM J0: EOF ----
[...truncated 223 lines...]
[junit4] JVM J0: stderr was not empty, see: /home/jenkins/workspace/Lucene-Solr-master-Linux/lucene/build/highlighter/test/temp/junit4-J0-20170212_135454_16616805769847792045705.syserr
[junit4] >>> JVM J0 emitted unexpected output (verbatim) ----
[junit4] Java HotSpot(TM) 64-Bit Server VM warning: Option UseConcMarkSweepGC was deprecated in version 9.0 and will likely be removed in a future release.
[junit4] <<< JVM J0: EOF ----
[...truncated 24 lines...]
[junit4] JVM J2: stderr was not empty, see: /home/jenkins/workspace/Lucene-Solr-master-Linux/lucene/build/highlighter/test/temp/junit4-J2-20170212_135454_1678498619989602984778.syserr
[junit4] >>> JVM J2 emitted unexpected output (verbatim) ----
[junit4] Java HotSpot(TM) 64-Bit Server VM warning: Option UseConcMarkSweepGC was deprecated in version 9.0 and will likely be removed in a future release.
[junit4] <<< JVM J2: EOF ----
[...truncated 3 lines...]
[junit4] JVM J1: stderr was not empty, see: /home/jenkins/workspace/Lucene-Solr-master-Linux/lucene/build/highlighter/test/temp/junit4-J1-20170212_135454_16616092792587788954122.syserr
[junit4] >>> JVM J1 emitted unexpected output (verbatim) ----
[junit4] Java HotSpot(TM) 64-Bit Server VM warning: Option UseConcMarkSweepGC was deprecated in version 9.0 and will likely be removed in a future release.
[junit4] <<< JVM J1: EOF ----
[...truncated 150 lines...]
[junit4] JVM J2: stderr was not empty, see: /home/jenkins/workspace/Lucene-Solr-master-Linux/lucene/build/join/test/temp/junit4-J2-20170212_135524_29510443156666210712245.syserr
[junit4] >>> JVM J2 emitted unexpected output (verbatim) ----
[junit4] Java HotSpot(TM) 64-Bit Server VM warning: Option UseConcMarkSweepGC was deprecated in version 9.0 and will likely be removed in a future release.
[junit4] <<< JVM J2: EOF ----
[...truncated 3 lines...]
[junit4] JVM J0: stderr was not empty, see: /home/jenkins/workspace/Lucene-Solr-master-Linux/lucene/build/join/test/temp/junit4-J0-20170212_135524_295718645308787867022.syserr
[junit4] >>> JVM J0 emitted unexpected output (verbatim) ----
[junit4] Java HotSpot(TM) 64-Bit Server VM warning: Option UseConcMarkSweepGC was deprecated in version 9.0 and will likely be removed in a future release.
[junit4] <<< JVM J0: EOF ----
[...truncated 3 lines...]
[junit4] JVM J1: stderr was not empty, see: /home/jenkins/workspace/Lucene-Solr-master-Linux/lucene/build/join/test/temp/junit4-J1-20170212_135524_2958856594313168907768.syserr
[junit4] >>> JVM J1 emitted unexpected output (verbatim) ----
[junit4] Java HotSpot(TM) 64-Bit Server VM warning: Option UseConcMarkSweepGC was deprecated in version 9.0 and will likely be removed in a future release.
[junit4] <<< JVM J1: EOF ----
[...truncated 143 lines...]
[junit4] JVM J0: stderr was not empty, see: /home/jenkins/workspace/Lucene-Solr-master-Linux/lucene/build/memory/test/temp/junit4-J0-20170212_135557_84815720496019477702628.syserr
[junit4] >>> JVM J0 emitted unexpected output (verbatim) ----
[junit4] Java HotSpot(TM) 64-Bit Server VM warning: Option UseConcMarkSweepGC was deprecated in version 9.0 and will likely be removed in a future release.
[junit4] <<< JVM J0: EOF ----
[...truncated 3 lines...]
[junit4] JVM J1: stderr was not empty, see: /home/jenkins/workspace/Lucene-Solr-master-Linux/lucene/build/memory/test/temp/junit4-J1-20170212_135557_85016041972286153314933.syserr
[junit4] >>> JVM J1 emitted unexpected output (verbatim) ----
[junit4] Java HotSpot(TM) 64-Bit Server VM warning: Option UseConcMarkSweepGC was deprecated in version 9.0 and will likely be removed in a future release.
[junit4] <<< JVM J1: EOF ----
[...truncated 161 lines...]
[junit4] JVM J2: stderr was not empty, see: /home/jenkins/workspace/Lucene-Solr-master-Linux/lucene/build/misc/test/temp/junit4-J2-20170212_135611_77313460542359477759176.syserr
[junit4] >>> JVM J2 emitted unexpected output (verbatim) ----
[junit4] Java HotSpot(TM) 64-Bit Server VM warning: Option UseConcMarkSweepGC was deprecated in version 9.0 and will likely be removed in a future release.
[junit4] <<< JVM J2: EOF ----
[...truncated 3 lines...]
[junit4] JVM J0: stderr was not empty, see: /home/jenkins/workspace/Lucene-Solr-master-Linux/lucene/build/misc/test/temp/junit4-J0-20170212_135611_77317721353219852283654.syserr
[junit4] >>> JVM J0 emitted unexpected output (verbatim) ----
[junit4] Java HotSpot(TM) 64-Bit Server VM warning: Option UseConcMarkSweepGC was deprecated in version 9.0 and will likely be removed in a future release.
[junit4] <<< JVM J0: EOF ----
[...truncated 3 lines...]
[junit4] JVM J1: stderr was not empty, see: /home/jenkins/workspace/Lucene-Solr-master-Linux/lucene/build/misc/test/temp/junit4-J1-20170212_135611_77313422646369127829852.syserr
[junit4] >>> JVM J1 emitted unexpected output (verbatim) ----
[junit4] Java HotSpot(TM) 64-Bit Server VM warning: Option UseConcMarkSweepGC was deprecated in version 9.0 and will likely be removed in a future release.
[junit4] <<< JVM J1: EOF ----
[...truncated 222 lines...]
[junit4] JVM J0: stderr was not empty, see: /home/jenkins/workspace/Lucene-Solr-master-Linux/lucene/build/queries/test/temp/junit4-J0-20170212_135620_79515573642291154121343.syserr
[junit4] >>> JVM J0 emitted unexpected output (verbatim) ----
[junit4] Java HotSpot(TM) 64-Bit Server VM warning: Option UseConcMarkSweepGC was deprecated in version 9.0 and will likely be removed in a future release.
[junit4] <<< JVM J0: EOF ----
[junit4] JVM J1: stderr was not empty, see: /home/jenkins/workspace/Lucene-Solr-master-Linux/lucene/build/queries/test/temp/junit4-J1-20170212_135620_7959944819643965376365.syserr
[junit4] >>> JVM J1 emitted unexpected output (verbatim) ----
[junit4] Java HotSpot(TM) 64-Bit Server VM warning: Option UseConcMarkSweepGC was deprecated in version 9.0 and will likely be removed in a future release.
[junit4] <<< JVM J1: EOF ----
[...truncated 3 lines...]
[junit4] JVM J2: stderr was not empty, see: /home/jenkins/workspace/Lucene-Solr-master-Linux/lucene/build/queries/test/temp/junit4-J2-20170212_135620_79514971062775796261927.syserr
[junit4] >>> JVM J2 emitted unexpected output (verbatim) ----
[junit4] Java HotSpot(TM) 64-Bit Server VM warning: Option UseConcMarkSweepGC was deprecated in version 9.0 and will likely be removed in a future release.
[junit4] <<< JVM J2: EOF ----
[...truncated 219 lines...]
[junit4] JVM J0: stderr was not empty, see: /home/jenkins/workspace/Lucene-Solr-master-Linux/lucene/build/queryparser/test/temp/junit4-J0-20170212_135630_2539408649725383584391.syserr
[junit4] >>> JVM J0 emitted unexpected output (verbatim) ----
[junit4] Java HotSpot(TM) 64-Bit Server VM warning: Option UseConcMarkSweepGC was deprecated in version 9.0 and will likely be removed in a future release.
[junit4] <<< JVM J0: EOF ----
[junit4] JVM J2: stderr was not empty, see: /home/jenkins/workspace/Lucene-Solr-master-Linux/lucene/build/queryparser/test/temp/junit4-J2-20170212_135630_25315282521541682708099.syserr
[junit4] >>> JVM J2 emitted unexpected output (verbatim) ----
[junit4] Java HotSpot(TM) 64-Bit Server VM warning: Option UseConcMarkSweepGC was deprecated in version 9.0 and will likely be removed in a future release.
[junit4] <<< JVM J2: EOF ----
[...truncated 3 lines...]
[junit4] JVM J1: stderr was not empty, see: /home/jenkins/workspace/Lucene-Solr-master-Linux/lucene/build/queryparser/test/temp/junit4-J1-20170212_135630_253733911213501481343.syserr
[junit4] >>> JVM J1 emitted unexpected output (verbatim) ----
[junit4] Java HotSpot(TM) 64-Bit Server VM warning: Option UseConcMarkSweepGC was deprecated in version 9.0 and will likely be removed in a future release.
[junit4] <<< JVM J1: EOF ----
[...truncated 199 lines...]
[junit4] JVM J1: stderr was not empty, see: /home/jenkins/workspace/Lucene-Solr-master-Linux/lucene/build/replicator/test/temp/junit4-J1-20170212_135639_0424269836228182134143.syserr
[junit4] >>> JVM J1 emitted unexpected output (verbatim) ----
[junit4] Java HotSpot(TM) 64-Bit Server VM warning: Option UseConcMarkSweepGC was deprecated in version 9.0 and will likely be removed in a future release.
[junit4] <<< JVM J1: EOF ----
[...truncated 3 lines...]
[junit4] JVM J0: stderr was not empty, see: /home/jenkins/workspace/Lucene-Solr-master-Linux/lucene/build/replicator/test/temp/junit4-J0-20170212_135639_0401399147799033233509.syserr
[junit4] >>> JVM J0 emitted unexpected output (verbatim) ----
[junit4] Java HotSpot(TM) 64-Bit Server VM warning: Option UseConcMarkSweepGC was deprecated in version 9.0 and will likely be removed in a future release.
[junit4] <<< JVM J0: EOF ----
[...truncated 3 lines...]
[junit4] JVM J2: stderr was not empty, see: /home/jenkins/workspace/Lucene-Solr-master-Linux/lucene/build/replicator/test/temp/junit4-J2-20170212_135639_0429450247841609691133.syserr
[junit4] >>> JVM J2 emitted unexpected output (verbatim) ----
[junit4] Java HotSpot(TM) 64-Bit Server VM warning: Option UseConcMarkSweepGC was deprecated in version 9.0 and will likely be removed in a future release.
[junit4] <<< JVM J2: EOF ----
[...truncated 224 lines...]
[junit4] JVM J0: stderr was not empty, see: /home/jenkins/workspace/Lucene-Solr-master-Linux/lucene/build/sandbox/test/temp/junit4-J0-20170212_135654_07315800582547645285119.syserr
[junit4] >>> JVM J0 emitted unexpected output (verbatim) ----
[junit4] Java HotSpot(TM) 64-Bit Server VM warning: Option UseConcMarkSweepGC was deprecated in version 9.0 and will likely be removed in a future release.
[junit4] <<< JVM J0: EOF ----
[...truncated 5 lines...]
[junit4] JVM J2: stderr was not empty, see: /home/jenkins/workspace/Lucene-Solr-master-Linux/lucene/build/sandbox/test/temp/junit4-J2-20170212_135654_0737142541703056864101.syserr
[junit4] >>> JVM J2 emitted unexpected output (verbatim) ----
[junit4] Java HotSpot(TM) 64-Bit Server VM warning: Option UseConcMarkSweepGC was deprecated in version 9.0 and will likely be removed in a future release.
[junit4] <<< JVM J2: EOF ----
[...truncated 3 lines...]
[junit4] JVM J1: stderr was not empty, see: /home/jenkins/workspace/Lucene-Solr-master-Linux/lucene/build/sandbox/test/temp/junit4-J1-20170212_135654_07315456922697385346748.syserr
[junit4] >>> JVM J1 emitted unexpected output (verbatim) ----
[junit4] Java HotSpot(TM) 64-Bit Server VM warning: Option UseConcMarkSweepGC was deprecated in version 9.0 and will likely be removed in a future release.
[junit4] <<< JVM J1: EOF ----
[...truncated 213 lines...]
[junit4] JVM J0: stderr was not empty, see: /home/jenkins/workspace/Lucene-Solr-master-Linux/lucene/build/spatial-extras/test/temp/junit4-J0-20170212_135756_63911512234827282966214.syserr
[junit4] >>> JVM J0 emitted unexpected output (verbatim) ----
[junit4] Java HotSpot(TM) 64-Bit Server VM warning: Option UseConcMarkSweepGC was deprecated in version 9.0 and will likely be removed in a future release.
[junit4] <<< JVM J0: EOF ----
[...truncated 3 lines...]
[junit4] JVM J1: stderr was not empty, see: /home/jenkins/workspace/Lucene-Solr-master-Linux/lucene/build/spatial-extras/test/temp/junit4-J1-20170212_135756_63914073420274225038231.syserr
[junit4] >>> JVM J1 emitted unexpected output (verbatim) ----
[junit4] Java HotSpot(TM) 64-Bit Server VM warning: Option UseConcMarkSweepGC was deprecated in version 9.0 and will likely be removed in a future release.
[junit4] <<< JVM J1: EOF ----
[...truncated 3 lines...]
[junit4] JVM J2: stderr was not empty, see: /home/jenkins/workspace/Lucene-Solr-master-Linux/lucene/build/spatial-extras/test/temp/junit4-J2-20170212_135756_6397063592638252938330.syserr
[junit4] >>> JVM J2 emitted unexpected output (verbatim) ----
[junit4] Java HotSpot(TM) 64-Bit Server VM warning: Option UseConcMarkSweepGC was deprecated in version 9.0 and will likely be removed in a future release.
[junit4] <<< JVM J2: EOF ----
[...truncated 140 lines...]
[junit4] JVM J0: stderr was not empty, see: /home/jenkins/workspace/Lucene-Solr-master-Linux/lucene/build/spatial/test/temp/junit4-J0-20170212_135813_0513406204353764331573.syserr
[junit4] >>> JVM J0 emitted unexpected output (verbatim) ----
[junit4] Java HotSpot(TM) 64-Bit Server VM warning: Option UseConcMarkSweepGC was deprecated in version 9.0 and will likely be removed in a future release.
[junit4] <<< JVM J0: EOF ----
[...truncated 157 lines...]
[junit4] JVM J2: stderr was not empty, see: /home/jenkins/workspace/Lucene-Solr-master-Linux/lucene/build/spatial3d/test/temp/junit4-J2-20170212_135815_700882114190398872138.syserr
[junit4] >>> JVM J2 emitted unexpected output (verbatim) ----
[junit4] Java HotSpot(TM) 64-Bit Server VM warning: Option UseConcMarkSweepGC was deprecated in version 9.0 and will likely be removed in a future release.
[junit4] <<< JVM J2: EOF ----
[junit4] JVM J0: stderr was not empty, see: /home/jenkins/workspace/Lucene-Solr-master-Linux/lucene/build/spatial3d/test/temp/junit4-J0-20170212_135815_700962572584313189473.syserr
[junit4] >>> JVM J0 emitted unexpected output (verbatim) ----
[junit4] Java HotSpot(TM) 64-Bit Server VM warning: Option UseConcMarkSweepGC was deprecated in version 9.0 and will likely be removed in a future release.
[junit4] <<< JVM J0: EOF ----
[...truncated 6 lines...]
[junit4] JVM J1: stderr was not empty, see: /home/jenkins/workspace/Lucene-Solr-master-Linux/lucene/build/spatial3d/test/temp/junit4-J1-20170212_135815_7009100820064824744247.syserr
[junit4] >>> JVM J1 emitted unexpected output (verbatim) ----
[junit4] Java HotSpot(TM) 64-Bit Server VM warning: Option UseConcMarkSweepGC was deprecated in version 9.0 and will likely be removed in a future release.
[junit4] <<< JVM J1: EOF ----
[...truncated 303 lines...]
[junit4] JVM J2: stderr was not empty, see: /home/jenkins/workspace/Lucene-Solr-master-Linux/lucene/build/suggest/test/temp/junit4-J2-20170212_135938_87315907397099043100607.syserr
[junit4] >>> JVM J2 emitted unexpected output (verbatim) ----
[junit4] Java HotSpot(TM) 64-Bit Server VM warning: Option UseConcMarkSweepGC was deprecated in version 9.0 and will likely be removed in a future release.
[junit4] <<< JVM J2: EOF ----
[...truncated 3 lines...]
[junit4] JVM J0: stderr was not empty, see: /home/jenkins/workspace/Lucene-Solr-master-Linux/lucene/build/suggest/test/temp/junit4-J0-20170212_135938_87214800133372586847590.syserr
[junit4] >>> JVM J0 emitted unexpected output (verbatim) ----
[junit4] Java HotSpot(TM) 64-Bit Server VM warning: Option UseConcMarkSweepGC was deprecated in version 9.0 and will likely be removed in a future release.
[junit4] <<< JVM J0: EOF ----
[...truncated 3 lines...]
[junit4] JVM J1: stderr was not empty, see: /home/jenkins/workspace/Lucene-Solr-master-Linux/lucene/build/suggest/test/temp/junit4-J1-20170212_135938_8732731115893931988169.syserr
[junit4] >>> JVM J1 emitted unexpected output (verbatim) ----
[junit4] Java HotSpot(TM) 64-Bit Server VM warning: Option UseConcMarkSweepGC was deprecated in version 9.0 and will likely be removed in a future release.
[junit4] <<< JVM J1: EOF ----
[...truncated 2130 lines...]
[junit4] Suite: org.apache.solr.handler.admin.TestCoreAdminApis
[junit4] 2> Creating dataDir: /home/jenkins/workspace/Lucene-Solr-master-Linux/solr/build/solr-core/test/J2/temp/solr.handler.admin.TestCoreAdminApis_2B4EF0651B7E92BF-001/init-core-data-001
[junit4] 2> 986339 INFO (SUITE-TestCoreAdminApis-seed#[2B4EF0651B7E92BF]-worker) [ ] o.a.s.SolrTestCaseJ4 Using PointFields
[junit4] 2> 986341 INFO (SUITE-TestCoreAdminApis-seed#[2B4EF0651B7E92BF]-worker) [ ] o.a.s.SolrTestCaseJ4 Randomized ssl (true) and clientAuth (false) via: @org.apache.solr.util.RandomizeSSL(reason="", value=0.0/0.0, ssl=0.0/0.0, clientAuth=0.0/0.0)
[junit4] 2> 986342 INFO (TEST-TestCoreAdminApis.testCalls-seed#[2B4EF0651B7E92BF]) [ ] o.a.s.SolrTestCaseJ4 ###Starting testCalls
[junit4] 2> 986384 INFO (TEST-TestCoreAdminApis.testCalls-seed#[2B4EF0651B7E92BF]) [ ] o.a.s.SolrTestCaseJ4 ###Ending testCalls
[junit4] 2> NOTE: reproduce with: ant test -Dtestcase=TestCoreAdminApis -Dtests.method=testCalls -Dtests.seed=2B4EF0651B7E92BF -Dtests.multiplier=3 -Dtests.slow=true -Dtests.locale=sr-Latn -Dtests.timezone=America/Mexico_City -Dtests.asserts=true -Dtests.file.encoding=ISO-8859-1
[junit4] ERROR 0.04s J2 | TestCoreAdminApis.testCalls <<<
[junit4] > Throwable #1: java.lang.ExceptionInInitializerError
[junit4] > at __randomizedtesting.SeedInfo.seed([2B4EF0651B7E92BF:198FEF0E9EF22118]:0)
[junit4] > at net.sf.cglib.core.KeyFactory$Generator.generateClass(KeyFactory.java:166)
[junit4] > at net.sf.cglib.core.DefaultGeneratorStrategy.generate(DefaultGeneratorStrategy.java:25)
[junit4] > at net.sf.cglib.core.AbstractClassGenerator.create(AbstractClassGenerator.java:216)
[junit4] > at net.sf.cglib.core.KeyFactory$Generator.create(KeyFactory.java:144)
[junit4] > at net.sf.cglib.core.KeyFactory.create(KeyFactory.java:116)
[junit4] > at net.sf.cglib.core.KeyFactory.create(KeyFactory.java:108)
[junit4] > at net.sf.cglib.core.KeyFactory.create(KeyFactory.java:104)
[junit4] > at net.sf.cglib.proxy.Enhancer.<clinit>(Enhancer.java:69)
[junit4] > at org.easymock.internal.ClassProxyFactory.createEnhancer(ClassProxyFactory.java:259)
[junit4] > at org.easymock.internal.ClassProxyFactory.createProxy(ClassProxyFactory.java:174)
[junit4] > at org.easymock.internal.MocksControl.createMock(MocksControl.java:60)
[junit4] > at org.easymock.EasyMock.createMock(EasyMock.java:104)
[junit4] > at org.apache.solr.handler.admin.TestCoreAdminApis.getCoreContainerMock(TestCoreAdminApis.java:76)
[junit4] > at org.apache.solr.handler.admin.TestCoreAdminApis.testCalls(TestCoreAdminApis.java:43)
[junit4] > at java.base/jdk.internal.reflect.NativeMethodAccessorImpl.invoke0(Native Method)
[junit4] > at java.base/jdk.internal.reflect.NativeMethodAccessorImpl.invoke(NativeMethodAccessorImpl.java:62)
[junit4] > at java.base/jdk.internal.reflect.DelegatingMethodAccessorImpl.invoke(DelegatingMethodAccessorImpl.java:43)
[junit4] > at java.base/java.lang.reflect.Method.invoke(Method.java:543)
[junit4] > at java.base/java.lang.Thread.run(Thread.java:844)
[junit4] > Caused by: java.lang.reflect.InaccessibleObjectException: Unable to make protected final java.lang.Class java.lang.ClassLoader.defineClass(java.lang.String,byte[],int,int,java.security.ProtectionDomain) throws java.lang.ClassFormatError accessible: module java.base does not "opens java.lang" to unnamed module @3bd029dd
[junit4] > at java.base/java.lang.reflect.AccessibleObject.checkCanSetAccessible(AccessibleObject.java:207)
[junit4] > at java.base/java.lang.reflect.Method.checkCanSetAccessible(Method.java:192)
[junit4] > at java.base/java.lang.reflect.Method.setAccessible(Method.java:186)
[junit4] > at net.sf.cglib.core.ReflectUtils$2.run(ReflectUtils.java:56)
[junit4] > at java.base/java.security.AccessController.doPrivileged(Native Method)
[junit4] > at net.sf.cglib.core.ReflectUtils.<clinit>(ReflectUtils.java:46)
[junit4] > ... 52 more
[junit4] 2> 986386 INFO (SUITE-TestCoreAdminApis-seed#[2B4EF0651B7E92BF]-worker) [ ] o.a.s.SolrTestCaseJ4 ###deleteCore
[junit4] 2> NOTE: leaving temporary files on disk at: /home/jenkins/workspace/Lucene-Solr-master-Linux/solr/build/solr-core/test/J2/temp/solr.handler.admin.TestCoreAdminApis_2B4EF0651B7E92BF-001
[junit4] 2> NOTE: test params are: codec=Asserting(Lucene70): {}, docValues:{}, maxPointsInLeafNode=838, maxMBSortInHeap=7.280740799428389, sim=RandomSimilarity(queryNorm=false): {}, locale=sr-Latn, timezone=America/Mexico_City
[junit4] 2> NOTE: Linux 4.4.0-53-generic amd64/Oracle Corporation 9-ea (64-bit)/cpus=12,threads=1,free=239052240,total=517668864
[junit4] 2> NOTE: All tests run in this JVM: [TestSort, DeleteNodeTest, ShardSplitTest, TestWriterPerf, NoCacheHeaderTest, TestConfigSets, TestFieldSortValues, TestCloudRecovery, TestReplicaProperties, TestCryptoKeys, V2ApiIntegrationTest, TestSmileRequest, CoreMergeIndexesAdminHandlerTest, OverseerRolesTest, TestObjectReleaseTracker, HighlighterConfigTest, FullHLLTest, TestHashQParserPlugin, RecoveryZkTest, RAMDirectoryFactoryTest, TestFieldCollectionResource, TestSolrQueryParserDefaultOperatorResource, TestDownShardTolerantSearch, TestSchemalessBufferedUpdates, ExternalFileFieldSortTest, ClassificationUpdateProcessorFactoryTest, SuggesterWFSTTest, DistributedFacetExistsSmallTest, AddBlockUpdateTest, CdcrReplicationHandlerTest, TestFastOutputStream, LeaderInitiatedRecoveryOnCommitTest, TestClusterStateMutator, TestSolrConfigHandlerCloud, DateFieldTest, OverseerTest, TestRawTransformer, TestReload, StatelessScriptUpdateProcessorFactoryTest, TestReloadDeadlock, PrimUtilsTest, CloneFieldUpdateProcessorFactoryTest, AnalyticsMergeStrategyTest, GraphQueryTest, BigEndianAscendingWordSerializerTest, TestManagedSchemaThreadSafety, TestCloudInspectUtil, CollectionReloadTest, XmlUpdateRequestHandlerTest, SubstringBytesRefFilterTest, TestTolerantSearch, SmileWriterTest, TestSolrQueryParser, TestSolrDeletionPolicy1, PreAnalyzedFieldManagedSchemaCloudTest, UpdateParamsTest, BooleanFieldTest, StatsComponentTest, HardAutoCommitTest, SynonymTokenizerTest, DirectUpdateHandlerOptimizeTest, TestConfig, TestSSLRandomization, DocValuesMultiTest, ConfigSetsAPITest, BinaryUpdateRequestHandlerTest, TestCSVResponseWriter, OutputWriterTest, TestTestInjection, LeaderElectionContextKeyTest, FieldMutatingUpdateProcessorTest, TlogReplayBufferedWhileIndexingTest, TestMergePolicyConfig, TestJavabinTupleStreamParser, TestClassicSimilarityFactory, RequestHandlersTest, TestJettySolrRunner, BlobRepositoryCloudTest, TestCoreAdminApis]
[junit4] Completed [263/694 (1!)] on J2 in 0.06s, 1 test, 1 error <<< FAILURES!
[...truncated 979 lines...]
[junit4] Suite: org.apache.solr.handler.admin.TestApiFramework
[junit4] 2> Creating dataDir: /home/jenkins/workspace/Lucene-Solr-master-Linux/solr/build/solr-core/test/J1/temp/solr.handler.admin.TestApiFramework_2B4EF0651B7E92BF-001/init-core-data-001
[junit4] 2> 2095513 INFO (SUITE-TestApiFramework-seed#[2B4EF0651B7E92BF]-worker) [ ] o.a.s.SolrTestCaseJ4 Using TrieFields
[junit4] 2> 2095514 INFO (SUITE-TestApiFramework-seed#[2B4EF0651B7E92BF]-worker) [ ] o.a.s.SolrTestCaseJ4 Randomized ssl (true) and clientAuth (false) via: @org.apache.solr.util.RandomizeSSL(reason="", value=0.0/0.0, ssl=0.0/0.0, clientAuth=0.0/0.0)
[junit4] 2> 2095516 INFO (TEST-TestApiFramework.testFramework-seed#[2B4EF0651B7E92BF]) [ ] o.a.s.SolrTestCaseJ4 ###Starting testFramework
[junit4] 2> 2095550 INFO (TEST-TestApiFramework.testFramework-seed#[2B4EF0651B7E92BF]) [ ] o.a.s.SolrTestCaseJ4 ###Ending testFramework
[junit4] 2> NOTE: reproduce with: ant test -Dtestcase=TestApiFramework -Dtests.method=testFramework -Dtests.seed=2B4EF0651B7E92BF -Dtests.multiplier=3 -Dtests.slow=true -Dtests.locale=en-MH -Dtests.timezone=Indian/Antananarivo -Dtests.asserts=true -Dtests.file.encoding=ISO-8859-1
[junit4] ERROR 0.04s J1 | TestApiFramework.testFramework <<<
[junit4] > Throwable #1: java.lang.ExceptionInInitializerError
[junit4] > at __randomizedtesting.SeedInfo.seed([2B4EF0651B7E92BF:3C383A421DAA7E82]:0)
[junit4] > at net.sf.cglib.core.KeyFactory$Generator.generateClass(KeyFactory.java:166)
[junit4] > at net.sf.cglib.core.DefaultGeneratorStrategy.generate(DefaultGeneratorStrategy.java:25)
[junit4] > at net.sf.cglib.core.AbstractClassGenerator.create(AbstractClassGenerator.java:216)
[junit4] > at net.sf.cglib.core.KeyFactory$Generator.create(KeyFactory.java:144)
[junit4] > at net.sf.cglib.core.KeyFactory.create(KeyFactory.java:116)
[junit4] > at net.sf.cglib.core.KeyFactory.create(KeyFactory.java:108)
[junit4] > at net.sf.cglib.core.KeyFactory.create(KeyFactory.java:104)
[junit4] > at net.sf.cglib.proxy.Enhancer.<clinit>(Enhancer.java:69)
[junit4] > at org.easymock.internal.ClassProxyFactory.createEnhancer(ClassProxyFactory.java:259)
[junit4] > at org.easymock.internal.ClassProxyFactory.createProxy(ClassProxyFactory.java:174)
[junit4] > at org.easymock.internal.MocksControl.createMock(MocksControl.java:60)
[junit4] > at org.easymock.EasyMock.createMock(EasyMock.java:104)
[junit4] > at org.apache.solr.handler.admin.TestCoreAdminApis.getCoreContainerMock(TestCoreAdminApis.java:76)
[junit4] > at org.apache.solr.handler.admin.TestApiFramework.testFramework(TestApiFramework.java:59)
[junit4] > at java.base/jdk.internal.reflect.NativeMethodAccessorImpl.invoke0(Native Method)
[junit4] > at java.base/jdk.internal.reflect.NativeMethodAccessorImpl.invoke(NativeMethodAccessorImpl.java:62)
[junit4] > at java.base/jdk.internal.reflect.DelegatingMethodAccessorImpl.invoke(DelegatingMethodAccessorImpl.java:43)
[junit4] > at java.base/java.lang.reflect.Method.invoke(Method.java:543)
[junit4] > at java.base/java.lang.Thread.run(Thread.java:844)
[junit4] > Caused by: java.lang.reflect.InaccessibleObjectException: Unable to make protected final java.lang.Class java.lang.ClassLoader.defineClass(java.lang.String,byte[],int,int,java.security.ProtectionDomain) throws java.lang.ClassFormatError accessible: module java.base does not "opens java.lang" to unnamed module @1027a4b0
[junit4] > at java.base/java.lang.reflect.AccessibleObject.checkCanSetAccessible(AccessibleObject.java:207)
[junit4] > at java.base/java.lang.reflect.Method.checkCanSetAccessible(Method.java:192)
[junit4] > at java.base/java.lang.reflect.Method.setAccessible(Method.java:186)
[junit4] > at net.sf.cglib.core.ReflectUtils$2.run(ReflectUtils.java:56)
[junit4] > at java.base/java.security.AccessController.doPrivileged(Native Method)
[junit4] > at net.sf.cglib.core.ReflectUtils.<clinit>(ReflectUtils.java:46)
[junit4] > ... 52 more
[junit4] 2> 2095552 INFO (TEST-TestApiFramework.testTrailingTemplatePaths-seed#[2B4EF0651B7E92BF]) [ ] o.a.s.SolrTestCaseJ4 ###Starting testTrailingTemplatePaths
[junit4] 2> 2095552 INFO (TEST-TestApiFramework.testTrailingTemplatePaths-seed#[2B4EF0651B7E92BF]) [ ] o.a.s.SolrTestCaseJ4 ###Ending testTrailingTemplatePaths
[junit4] 2> 2095552 INFO (SUITE-TestApiFramework-seed#[2B4EF0651B7E92BF]-worker) [ ] o.a.s.SolrTestCaseJ4 ###deleteCore
[junit4] 2> NOTE: leaving temporary files on disk at: /home/jenkins/workspace/Lucene-Solr-master-Linux/solr/build/solr-core/test/J1/temp/solr.handler.admin.TestApiFramework_2B4EF0651B7E92BF-001
[junit4] 2> NOTE: test params are: codec=CheapBastard, sim=RandomSimilarity(queryNorm=false): {}, locale=en-MH, timezone=Indian/Antananarivo
[junit4] 2> NOTE: Linux 4.4.0-53-generic amd64/Oracle Corporation 9-ea (64-bit)/cpus=12,threads=1,free=127216360,total=518979584
[junit4] 2> NOTE: All tests run in this JVM: [TestXmlQParserPlugin, ChaosMonkeySafeLeaderTest, OverseerTaskQueueTest, DirectSolrConnectionTest, ExitableDirectoryReaderTest, TestLegacyNumericRangeQueryBuilder, ShardRoutingTest, TestHashPartitioner, SolrCloudExampleTest, MoreLikeThisHandlerTest, TestStressRecovery, TestSQLHandlerNonCloud, DistributedVersionInfoTest, TestSolrCLIRunExample, TermVectorComponentTest, ExplicitHLLTest, ActionThrottleTest, TestNoOpRegenerator, MigrateRouteKeyTest, HdfsTlogReplayBufferedWhileIndexingTest, TestRestManager, TestFieldTypeCollectionResource, TestCloudDeleteByQuery, SortSpecParsingTest, ManagedSchemaRoundRobinCloudTest, UpdateLogTest, SpellCheckCollatorTest, DistributedExpandComponentTest, TestFieldCacheReopen, TestEmbeddedSolrServerConstructors, SimplePostToolTest, DeleteLastCustomShardedReplicaTest, ZkControllerTest, JsonLoaderTest, DocValuesTest, HttpPartitionTest, TestCustomDocTransformer, TestSimpleQParserPlugin, TestSolrCoreParser, FileUtilsTest, AtomicUpdatesTest, SpatialFilterTest, TestScoreJoinQPScore, BigEndianAscendingWordDeserializerTest, QueryParsingTest, ShardRoutingCustomTest, AsyncCallRequestStatusResponseTest, HighlighterTest, TestConfigReload, TestCursorMarkWithoutUniqueKey, SolrMetricManagerTest, TestSurroundQueryParser, TestInfoStreamLogging, OpenExchangeRatesOrgProviderTest, TestHdfsUpdateLog, BadCopyFieldTest, DistributedTermsComponentTest, DocumentBuilderTest, TestCloudSchemaless, TestSerializedLuceneMatchVersion, TestUninvertingReader, AlternateDirectoryTest, TestHdfsCloudBackupRestore, IndexSchemaTest, CdcrVersionReplicationTest, TestSolrDynamicMBean, SolrGangliaReporterTest, ConvertedLegacyTest, TestSystemIdResolver, ConcurrentDeleteAndCreateCollectionTest, ClassificationUpdateProcessorTest, TestRequestStatusCollectionAPI, TestConfigSetProperties, TestIntervalFaceting, ZkSolrClientTest, TestBM25SimilarityFactory, StressHdfsTest, TestSimpleTrackingShardHandler, JavabinLoaderTest, HdfsChaosMonkeyNothingIsSafeTest, TestConfigsApi, CdcrReplicationDistributedZkTest, TestFastLRUCache, DistributedFacetPivotLongTailTest, TermsComponentTest, CursorMarkTest, TestSolrCloudWithKerberosAlt, WordBreakSolrSpellCheckerTest, BJQParserTest, SharedFSAutoReplicaFailoverUtilsTest, BadComponentTest, TestCopyFieldCollectionResource, TestGraphMLResponseWriter, ChaosMonkeyNothingIsSafeTest, TestStressInPlaceUpdates, CdcrUpdateLogTest, LoggingHandlerTest, RestartWhileUpdatingTest, DistanceFunctionTest, TestPKIAuthenticationPlugin, TestCollectionAPI, UpdateRequestProcessorFactoryTest, RemoteQueryErrorTest, TestCustomSort, TestSolrIndexConfig, SoftAutoCommitTest, SuggestComponentContextFilterQueryTest, HttpSolrCallGetCoreTest, TestWordDelimiterFilterFactory, TestExactStatsCache, SampleTest, ReplicaListTransformerTest, DistribDocExpirationUpdateProcessorTest, BasicDistributedZkTest, UnloadDistributedZkTest, CollectionsAPIDistributedZkTest, AutoCommitTest, TestRecovery, TermVectorComponentDistributedTest, TestCoreContainer, SimpleFacetsTest, SolrCoreTest, TestGroupingSearch, QueryElevationComponentTest, BadIndexSchemaTest, TestFiltering, CurrencyFieldOpenExchangeTest, CurrencyFieldXmlFileTest, SolrIndexSplitterTest, TestCoreDiscovery, TestExtendedDismaxParser, CoreAdminHandlerTest, TestStressLucene, TestTrie, SolrCoreCheckLockOnStartupTest, TestUpdate, TestAtomicUpdateErrorCases, TestRemoteStreaming, XsltUpdateRequestHandlerTest, IndexBasedSpellCheckerTest, DisMaxRequestHandlerTest, StandardRequestHandlerTest, TestReversedWildcardFilterFactory, TestQueryTypes, TestIndexingPerformance, IndexSchemaRuntimeFieldTest, SolrPluginUtilsTest, TestPartialUpdateDeduplication, CSVRequestHandlerTest, SOLR749Test, TestQuerySenderListener, TestQuerySenderNoQuery, ResponseLogComponentTest, TestSolrDeletionPolicy2, MultiTermTest, TestDocSet, TestBinaryField, TestSearchPerf, TestElisionMultitermQuery, TestFuzzyAnalyzedSuggestions, TestPostingsSolrHighlighter, TestLuceneMatchVersion, TestPhraseSuggestions, TestCharFilters, TestXIncludeConfig, EchoParamsTest, TestSweetSpotSimilarityFactory, TestDFRSimilarityFactory, TestPerFieldSimilarity, TestLMDirichletSimilarityFactory, TestIBSimilarityFactory, TestFastWriter, TestJmxMonitoredMap, TimeZoneUtilsTest, ResourceLoaderTest, ScriptEngineTest, URLClassifyProcessorTest, PreAnalyzedFieldTest, SpellingQueryConverterTest, ClusterStateTest, TestUtils, SystemInfoHandlerTest, CircularListTest, DistributedMLTComponentTest, SolrTestCaseJ4Test, TestHighlightDedupGrouping, AliasIntegrationTest, CollectionStateFormat2Test, CreateCollectionCleanupTest, DeleteReplicaTest, DistributedQueueTest, ForceLeaderTest, TestCloudPseudoReturnFields, TestConfigSetsAPIZkFailure, TestLeaderElectionZkExpiry, TestLeaderInitiatedRecoveryThread, TestRandomFlRTGCloud, TestShortCircuitedRequests, TestSolrCloudWithSecureImpersonation, TestTolerantUpdateProcessorRandomCloud, ZkStateWriterTest, CachingDirectoryFactoryTest, TestDynamicLoading, TestRestoreCore, InfoHandlerTest, SegmentsInfoRequestHandlerTest, TestApiFramework]
[junit4] Completed [565/694 (2!)] on J1 in 0.05s, 2 tests, 1 error <<< FAILURES!
[...truncated 395 lines...]
[junit4] JVM J2: stderr was not empty, see: /home/jenkins/workspace/Lucene-Solr-master-Linux/solr/build/solr-core/test/temp/junit4-J2-20170212_140053_7689238827573523819327.syserr
[junit4] >>> JVM J2 emitted unexpected output (verbatim) ----
[junit4] Java HotSpot(TM) 64-Bit Server VM warning: Option UseConcMarkSweepGC was deprecated in version 9.0 and will likely be removed in a future release.
[junit4] <<< JVM J2: EOF ----
[junit4] JVM J1: stderr was not empty, see: /home/jenkins/workspace/Lucene-Solr-master-Linux/solr/build/solr-core/test/temp/junit4-J1-20170212_140053_7687871211189192100844.syserr
[junit4] >>> JVM J1 emitted unexpected output (verbatim) ----
[junit4] Java HotSpot(TM) 64-Bit Server VM warning: Option UseConcMarkSweepGC was deprecated in version 9.0 and will likely be removed in a future release.
[junit4] <<< JVM J1: EOF ----
[...truncated 4 lines...]
[junit4] JVM J0: stderr was not empty, see: /home/jenkins/workspace/Lucene-Solr-master-Linux/solr/build/solr-core/test/temp/junit4-J0-20170212_140053_76617760776583089375354.syserr
[junit4] >>> JVM J0 emitted unexpected output (verbatim) ----
[junit4] Java HotSpot(TM) 64-Bit Server VM warning: Option UseConcMarkSweepGC was deprecated in version 9.0 and will likely be removed in a future release.
[junit4] <<< JVM J0: EOF ----
[...truncated 731 lines...]
[junit4] JVM J2: stderr was not empty, see: /home/jenkins/workspace/Lucene-Solr-master-Linux/solr/build/solr-solrj/test/temp/junit4-J2-20170212_144045_5337426359424122912630.syserr
[junit4] >>> JVM J2 emitted unexpected output (verbatim) ----
[junit4] Java HotSpot(TM) 64-Bit Server VM warning: Option UseConcMarkSweepGC was deprecated in version 9.0 and will likely be removed in a future release.
[junit4] <<< JVM J2: EOF ----
[junit4] JVM J1: stderr was not empty, see: /home/jenkins/workspace/Lucene-Solr-master-Linux/solr/build/solr-solrj/test/temp/junit4-J1-20170212_144045_5332187244446388919785.syserr
[junit4] >>> JVM J1 emitted unexpected output (verbatim) ----
[junit4] Java HotSpot(TM) 64-Bit Server VM warning: Option UseConcMarkSweepGC was deprecated in version 9.0 and will likely be removed in a future release.
[junit4] <<< JVM J1: EOF ----
[...truncated 3 lines...]
[junit4] JVM J0: stderr was not empty, see: /home/jenkins/workspace/Lucene-Solr-master-Linux/solr/build/solr-solrj/test/temp/junit4-J0-20170212_144045_53318233183234499540415.syserr
[junit4] >>> JVM J0 emitted unexpected output (verbatim) ----
[junit4] Java HotSpot(TM) 64-Bit Server VM warning: Option UseConcMarkSweepGC was deprecated in version 9.0 and will likely be removed in a future release.
[junit4] <<< JVM J0: EOF ----
[...truncated 1235 lines...]
[junit4] JVM J0: stderr was not empty, see: /home/jenkins/workspace/Lucene-Solr-master-Linux/solr/build/contrib/solr-analysis-extras/test/temp/junit4-J0-20170212_144335_9106698237490317461651.syserr
[junit4] >>> JVM J0 emitted unexpected output (verbatim) ----
[junit4] Java HotSpot(TM) 64-Bit Server VM warning: Option UseConcMarkSweepGC was deprecated in version 9.0 and will likely be removed in a future release.
[junit4] <<< JVM J0: EOF ----
[...truncated 3 lines...]
[junit4] JVM J1: stderr was not empty, see: /home/jenkins/workspace/Lucene-Solr-master-Linux/solr/build/contrib/solr-analysis-extras/test/temp/junit4-J1-20170212_144335_9104484454386226113146.syserr
[junit4] >>> JVM J1 emitted unexpected output (verbatim) ----
[junit4] Java HotSpot(TM) 64-Bit Server VM warning: Option UseConcMarkSweepGC was deprecated in version 9.0 and will likely be removed in a future release.
[junit4] <<< JVM J1: EOF ----
[...truncated 3 lines...]
[junit4] JVM J2: stderr was not empty, see: /home/jenkins/workspace/Lucene-Solr-master-Linux/solr/build/contrib/solr-analysis-extras/test/temp/junit4-J2-20170212_144335_91013471568689053260647.syserr
[junit4] >>> JVM J2 emitted unexpected output (verbatim) ----
[junit4] Java HotSpot(TM) 64-Bit Server VM warning: Option UseConcMarkSweepGC was deprecated in version 9.0 and will likely be removed in a future release.
[junit4] <<< JVM J2: EOF ----
[...truncated 520 lines...]
[junit4] JVM J1: stderr was not empty, see: /home/jenkins/workspace/Lucene-Solr-master-Linux/solr/build/contrib/solr-analytics/test/temp/junit4-J1-20170212_144346_2254162365520496331701.syserr
[junit4] >>> JVM J1 emitted unexpected output (verbatim) ----
[junit4] Java HotSpot(TM) 64-Bit Server VM warning: Option UseConcMarkSweepGC was deprecated in version 9.0 and will likely be removed in a future release.
[junit4] <<< JVM J1: EOF ----
[...truncated 6 lines...]
[junit4] JVM J2: stderr was not empty, see: /home/jenkins/workspace/Lucene-Solr-master-Linux/solr/build/contrib/solr-analytics/test/temp/junit4-J2-20170212_144346_2259729576435266949881.syserr
[junit4] >>> JVM J2 emitted unexpected output (verbatim) ----
[junit4] Java HotSpot(TM) 64-Bit Server VM warning: Option UseConcMarkSweepGC was deprecated in version 9.0 and will likely be removed in a future release.
[junit4] <<< JVM J2: EOF ----
[junit4] JVM J0: stderr was not empty, see: /home/jenkins/workspace/Lucene-Solr-master-Linux/solr/build/contrib/solr-analytics/test/temp/junit4-J0-20170212_144346_2256886390206281274565.syserr
[junit4] >>> JVM J0 emitted unexpected output (verbatim) ----
[junit4] Java HotSpot(TM) 64-Bit Server VM warning: Option UseConcMarkSweepGC was deprecated in version 9.0 and will likely be removed in a future release.
[junit4] <<< JVM J0: EOF ----
[...truncated 499 lines...]
[junit4] JVM J2: stderr was not empty, see: /home/jenkins/workspace/Lucene-Solr-master-Linux/solr/build/contrib/solr-clustering/test/temp/junit4-J2-20170212_144401_5644295309170811513081.syserr
[junit4] >>> JVM J2 emitted unexpected output (verbatim) ----
[junit4] Java HotSpot(TM) 64-Bit Server VM warning: Option UseConcMarkSweepGC was deprecated in version 9.0 and will likely be removed in a future release.
[junit4] <<< JVM J2: EOF ----
[...truncated 3 lines...]
[junit4] JVM J1: stderr was not empty, see: /home/jenkins/workspace/Lucene-Solr-master-Linux/solr/build/contrib/solr-clustering/test/temp/junit4-J1-20170212_144401_5648798872426042760574.syserr
[junit4] >>> JVM J1 emitted unexpected output (verbatim) ----
[junit4] Java HotSpot(TM) 64-Bit Server VM warning: Option UseConcMarkSweepGC was deprecated in version 9.0 and will likely be removed in a future release.
[junit4] <<< JVM J1: EOF ----
[...truncated 3 lines...]
[junit4] JVM J0: stderr was not empty, see: /home/jenkins/workspace/Lucene-Solr-master-Linux/solr/build/contrib/solr-clustering/test/temp/junit4-J0-20170212_144401_56417863495517331707690.syserr
[junit4] >>> JVM J0 emitted unexpected output (verbatim) ----
[junit4] Java HotSpot(TM) 64-Bit Server VM warning: Option UseConcMarkSweepGC was deprecated in version 9.0 and will likely be removed in a future release.
[junit4] <<< JVM J0: EOF ----
[...truncated 1131 lines...]
[junit4] JVM J1: stderr was not empty, see: /home/jenkins/workspace/Lucene-Solr-master-Linux/solr/build/contrib/solr-dataimporthandler-extras/test/temp/junit4-J1-20170212_144425_5439864367588061454530.syserr
[junit4] >>> JVM J1 emitted unexpected output (verbatim) ----
[junit4] Java HotSpot(TM) 64-Bit Server VM warning: Option UseConcMarkSweepGC was deprecated in version 9.0 and will likely be removed in a future release.
[junit4] <<< JVM J1: EOF ----
[...truncated 3 lines...]
[junit4] JVM J0: stderr was not empty, see: /home/jenkins/workspace/Lucene-Solr-master-Linux/solr/build/contrib/solr-dataimporthandler-extras/test/temp/junit4-J0-20170212_144425_5428151101777108643140.syserr
[junit4] >>> JVM J0 emitted unexpected output (verbatim) ----
[junit4] Java HotSpot(TM) 64-Bit Server VM warning: Option UseConcMarkSweepGC was deprecated in version 9.0 and will likely be removed in a future release.
[junit4] <<< JVM J0: EOF ----
[...truncated 590 lines...]
[junit4] JVM J2: stderr was not empty, see: /home/jenkins/workspace/Lucene-Solr-master-Linux/solr/build/contrib/solr-dataimporthandler/test/temp/junit4-J2-20170212_144434_96411678891146085925514.syserr
[junit4] >>> JVM J2 emitted unexpected output (verbatim) ----
[junit4] Java HotSpot(TM) 64-Bit Server VM warning: Option UseConcMarkSweepGC was deprecated in version 9.0 and will likely be removed in a future release.
[junit4] <<< JVM J2: EOF ----
[...truncated 3 lines...]
[junit4] JVM J0: stderr was not empty, see: /home/jenkins/workspace/Lucene-Solr-master-Linux/solr/build/contrib/solr-dataimporthandler/test/temp/junit4-J0-20170212_144434_9645882965294713048309.syserr
[junit4] >>> JVM J0 emitted unexpected output (verbatim) ----
[junit4] Java HotSpot(TM) 64-Bit Server VM warning: Option UseConcMarkSweepGC was deprecated in version 9.0 and will likely be removed in a future release.
[junit4] <<< JVM J0: EOF ----
[...truncated 3 lines...]
[junit4] JVM J1: stderr was not empty, see: /home/jenkins/workspace/Lucene-Solr-master-Linux/solr/build/contrib/solr-dataimporthandler/test/temp/junit4-J1-20170212_144434_96414517311342234015447.syserr
[junit4] >>> JVM J1 emitted unexpected output (verbatim) ----
[junit4] Java HotSpot(TM) 64-Bit Server VM warning: Option UseConcMarkSweepGC was deprecated in version 9.0 and will likely be removed in a future release.
[junit4] <<< JVM J1: EOF ----
[...truncated 503 lines...]
[junit4] JVM J0: stderr was not empty, see: /home/jenkins/workspace/Lucene-Solr-master-Linux/solr/build/contrib/solr-cell/test/temp/junit4-J0-20170212_144501_5383416264650824432356.syserr
[junit4] >>> JVM J0 emitted unexpected output (verbatim) ----
[junit4] Java HotSpot(TM) 64-Bit Server VM warning: Option UseConcMarkSweepGC was deprecated in version 9.0 and will likely be removed in a future release.
[junit4] <<< JVM J0: EOF ----
[...truncated 3 lines...]
[junit4] JVM J2: stderr was not empty, see: /home/jenkins/workspace/Lucene-Solr-master-Linux/solr/build/contrib/solr-cell/test/temp/junit4-J2-20170212_144501_54013836681289674535472.syserr
[junit4] >>> JVM J2 emitted unexpected output (verbatim) ----
[junit4] Java HotSpot(TM) 64-Bit Server VM warning: Option UseConcMarkSweepGC was deprecated in version 9.0 and will likely be removed in a future release.
[junit4] <<< JVM J2: EOF ----
[...truncated 3 lines...]
[junit4] JVM J1: stderr was not empty, see: /home/jenkins/workspace/Lucene-Solr-master-Linux/solr/build/contrib/solr-cell/test/temp/junit4-J1-20170212_144501_5409040403673751449234.syserr
[junit4] >>> JVM J1 emitted unexpected output (verbatim) ----
[junit4] Java HotSpot(TM) 64-Bit Server VM warning: Option UseConcMarkSweepGC was deprecated in version 9.0 and will likely be removed in a future release.
[junit4] <<< JVM J1: EOF ----
[...truncated 504 lines...]
[junit4] JVM J1: stderr was not empty, see: /home/jenkins/workspace/Lucene-Solr-master-Linux/solr/build/contrib/solr-langid/test/temp/junit4-J1-20170212_144516_2169752509149878967440.syserr
[junit4] >>> JVM J1 emitted unexpected output (verbatim) ----
[junit4] Java HotSpot(TM) 64-Bit Server VM warning: Option UseConcMarkSweepGC was deprecated in version 9.0 and will likely be removed in a future release.
[junit4] <<< JVM J1: EOF ----
[...truncated 3 lines...]
[junit4] JVM J0: stderr was not empty, see: /home/jenkins/workspace/Lucene-Solr-master-Linux/solr/build/contrib/solr-langid/test/temp/junit4-J0-20170212_144516_2167869081493177530692.syserr
[junit4] >>> JVM J0 emitted unexpected output (verbatim) ----
[junit4] Java HotSpot(TM) 64-Bit Server VM warning: Option UseConcMarkSweepGC was deprecated in version 9.0 and will likely be removed in a future release.
[junit4] <<< JVM J0: EOF ----
[...truncated 578 lines...]
[junit4] JVM J2: stderr was not empty, see: /home/jenkins/workspace/Lucene-Solr-master-Linux/solr/build/contrib/solr-ltr/test/temp/junit4-J2-20170212_144524_6271960250862435375114.syserr
[junit4] >>> JVM J2 emitted unexpected output (verbatim) ----
[junit4] Java HotSpot(TM) 64-Bit Server VM warning: Option UseConcMarkSweepGC was deprecated in version 9.0 and will likely be removed in a future release.
[junit4] <<< JVM J2: EOF ----
[...truncated 3 lines...]
[junit4] JVM J1: stderr was not empty, see: /home/jenkins/workspace/Lucene-Solr-master-Linux/solr/build/contrib/solr-ltr/test/temp/junit4-J1-20170212_144524_6272981164213931482125.syserr
[junit4] >>> JVM J1 emitted unexpected output (verbatim) ----
[junit4] Java HotSpot(TM) 64-Bit Server VM warning: Option UseConcMarkSweepGC was deprecated in version 9.0 and will likely be removed in a future release.
[junit4] <<< JVM J1: EOF ----
[...truncated 15 lines...]
[junit4] JVM J0: stderr was not empty, see: /home/jenkins/workspace/Lucene-Solr-master-Linux/solr/build/contrib/solr-ltr/test/temp/junit4-J0-20170212_144524_62711638577482239611700.syserr
[junit4] >>> JVM J0 emitted unexpected output (verbatim) ----
[junit4] Java HotSpot(TM) 64-Bit Server VM warning: Option UseConcMarkSweepGC was deprecated in version 9.0 and will likely be removed in a future release.
[junit4] <<< JVM J0: EOF ----
[...truncated 2200 lines...]
[junit4] JVM J0: stderr was not empty, see: /home/jenkins/workspace/Lucene-Solr-master-Linux/solr/build/contrib/solr-map-reduce/test/temp/junit4-J0-20170212_144616_52510916362091383493313.syserr
[junit4] >>> JVM J0 emitted unexpected output (verbatim) ----
[junit4] Java HotSpot(TM) 64-Bit Server VM warning: Option UseConcMarkSweepGC was deprecated in version 9.0 and will likely be removed in a future release.
[junit4] <<< JVM J0: EOF ----
[junit4] JVM J2: stderr was not empty, see: /home/jenkins/workspace/Lucene-Solr-master-Linux/solr/build/contrib/solr-map-reduce/test/temp/junit4-J2-20170212_144616_52616555027160837605735.syserr
[junit4] >>> JVM J2 emitted unexpected output (verbatim) ----
[junit4] Java HotSpot(TM) 64-Bit Server VM warning: Option UseConcMarkSweepGC was deprecated in version 9.0 and will likely be removed in a future release.
[junit4] <<< JVM J2: EOF ----
[...truncated 3 lines...]
[junit4] JVM J1: stderr was not empty, see: /home/jenkins/workspace/Lucene-Solr-master-Linux/solr/build/contrib/solr-map-reduce/test/temp/junit4-J1-20170212_144616_5261303212695490287714.syserr
[junit4] >>> JVM J1 emitted unexpected output (verbatim) ----
[junit4] Java HotSpot(TM) 64-Bit Server VM warning: Option UseConcMarkSweepGC was deprecated in version 9.0 and will likely be removed in a future release.
[junit4] <<< JVM J1: EOF ----
[...truncated 1429 lines...]
[junit4] JVM J0: stderr was not empty, see: /home/jenkins/workspace/Lucene-Solr-master-Linux/solr/build/contrib/solr-morphlines-cell/test/temp/junit4-J0-20170212_144628_59815589860279562106561.syserr
[junit4] >>> JVM J0 emitted unexpected output (verbatim) ----
[junit4] Java HotSpot(TM) 64-Bit Server VM warning: Option UseConcMarkSweepGC was deprecated in version 9.0 and will likely be removed in a future release.
[junit4] <<< JVM J0: EOF ----
[...truncated 666 lines...]
[junit4] JVM J1: stderr was not empty, see: /home/jenkins/workspace/Lucene-Solr-master-Linux/solr/build/contrib/solr-morphlines-core/test/temp/junit4-J1-20170212_144634_051818346752010237989.syserr
[junit4] >>> JVM J1 emitted unexpected output (verbatim) ----
[junit4] Java HotSpot(TM) 64-Bit Server VM warning: Option UseConcMarkSweepGC was deprecated in version 9.0 and will likely be removed in a future release.
[junit4] <<< JVM J1: EOF ----
[...truncated 3 lines...]
[junit4] JVM J0: stderr was not empty, see: /home/jenkins/workspace/Lucene-Solr-master-Linux/solr/build/contrib/solr-morphlines-core/test/temp/junit4-J0-20170212_144634_05111643854807475746127.syserr
[junit4] >>> JVM J0 emitted unexpected output (verbatim) ----
[junit4] Java HotSpot(TM) 64-Bit Server VM warning: Option UseConcMarkSweepGC was deprecated in version 9.0 and will likely be removed in a future release.
[junit4] <<< JVM J0: EOF ----
[...truncated 3 lines...]
[junit4] JVM J2: stderr was not empty, see: /home/jenkins/workspace/Lucene-Solr-master-Linux/solr/build/contrib/solr-morphlines-core/test/temp/junit4-J2-20170212_144634_0515233106575480433397.syserr
[junit4] >>> JVM J2 emitted unexpected output (verbatim) ----
[junit4] Java HotSpot(TM) 64-Bit Server VM warning: Option UseConcMarkSweepGC was deprecated in version 9.0 and will likely be removed in a future release.
[junit4] <<< JVM J2: EOF ----
[...truncated 537 lines...]
[junit4] JVM J1: stderr was not empty, see: /home/jenkins/workspace/Lucene-Solr-master-Linux/solr/build/contrib/solr-uima/test/temp/junit4-J1-20170212_144655_86987414438091619810.syserr
[junit4] >>> JVM J1 emitted unexpected output (verbatim) ----
[junit4] Java HotSpot(TM) 64-Bit Server VM warning: Option UseConcMarkSweepGC was deprecated in version 9.0 and will likely be removed in a future release.
[junit4] <<< JVM J1: EOF ----
[...truncated 3 lines...]
[junit4] JVM J0: stderr was not empty, see: /home/jenkins/workspace/Lucene-Solr-master-Linux/solr/build/contrib/solr-uima/test/temp/junit4-J0-20170212_144655_86814522503175936823715.syserr
[junit4] >>> JVM J0 emitted unexpected output (verbatim) ----
[junit4] Java HotSpot(TM) 64-Bit Server VM warning: Option UseConcMarkSweepGC was deprecated in version 9.0 and will likely be removed in a future release.
[junit4] <<< JVM J0: EOF ----
[...truncated 494 lines...]
[junit4] JVM J0: stderr was not empty, see: /home/jenkins/workspace/Lucene-Solr-master-Linux/solr/build/contrib/solr-velocity/test/temp/junit4-J0-20170212_144708_70016886156715960622822.syserr
[junit4] >>> JVM J0 emitted unexpected output (verbatim) ----
[junit4] Java HotSpot(TM) 64-Bit Server VM warning: Option UseConcMarkSweepGC was deprecated in version 9.0 and will likely be removed in a future release.
[junit4] <<< JVM J0: EOF ----
[...truncated 39922 lines...]
[JENKINS-EA] Lucene-Solr-master-Linux (32bit/jdk-9-ea+155) - Build
# 18947 - Still unstable!
Posted by Policeman Jenkins Server <je...@thetaphi.de>.
Build: https://jenkins.thetaphi.de/job/Lucene-Solr-master-Linux/18947/
Java: 32bit/jdk-9-ea+155 -server -XX:+UseSerialGC
2 tests failed.
FAILED: org.apache.solr.handler.admin.TestApiFramework.testFramework
Error Message:
Stack Trace:
java.lang.ExceptionInInitializerError
at __randomizedtesting.SeedInfo.seed([2821988BDCC391A6:3F5752ACDA177D9B]:0)
at net.sf.cglib.core.KeyFactory$Generator.generateClass(KeyFactory.java:166)
at net.sf.cglib.core.DefaultGeneratorStrategy.generate(DefaultGeneratorStrategy.java:25)
at net.sf.cglib.core.AbstractClassGenerator.create(AbstractClassGenerator.java:216)
at net.sf.cglib.core.KeyFactory$Generator.create(KeyFactory.java:144)
at net.sf.cglib.core.KeyFactory.create(KeyFactory.java:116)
at net.sf.cglib.core.KeyFactory.create(KeyFactory.java:108)
at net.sf.cglib.core.KeyFactory.create(KeyFactory.java:104)
at net.sf.cglib.proxy.Enhancer.<clinit>(Enhancer.java:69)
at org.easymock.internal.ClassProxyFactory.createEnhancer(ClassProxyFactory.java:259)
at org.easymock.internal.ClassProxyFactory.createProxy(ClassProxyFactory.java:174)
at org.easymock.internal.MocksControl.createMock(MocksControl.java:60)
at org.easymock.EasyMock.createMock(EasyMock.java:104)
at org.apache.solr.handler.admin.TestCoreAdminApis.getCoreContainerMock(TestCoreAdminApis.java:76)
at org.apache.solr.handler.admin.TestApiFramework.testFramework(TestApiFramework.java:59)
at java.base/jdk.internal.reflect.NativeMethodAccessorImpl.invoke0(Native Method)
at java.base/jdk.internal.reflect.NativeMethodAccessorImpl.invoke(NativeMethodAccessorImpl.java:62)
at java.base/jdk.internal.reflect.DelegatingMethodAccessorImpl.invoke(DelegatingMethodAccessorImpl.java:43)
at java.base/java.lang.reflect.Method.invoke(Method.java:543)
at com.carrotsearch.randomizedtesting.RandomizedRunner.invoke(RandomizedRunner.java:1713)
at com.carrotsearch.randomizedtesting.RandomizedRunner$8.evaluate(RandomizedRunner.java:907)
at com.carrotsearch.randomizedtesting.RandomizedRunner$9.evaluate(RandomizedRunner.java:943)
at com.carrotsearch.randomizedtesting.RandomizedRunner$10.evaluate(RandomizedRunner.java:957)
at com.carrotsearch.randomizedtesting.rules.SystemPropertiesRestoreRule$1.evaluate(SystemPropertiesRestoreRule.java:57)
at org.apache.lucene.util.TestRuleSetupTeardownChained$1.evaluate(TestRuleSetupTeardownChained.java:49)
at org.apache.lucene.util.AbstractBeforeAfterRule$1.evaluate(AbstractBeforeAfterRule.java:45)
at org.apache.lucene.util.TestRuleThreadAndTestName$1.evaluate(TestRuleThreadAndTestName.java:48)
at org.apache.lucene.util.TestRuleIgnoreAfterMaxFailures$1.evaluate(TestRuleIgnoreAfterMaxFailures.java:64)
at org.apache.lucene.util.TestRuleMarkFailure$1.evaluate(TestRuleMarkFailure.java:47)
at com.carrotsearch.randomizedtesting.rules.StatementAdapter.evaluate(StatementAdapter.java:36)
at com.carrotsearch.randomizedtesting.ThreadLeakControl$StatementRunner.run(ThreadLeakControl.java:368)
at com.carrotsearch.randomizedtesting.ThreadLeakControl.forkTimeoutingTask(ThreadLeakControl.java:817)
at com.carrotsearch.randomizedtesting.ThreadLeakControl$3.evaluate(ThreadLeakControl.java:468)
at com.carrotsearch.randomizedtesting.RandomizedRunner.runSingleTest(RandomizedRunner.java:916)
at com.carrotsearch.randomizedtesting.RandomizedRunner$5.evaluate(RandomizedRunner.java:802)
at com.carrotsearch.randomizedtesting.RandomizedRunner$6.evaluate(RandomizedRunner.java:852)
at com.carrotsearch.randomizedtesting.RandomizedRunner$7.evaluate(RandomizedRunner.java:863)
at com.carrotsearch.randomizedtesting.rules.StatementAdapter.evaluate(StatementAdapter.java:36)
at com.carrotsearch.randomizedtesting.rules.SystemPropertiesRestoreRule$1.evaluate(SystemPropertiesRestoreRule.java:57)
at org.apache.lucene.util.AbstractBeforeAfterRule$1.evaluate(AbstractBeforeAfterRule.java:45)
at com.carrotsearch.randomizedtesting.rules.StatementAdapter.evaluate(StatementAdapter.java:36)
at org.apache.lucene.util.TestRuleStoreClassName$1.evaluate(TestRuleStoreClassName.java:41)
at com.carrotsearch.randomizedtesting.rules.NoShadowingOrOverridesOnMethodsRule$1.evaluate(NoShadowingOrOverridesOnMethodsRule.java:40)
at com.carrotsearch.randomizedtesting.rules.NoShadowingOrOverridesOnMethodsRule$1.evaluate(NoShadowingOrOverridesOnMethodsRule.java:40)
at com.carrotsearch.randomizedtesting.rules.StatementAdapter.evaluate(StatementAdapter.java:36)
at com.carrotsearch.randomizedtesting.rules.StatementAdapter.evaluate(StatementAdapter.java:36)
at org.apache.lucene.util.TestRuleAssertionsRequired$1.evaluate(TestRuleAssertionsRequired.java:53)
at org.apache.lucene.util.TestRuleMarkFailure$1.evaluate(TestRuleMarkFailure.java:47)
at org.apache.lucene.util.TestRuleIgnoreAfterMaxFailures$1.evaluate(TestRuleIgnoreAfterMaxFailures.java:64)
at org.apache.lucene.util.TestRuleIgnoreTestSuites$1.evaluate(TestRuleIgnoreTestSuites.java:54)
at com.carrotsearch.randomizedtesting.rules.StatementAdapter.evaluate(StatementAdapter.java:36)
at com.carrotsearch.randomizedtesting.ThreadLeakControl$StatementRunner.run(ThreadLeakControl.java:368)
at java.base/java.lang.Thread.run(Thread.java:844)
Caused by: java.lang.reflect.InaccessibleObjectException: Unable to make protected final java.lang.Class java.lang.ClassLoader.defineClass(java.lang.String,byte[],int,int,java.security.ProtectionDomain) throws java.lang.ClassFormatError accessible: module java.base does not "opens java.lang" to unnamed module @18670f6
at java.base/java.lang.reflect.AccessibleObject.checkCanSetAccessible(AccessibleObject.java:207)
at java.base/java.lang.reflect.Method.checkCanSetAccessible(Method.java:192)
at java.base/java.lang.reflect.Method.setAccessible(Method.java:186)
at net.sf.cglib.core.ReflectUtils$2.run(ReflectUtils.java:56)
at java.base/java.security.AccessController.doPrivileged(Native Method)
at net.sf.cglib.core.ReflectUtils.<clinit>(ReflectUtils.java:46)
... 52 more
FAILED: org.apache.solr.handler.admin.TestCoreAdminApis.testCalls
Error Message:
Stack Trace:
java.lang.ExceptionInInitializerError
at __randomizedtesting.SeedInfo.seed([2821988BDCC391A6:1AE087E0594F2201]:0)
at net.sf.cglib.core.KeyFactory$Generator.generateClass(KeyFactory.java:166)
at net.sf.cglib.core.DefaultGeneratorStrategy.generate(DefaultGeneratorStrategy.java:25)
at net.sf.cglib.core.AbstractClassGenerator.create(AbstractClassGenerator.java:216)
at net.sf.cglib.core.KeyFactory$Generator.create(KeyFactory.java:144)
at net.sf.cglib.core.KeyFactory.create(KeyFactory.java:116)
at net.sf.cglib.core.KeyFactory.create(KeyFactory.java:108)
at net.sf.cglib.core.KeyFactory.create(KeyFactory.java:104)
at net.sf.cglib.proxy.Enhancer.<clinit>(Enhancer.java:69)
at org.easymock.internal.ClassProxyFactory.createEnhancer(ClassProxyFactory.java:259)
at org.easymock.internal.ClassProxyFactory.createProxy(ClassProxyFactory.java:174)
at org.easymock.internal.MocksControl.createMock(MocksControl.java:60)
at org.easymock.EasyMock.createMock(EasyMock.java:104)
at org.apache.solr.handler.admin.TestCoreAdminApis.getCoreContainerMock(TestCoreAdminApis.java:76)
at org.apache.solr.handler.admin.TestCoreAdminApis.testCalls(TestCoreAdminApis.java:43)
at java.base/jdk.internal.reflect.NativeMethodAccessorImpl.invoke0(Native Method)
at java.base/jdk.internal.reflect.NativeMethodAccessorImpl.invoke(NativeMethodAccessorImpl.java:62)
at java.base/jdk.internal.reflect.DelegatingMethodAccessorImpl.invoke(DelegatingMethodAccessorImpl.java:43)
at java.base/java.lang.reflect.Method.invoke(Method.java:543)
at com.carrotsearch.randomizedtesting.RandomizedRunner.invoke(RandomizedRunner.java:1713)
at com.carrotsearch.randomizedtesting.RandomizedRunner$8.evaluate(RandomizedRunner.java:907)
at com.carrotsearch.randomizedtesting.RandomizedRunner$9.evaluate(RandomizedRunner.java:943)
at com.carrotsearch.randomizedtesting.RandomizedRunner$10.evaluate(RandomizedRunner.java:957)
at com.carrotsearch.randomizedtesting.rules.SystemPropertiesRestoreRule$1.evaluate(SystemPropertiesRestoreRule.java:57)
at org.apache.lucene.util.TestRuleSetupTeardownChained$1.evaluate(TestRuleSetupTeardownChained.java:49)
at org.apache.lucene.util.AbstractBeforeAfterRule$1.evaluate(AbstractBeforeAfterRule.java:45)
at org.apache.lucene.util.TestRuleThreadAndTestName$1.evaluate(TestRuleThreadAndTestName.java:48)
at org.apache.lucene.util.TestRuleIgnoreAfterMaxFailures$1.evaluate(TestRuleIgnoreAfterMaxFailures.java:64)
at org.apache.lucene.util.TestRuleMarkFailure$1.evaluate(TestRuleMarkFailure.java:47)
at com.carrotsearch.randomizedtesting.rules.StatementAdapter.evaluate(StatementAdapter.java:36)
at com.carrotsearch.randomizedtesting.ThreadLeakControl$StatementRunner.run(ThreadLeakControl.java:368)
at com.carrotsearch.randomizedtesting.ThreadLeakControl.forkTimeoutingTask(ThreadLeakControl.java:817)
at com.carrotsearch.randomizedtesting.ThreadLeakControl$3.evaluate(ThreadLeakControl.java:468)
at com.carrotsearch.randomizedtesting.RandomizedRunner.runSingleTest(RandomizedRunner.java:916)
at com.carrotsearch.randomizedtesting.RandomizedRunner$5.evaluate(RandomizedRunner.java:802)
at com.carrotsearch.randomizedtesting.RandomizedRunner$6.evaluate(RandomizedRunner.java:852)
at com.carrotsearch.randomizedtesting.RandomizedRunner$7.evaluate(RandomizedRunner.java:863)
at com.carrotsearch.randomizedtesting.rules.StatementAdapter.evaluate(StatementAdapter.java:36)
at com.carrotsearch.randomizedtesting.rules.SystemPropertiesRestoreRule$1.evaluate(SystemPropertiesRestoreRule.java:57)
at org.apache.lucene.util.AbstractBeforeAfterRule$1.evaluate(AbstractBeforeAfterRule.java:45)
at com.carrotsearch.randomizedtesting.rules.StatementAdapter.evaluate(StatementAdapter.java:36)
at org.apache.lucene.util.TestRuleStoreClassName$1.evaluate(TestRuleStoreClassName.java:41)
at com.carrotsearch.randomizedtesting.rules.NoShadowingOrOverridesOnMethodsRule$1.evaluate(NoShadowingOrOverridesOnMethodsRule.java:40)
at com.carrotsearch.randomizedtesting.rules.NoShadowingOrOverridesOnMethodsRule$1.evaluate(NoShadowingOrOverridesOnMethodsRule.java:40)
at com.carrotsearch.randomizedtesting.rules.StatementAdapter.evaluate(StatementAdapter.java:36)
at com.carrotsearch.randomizedtesting.rules.StatementAdapter.evaluate(StatementAdapter.java:36)
at org.apache.lucene.util.TestRuleAssertionsRequired$1.evaluate(TestRuleAssertionsRequired.java:53)
at org.apache.lucene.util.TestRuleMarkFailure$1.evaluate(TestRuleMarkFailure.java:47)
at org.apache.lucene.util.TestRuleIgnoreAfterMaxFailures$1.evaluate(TestRuleIgnoreAfterMaxFailures.java:64)
at org.apache.lucene.util.TestRuleIgnoreTestSuites$1.evaluate(TestRuleIgnoreTestSuites.java:54)
at com.carrotsearch.randomizedtesting.rules.StatementAdapter.evaluate(StatementAdapter.java:36)
at com.carrotsearch.randomizedtesting.ThreadLeakControl$StatementRunner.run(ThreadLeakControl.java:368)
at java.base/java.lang.Thread.run(Thread.java:844)
Caused by: java.lang.reflect.InaccessibleObjectException: Unable to make protected final java.lang.Class java.lang.ClassLoader.defineClass(java.lang.String,byte[],int,int,java.security.ProtectionDomain) throws java.lang.ClassFormatError accessible: module java.base does not "opens java.lang" to unnamed module @22bef9
at java.base/java.lang.reflect.AccessibleObject.checkCanSetAccessible(AccessibleObject.java:207)
at java.base/java.lang.reflect.Method.checkCanSetAccessible(Method.java:192)
at java.base/java.lang.reflect.Method.setAccessible(Method.java:186)
at net.sf.cglib.core.ReflectUtils$2.run(ReflectUtils.java:56)
at java.base/java.security.AccessController.doPrivileged(Native Method)
at net.sf.cglib.core.ReflectUtils.<clinit>(ReflectUtils.java:46)
... 52 more
Build Log:
[...truncated 11480 lines...]
[junit4] Suite: org.apache.solr.handler.admin.TestApiFramework
[junit4] 2> Creating dataDir: /home/jenkins/workspace/Lucene-Solr-master-Linux/solr/build/solr-core/test/J2/temp/solr.handler.admin.TestApiFramework_2821988BDCC391A6-001/init-core-data-001
[junit4] 2> 725212 INFO (SUITE-TestApiFramework-seed#[2821988BDCC391A6]-worker) [ ] o.a.s.SolrTestCaseJ4 Using PointFields
[junit4] 2> 725214 INFO (SUITE-TestApiFramework-seed#[2821988BDCC391A6]-worker) [ ] o.a.s.SolrTestCaseJ4 Randomized ssl (false) and clientAuth (true) via: @org.apache.solr.util.RandomizeSSL(reason="", ssl=0.0/0.0, value=0.0/0.0, clientAuth=0.0/0.0)
[junit4] 2> 725215 INFO (TEST-TestApiFramework.testTrailingTemplatePaths-seed#[2821988BDCC391A6]) [ ] o.a.s.SolrTestCaseJ4 ###Starting testTrailingTemplatePaths
[junit4] 2> 725215 INFO (TEST-TestApiFramework.testTrailingTemplatePaths-seed#[2821988BDCC391A6]) [ ] o.a.s.SolrTestCaseJ4 ###Ending testTrailingTemplatePaths
[junit4] 2> 725216 INFO (TEST-TestApiFramework.testFramework-seed#[2821988BDCC391A6]) [ ] o.a.s.SolrTestCaseJ4 ###Starting testFramework
[junit4] 2> 725253 INFO (TEST-TestApiFramework.testFramework-seed#[2821988BDCC391A6]) [ ] o.a.s.SolrTestCaseJ4 ###Ending testFramework
[junit4] 2> NOTE: reproduce with: ant test -Dtestcase=TestApiFramework -Dtests.method=testFramework -Dtests.seed=2821988BDCC391A6 -Dtests.multiplier=3 -Dtests.slow=true -Dtests.locale=en-PH -Dtests.timezone=Asia/Macau -Dtests.asserts=true -Dtests.file.encoding=ISO-8859-1
[junit4] ERROR 0.04s J2 | TestApiFramework.testFramework <<<
[junit4] > Throwable #1: java.lang.ExceptionInInitializerError
[junit4] > at __randomizedtesting.SeedInfo.seed([2821988BDCC391A6:3F5752ACDA177D9B]:0)
[junit4] > at net.sf.cglib.core.KeyFactory$Generator.generateClass(KeyFactory.java:166)
[junit4] > at net.sf.cglib.core.DefaultGeneratorStrategy.generate(DefaultGeneratorStrategy.java:25)
[junit4] > at net.sf.cglib.core.AbstractClassGenerator.create(AbstractClassGenerator.java:216)
[junit4] > at net.sf.cglib.core.KeyFactory$Generator.create(KeyFactory.java:144)
[junit4] > at net.sf.cglib.core.KeyFactory.create(KeyFactory.java:116)
[junit4] > at net.sf.cglib.core.KeyFactory.create(KeyFactory.java:108)
[junit4] > at net.sf.cglib.core.KeyFactory.create(KeyFactory.java:104)
[junit4] > at net.sf.cglib.proxy.Enhancer.<clinit>(Enhancer.java:69)
[junit4] > at org.easymock.internal.ClassProxyFactory.createEnhancer(ClassProxyFactory.java:259)
[junit4] > at org.easymock.internal.ClassProxyFactory.createProxy(ClassProxyFactory.java:174)
[junit4] > at org.easymock.internal.MocksControl.createMock(MocksControl.java:60)
[junit4] > at org.easymock.EasyMock.createMock(EasyMock.java:104)
[junit4] > at org.apache.solr.handler.admin.TestCoreAdminApis.getCoreContainerMock(TestCoreAdminApis.java:76)
[junit4] > at org.apache.solr.handler.admin.TestApiFramework.testFramework(TestApiFramework.java:59)
[junit4] > at java.base/jdk.internal.reflect.NativeMethodAccessorImpl.invoke0(Native Method)
[junit4] > at java.base/jdk.internal.reflect.NativeMethodAccessorImpl.invoke(NativeMethodAccessorImpl.java:62)
[junit4] > at java.base/jdk.internal.reflect.DelegatingMethodAccessorImpl.invoke(DelegatingMethodAccessorImpl.java:43)
[junit4] > at java.base/java.lang.reflect.Method.invoke(Method.java:543)
[junit4] > at java.base/java.lang.Thread.run(Thread.java:844)
[junit4] > Caused by: java.lang.reflect.InaccessibleObjectException: Unable to make protected final java.lang.Class java.lang.ClassLoader.defineClass(java.lang.String,byte[],int,int,java.security.ProtectionDomain) throws java.lang.ClassFormatError accessible: module java.base does not "opens java.lang" to unnamed module @18670f6
[junit4] > at java.base/java.lang.reflect.AccessibleObject.checkCanSetAccessible(AccessibleObject.java:207)
[junit4] > at java.base/java.lang.reflect.Method.checkCanSetAccessible(Method.java:192)
[junit4] > at java.base/java.lang.reflect.Method.setAccessible(Method.java:186)
[junit4] > at net.sf.cglib.core.ReflectUtils$2.run(ReflectUtils.java:56)
[junit4] > at java.base/java.security.AccessController.doPrivileged(Native Method)
[junit4] > at net.sf.cglib.core.ReflectUtils.<clinit>(ReflectUtils.java:46)
[junit4] > ... 52 more
[junit4] 2> 725255 INFO (SUITE-TestApiFramework-seed#[2821988BDCC391A6]-worker) [ ] o.a.s.SolrTestCaseJ4 ###deleteCore
[junit4] 2> NOTE: leaving temporary files on disk at: /home/jenkins/workspace/Lucene-Solr-master-Linux/solr/build/solr-core/test/J2/temp/solr.handler.admin.TestApiFramework_2821988BDCC391A6-001
[junit4] 2> NOTE: test params are: codec=CheapBastard, sim=RandomSimilarity(queryNorm=true): {}, locale=en-PH, timezone=Asia/Macau
[junit4] 2> NOTE: Linux 4.4.0-53-generic i386/Oracle Corporation 9-ea (32-bit)/cpus=12,threads=1,free=99021080,total=308232192
[junit4] 2> NOTE: All tests run in this JVM: [LeaderElectionTest, TestRawTransformer, SubstringBytesRefFilterTest, TestFieldCacheSanityChecker, TestRandomFlRTGCloud, SolrXmlInZkTest, TestFastOutputStream, OverseerRolesTest, TestLeaderElectionWithEmptyReplica, TestCloudManagedSchema, TestSort, TestDocTermOrds, TestMacroExpander, DebugComponentTest, HdfsChaosMonkeySafeLeaderTest, SolrMetricReporterTest, TestTrieFacet, DocValuesNotIndexedTest, TestJavabinTupleStreamParser, TestLRUStatsCache, HdfsBasicDistributedZk2Test, ExternalFileFieldSortTest, BinaryUpdateRequestHandlerTest, TestReload, UnloadDistributedZkTest, TestMergePolicyConfig, TestSolrCloudWithSecureImpersonation, CircularListTest, LeaderInitiatedRecoveryOnCommitTest, TestSubQueryTransformer, TestIndexSearcher, TestSmileRequest, TestStressLiveNodes, TestHdfsBackupRestoreCore, ClassificationUpdateProcessorFactoryTest, TestPHPSerializedResponseWriter, OverseerTest, TestBinaryField, RecoveryZkTest, TestDistribIDF, TestQuerySenderNoQuery, TestManagedSchemaThreadSafety, SolrTestCaseJ4Test, HdfsRecoverLeaseTest, TestClassicSimilarityFactory, TestCloudInspectUtil, AddBlockUpdateTest, TestHighFrequencyDictionaryFactory, CoreAdminHandlerTest, BooleanFieldTest, MissingSegmentRecoveryTest, TestCoreDiscovery, TestTestInjection, SliceStateTest, TestLocalFSCloudBackupRestore, TestSSLRandomization, TestSolrFieldCacheMBean, FullSolrCloudDistribCmdsTest, CollectionsAPIAsyncDistributedZkTest, SuggesterTest, DataDrivenBlockJoinTest, TestCryptoKeys, HdfsSyncSliceTest, TestClusterStateMutator, CurrencyFieldXmlFileTest, UUIDUpdateProcessorFallbackTest, SolrPluginUtilsTest, TestImpersonationWithHadoopAuth, AliasIntegrationTest, FieldAnalysisRequestHandlerTest, TestInitParams, TestApiFramework]
[junit4] Completed [211/694 (1!)] on J2 in 0.05s, 2 tests, 1 error <<< FAILURES!
[...truncated 1145 lines...]
[junit4] Suite: org.apache.solr.handler.admin.TestCoreAdminApis
[junit4] 2> Creating dataDir: /home/jenkins/workspace/Lucene-Solr-master-Linux/solr/build/solr-core/test/J1/temp/solr.handler.admin.TestCoreAdminApis_2821988BDCC391A6-001/init-core-data-001
[junit4] 2> 2193747 INFO (SUITE-TestCoreAdminApis-seed#[2821988BDCC391A6]-worker) [ ] o.a.s.SolrTestCaseJ4 Using PointFields
[junit4] 2> 2193748 INFO (SUITE-TestCoreAdminApis-seed#[2821988BDCC391A6]-worker) [ ] o.a.s.SolrTestCaseJ4 Randomized ssl (true) and clientAuth (false) via: @org.apache.solr.util.RandomizeSSL(reason="", ssl=0.0/0.0, value=0.0/0.0, clientAuth=0.0/0.0)
[junit4] 2> 2193750 INFO (TEST-TestCoreAdminApis.testCalls-seed#[2821988BDCC391A6]) [ ] o.a.s.SolrTestCaseJ4 ###Starting testCalls
[junit4] 2> 2193792 INFO (TEST-TestCoreAdminApis.testCalls-seed#[2821988BDCC391A6]) [ ] o.a.s.SolrTestCaseJ4 ###Ending testCalls
[junit4] 2> NOTE: reproduce with: ant test -Dtestcase=TestCoreAdminApis -Dtests.method=testCalls -Dtests.seed=2821988BDCC391A6 -Dtests.multiplier=3 -Dtests.slow=true -Dtests.locale=sk-SK -Dtests.timezone=America/Santiago -Dtests.asserts=true -Dtests.file.encoding=ISO-8859-1
[junit4] ERROR 0.05s J1 | TestCoreAdminApis.testCalls <<<
[junit4] > Throwable #1: java.lang.ExceptionInInitializerError
[junit4] > at __randomizedtesting.SeedInfo.seed([2821988BDCC391A6:1AE087E0594F2201]:0)
[junit4] > at net.sf.cglib.core.KeyFactory$Generator.generateClass(KeyFactory.java:166)
[junit4] > at net.sf.cglib.core.DefaultGeneratorStrategy.generate(DefaultGeneratorStrategy.java:25)
[junit4] > at net.sf.cglib.core.AbstractClassGenerator.create(AbstractClassGenerator.java:216)
[junit4] > at net.sf.cglib.core.KeyFactory$Generator.create(KeyFactory.java:144)
[junit4] > at net.sf.cglib.core.KeyFactory.create(KeyFactory.java:116)
[junit4] > at net.sf.cglib.core.KeyFactory.create(KeyFactory.java:108)
[junit4] > at net.sf.cglib.core.KeyFactory.create(KeyFactory.java:104)
[junit4] > at net.sf.cglib.proxy.Enhancer.<clinit>(Enhancer.java:69)
[junit4] > at org.easymock.internal.ClassProxyFactory.createEnhancer(ClassProxyFactory.java:259)
[junit4] > at org.easymock.internal.ClassProxyFactory.createProxy(ClassProxyFactory.java:174)
[junit4] > at org.easymock.internal.MocksControl.createMock(MocksControl.java:60)
[junit4] > at org.easymock.EasyMock.createMock(EasyMock.java:104)
[junit4] > at org.apache.solr.handler.admin.TestCoreAdminApis.getCoreContainerMock(TestCoreAdminApis.java:76)
[junit4] > at org.apache.solr.handler.admin.TestCoreAdminApis.testCalls(TestCoreAdminApis.java:43)
[junit4] > at java.base/jdk.internal.reflect.NativeMethodAccessorImpl.invoke0(Native Method)
[junit4] > at java.base/jdk.internal.reflect.NativeMethodAccessorImpl.invoke(NativeMethodAccessorImpl.java:62)
[junit4] > at java.base/jdk.internal.reflect.DelegatingMethodAccessorImpl.invoke(DelegatingMethodAccessorImpl.java:43)
[junit4] > at java.base/java.lang.reflect.Method.invoke(Method.java:543)
[junit4] > at java.base/java.lang.Thread.run(Thread.java:844)
[junit4] > Caused by: java.lang.reflect.InaccessibleObjectException: Unable to make protected final java.lang.Class java.lang.ClassLoader.defineClass(java.lang.String,byte[],int,int,java.security.ProtectionDomain) throws java.lang.ClassFormatError accessible: module java.base does not "opens java.lang" to unnamed module @22bef9
[junit4] > at java.base/java.lang.reflect.AccessibleObject.checkCanSetAccessible(AccessibleObject.java:207)
[junit4] > at java.base/java.lang.reflect.Method.checkCanSetAccessible(Method.java:192)
[junit4] > at java.base/java.lang.reflect.Method.setAccessible(Method.java:186)
[junit4] > at net.sf.cglib.core.ReflectUtils$2.run(ReflectUtils.java:56)
[junit4] > at java.base/java.security.AccessController.doPrivileged(Native Method)
[junit4] > at net.sf.cglib.core.ReflectUtils.<clinit>(ReflectUtils.java:46)
[junit4] > ... 52 more
[junit4] 2> 2193794 INFO (SUITE-TestCoreAdminApis-seed#[2821988BDCC391A6]-worker) [ ] o.a.s.SolrTestCaseJ4 ###deleteCore
[junit4] 2> NOTE: leaving temporary files on disk at: /home/jenkins/workspace/Lucene-Solr-master-Linux/solr/build/solr-core/test/J1/temp/solr.handler.admin.TestCoreAdminApis_2821988BDCC391A6-001
[junit4] 2> NOTE: test params are: codec=Asserting(Lucene70): {}, docValues:{}, maxPointsInLeafNode=214, maxMBSortInHeap=6.334447253383251, sim=RandomSimilarity(queryNorm=true): {}, locale=sk-SK, timezone=America/Santiago
[junit4] 2> NOTE: Linux 4.4.0-53-generic i386/Oracle Corporation 9-ea (32-bit)/cpus=12,threads=1,free=73374136,total=354508800
[junit4] 2> NOTE: All tests run in this JVM: [CreateCollectionCleanupTest, TestCustomDocTransformer, TestFuzzyAnalyzedSuggestions, TestDistribDocBasedVersion, SaslZkACLProviderTest, SimplePostToolTest, DistributedVersionInfoTest, TestCloudPseudoReturnFields, TestSchemaManager, TestXmlQParserPlugin, TestFreeTextSuggestions, BadComponentTest, TestStressInPlaceUpdates, TestSlowCompositeReaderWrapper, TestMinMaxOnMultiValuedField, CollectionTooManyReplicasTest, TestIntervalFaceting, ActionThrottleTest, TestExactStatsCache, TestSolrCloudWithKerberosAlt, ManagedSchemaRoundRobinCloudTest, TestSolrDynamicMBean, TestSimpleQParserPlugin, TestShortCircuitedRequests, TestConfigSetProperties, TestMiniSolrCloudCluster, DOMUtilTest, DeleteLastCustomShardedReplicaTest, TestGraphMLResponseWriter, TestQueryTypes, TestStressRecovery, TestOnReconnectListenerSupport, TestSolrCoreSnapshots, UpdateLogTest, JSONWriterTest, HttpPartitionTest, TestManagedSchemaAPI, MigrateRouteKeyTest, TestDefaultStatsCache, TestCoreContainer, QueryParsingTest, DistributedIntervalFacetingTest, TestTolerantUpdateProcessorRandomCloud, TestBM25SimilarityFactory, ShardRoutingCustomTest, TestFieldCacheReopen, WordBreakSolrSpellCheckerTest, TestReqParamsAPI, BadCopyFieldTest, DeleteShardTest, OpenCloseCoreStressTest, TestSystemIdResolver, RestartWhileUpdatingTest, TestCollectionAPI, TestHdfsCloudBackupRestore, TestStressUserVersions, CollectionsAPIDistributedZkTest, CdcrReplicationDistributedZkTest, IndexBasedSpellCheckerTest, TestLegacyFieldCache, SolrCloudExampleTest, VMParamsZkACLAndCredentialsProvidersTest, ZkControllerTest, DateRangeFieldTest, UpdateRequestProcessorFactoryTest, JsonValidatorTest, TestDelegationWithHadoopAuth, TestTrie, TestSolrIndexConfig, TestBackupRepositoryFactory, StatsReloadRaceTest, SpellCheckCollatorTest, ZkCLITest, IgnoreCommitOptimizeUpdateProcessorFactoryTest, TestReloadAndDeleteDocs, RulesTest, TestChildDocTransformer, SolrIndexSplitterTest, CoreAdminRequestStatusTest, TestFiltering, BlockJoinFacetSimpleTest, TestAnalyzeInfixSuggestions, TestSerializedLuceneMatchVersion, TestDynamicFieldResource, OverseerTaskQueueTest, TestRawResponseWriter, IndexSchemaRuntimeFieldTest, TestHashPartitioner, TestCloudSchemaless, TestSimpleTrackingShardHandler, DistributedFacetPivotWhiteBoxTest, TestSolrCoreParser, ShardRoutingTest, TestUninvertingReader, TestLeaderInitiatedRecoveryThread, SpatialFilterTest, TestSearchPerf, BasicAuthStandaloneTest, SortByFunctionTest, TestRequestStatusCollectionAPI, MetricsHandlerTest, CdcrVersionReplicationTest, DocValuesTest, ClassificationUpdateProcessorTest, TestConfigSetsAPIZkFailure, BJQParserTest, OverseerModifyCollectionTest, ClusterStateUpdateTest, ConcurrentDeleteAndCreateCollectionTest, TestCursorMarkWithoutUniqueKey, SolrSlf4jReporterTest, TestGroupingSearch, QueryElevationComponentTest, ConvertedLegacyTest, TestFunctionQuery, BasicFunctionalityTest, HighlighterTest, SoftAutoCommitTest, DocValuesMultiTest, DistanceFunctionTest, SolrInfoMBeanTest, LukeRequestHandlerTest, TestReversedWildcardFilterFactory, PrimitiveFieldTypeTest, XmlUpdateRequestHandlerTest, DocumentBuilderTest, TermVectorComponentTest, RequiredFieldsTest, TestSolrQueryParser, IndexSchemaTest, TestCSVResponseWriter, UniqFieldsUpdateProcessorFactoryTest, TestPartialUpdateDeduplication, CSVRequestHandlerTest, HighlighterConfigTest, UpdateParamsTest, TestSolrDeletionPolicy2, SampleTest, TestElisionMultitermQuery, OutputWriterTest, TestPostingsSolrHighlighter, NotRequiredUniqueKeyTest, TestLuceneMatchVersion, SpellPossibilityIteratorTest, TestCharFilters, TestXIncludeConfig, EchoParamsTest, TestSweetSpotSimilarityFactory, TestDFRSimilarityFactory, TestPerFieldSimilarity, TestLMJelinekMercerSimilarityFactory, TestJmxMonitoredMap, TimeZoneUtilsTest, OpenExchangeRatesOrgProviderTest, PluginInfoTest, DateMathParserTest, PreAnalyzedFieldTest, PrimUtilsTest, SpellingQueryConverterTest, RAMDirectoryFactoryTest, ClusterStateTest, TestSolrJ, TestUtils, TestDocumentBuilder, SystemInfoHandlerTest, FileUtilsTest, DistributedMLTComponentTest, TestDistributedMissingSort, TestPathTrie, TestEmbeddedSolrServerConstructors, AssignTest, AsyncCallRequestStatusResponseTest, BaseCdcrDistributedZkTest, CdcrBootstrapTest, DistribDocExpirationUpdateProcessorTest, LeaderFailoverAfterPartitionTest, OverseerCollectionConfigSetProcessorTest, OverseerStatusTest, PeerSyncReplicationTest, TestCloudDeleteByQuery, TestDeleteCollectionOnDownNodes, TestDownShardTolerantSearch, TestLeaderElectionZkExpiry, TestSegmentSorting, TestSolrCloudWithDelegationTokens, TestStressCloudBlindAtomicUpdates, HdfsBasicDistributedZkTest, HdfsChaosMonkeyNothingIsSafeTest, HdfsNNFailoverTest, HdfsRestartWhileUpdatingTest, HdfsThreadLeakTest, HdfsTlogReplayBufferedWhileIndexingTest, StressHdfsTest, ZkStateWriterTest, TestInfoStreamLogging, TestShardHandlerFactory, RequestLoggingTest, TestBlobHandler, TestSQLHandler, V2ApiIntegrationTest, SecurityConfHandlerTest, TestCollectionAPIs, TestCoreAdminApis]
[junit4] Completed [566/694 (2!)] on J1 in 0.06s, 1 test, 1 error <<< FAILURES!
[...truncated 52015 lines...]