You are viewing a plain text version of this content. The canonical link for it is here.
Posted to builds@beam.apache.org by Apache Jenkins Server <je...@builds.apache.org> on 2023/10/16 16:25:30 UTC

Build failed in Jenkins: beam_PostCommit_XVR_Flink #7476

See <https://ci-beam.apache.org/job/beam_PostCommit_XVR_Flink/7476/display/redirect?page=changes>

Changes:

[noreply] [JdbcIO] Allow fetchSize to be set for partitioned reads (#28999)


------------------------------------------
[...truncated 114.61 KB...]
#6 [beam 3/5] COPY target/apache-beam.tar.gz /opt/apache/beam/tars/
#6 CACHED

#7 [beam 4/5] COPY target/launcher/linux_amd64/boot target/LICENSE target/NOTICE target/LICENSE.python /opt/apache/beam/
#7 ERROR: "/target/launcher/linux_amd64/boot" not found: not found

#8 [beam 2/5] COPY target/base_image_requirements.txt /tmp/base_image_requirements.txt

> Task :sdks:java:io:debezium:expansion-service:shadowDistZip
> Task :sdks:java:io:debezium:expansion-service:assemble

> Task :release:go-licenses:go:dockerRun
+ go-licenses csv github.com/apache/beam/sdks/v2/go/container
+ tee /output/licenses/list.csv
W1016 16:20:25.119388      82 library.go:101] "golang.org/x/sys/unix" contains non-Go code that can't be inspected for further dependencies:
/go/pkg/mod/golang.org/x/sys@v0.12.0/unix/asm_linux_amd64.s

> Task :sdks:python:container:py38:docker FAILED
#8 CANCELED
------
 > [beam 4/5] COPY target/launcher/linux_amd64/boot target/LICENSE target/NOTICE target/LICENSE.python /opt/apache/beam/:
------
ERROR: failed to solve: failed to compute cache key: "/target/launcher/linux_amd64/boot" not found: not found

> Task :sdks:java:core:jar

> Task :release:go-licenses:go:dockerRun
W1016 16:20:29.435566      82 library.go:101] "golang.org/x/crypto/chacha20poly1305" contains non-Go code that can't be inspected for further dependencies:
/go/pkg/mod/golang.org/x/crypto@v0.13.0/chacha20poly1305/chacha20poly1305_amd64.s
W1016 16:20:29.465270      82 library.go:101] "golang.org/x/crypto/internal/poly1305" contains non-Go code that can't be inspected for further dependencies:
/go/pkg/mod/golang.org/x/crypto@v0.13.0/internal/poly1305/sum_amd64.s
W1016 16:20:29.471866      82 library.go:101] "golang.org/x/sys/cpu" contains non-Go code that can't be inspected for further dependencies:
/go/pkg/mod/golang.org/x/sys@v0.12.0/cpu/cpu_x86.s

> Task :runners:flink:1.15:job-server:shadowJar
> Task :runners:flink:1.15:job-server:shadowJar FROM-CACHE
> Task :sdks:java:extensions:schemaio-expansion-service:analyzeClassesDependencies
> Task :sdks:java:io:google-cloud-platform:expansion-service:spotlessJava FROM-CACHE
> Task :sdks:java:io:google-cloud-platform:expansion-service:spotlessJavaCheck UP-TO-DATE
> Task :sdks:java:extensions:schemaio-expansion-service:analyzeTestClassesDependencies SKIPPED
> Task :sdks:java:extensions:schemaio-expansion-service:analyzeDependencies
> Task :sdks:java:io:google-cloud-platform:expansion-service:spotlessCheck UP-TO-DATE
> Task :runners:flink:1.15:job-server:flinkJobServerSetup
> Task :sdks:java:io:expansion-service:analyzeClassesDependencies FROM-CACHE
> Task :sdks:java:io:expansion-service:analyzeTestClassesDependencies SKIPPED
> Task :sdks:java:io:expansion-service:analyzeDependencies UP-TO-DATE
> Task :sdks:java:io:expansion-service:checkstyleMain NO-SOURCE
> Task :sdks:java:io:expansion-service:checkstyleTest NO-SOURCE
> Task :sdks:java:io:expansion-service:javadoc NO-SOURCE
> Task :sdks:java:io:expansion-service:spotbugsMain NO-SOURCE
> Task :sdks:java:io:expansion-service:spotbugsTest SKIPPED
> Task :runners:flink:1.15:copyTestSourceOverrides
> Task :runners:flink:1.15:copyTestResourcesOverrides NO-SOURCE
> Task :sdks:java:io:expansion-service:spotlessJava FROM-CACHE
> Task :sdks:java:io:debezium:expansion-service:analyzeClassesDependencies FROM-CACHE
> Task :sdks:java:io:expansion-service:spotlessJavaCheck UP-TO-DATE
> Task :sdks:java:io:expansion-service:spotlessCheck UP-TO-DATE
> Task :sdks:java:io:debezium:expansion-service:analyzeTestClassesDependencies SKIPPED
> Task :runners:flink:1.15:processTestResources
> Task :sdks:java:io:debezium:expansion-service:analyzeDependencies UP-TO-DATE
> Task :sdks:java:io:expansion-service:test NO-SOURCE
> Task :sdks:java:io:debezium:expansion-service:checkstyleMain NO-SOURCE
> Task :sdks:java:io:expansion-service:check UP-TO-DATE
> Task :sdks:java:io:expansion-service:build
> Task :sdks:java:io:debezium:expansion-service:checkstyleTest NO-SOURCE
> Task :runners:portability:java:createCheckerFrameworkManifest
> Task :sdks:java:extensions:python:createCheckerFrameworkManifest
> Task :sdks:java:io:debezium:expansion-service:javadoc NO-SOURCE
> Task :sdks:java:io:debezium:expansion-service:spotbugsMain NO-SOURCE
> Task :runners:core-construction-java:compileTestJava FROM-CACHE
> Task :sdks:java:io:debezium:expansion-service:spotbugsTest SKIPPED
> Task :runners:core-construction-java:processTestResources NO-SOURCE
> Task :runners:core-construction-java:testClasses UP-TO-DATE
> Task :sdks:java:io:debezium:expansion-service:spotlessJava FROM-CACHE
> Task :sdks:java:io:debezium:expansion-service:spotlessJavaCheck UP-TO-DATE
> Task :sdks:java:io:debezium:expansion-service:spotlessCheck UP-TO-DATE
> Task :sdks:java:io:debezium:expansion-service:test NO-SOURCE
> Task :sdks:java:io:debezium:expansion-service:check UP-TO-DATE
> Task :sdks:java:io:debezium:expansion-service:build
> Task :runners:flink:1.15:job-server:flinkJobServerCleanup
> Task :sdks:java:extensions:python:compileJava FROM-CACHE
> Task :sdks:java:extensions:python:processResources
> Task :sdks:java:extensions:python:classes
> Task :runners:core-construction-java:testJar
> Task :runners:core-java:compileTestJava FROM-CACHE
> Task :runners:core-java:processTestResources NO-SOURCE
> Task :runners:core-java:testClasses UP-TO-DATE
> Task :sdks:java:extensions:python:compileTestJava FROM-CACHE
> Task :sdks:java:extensions:schemaio-expansion-service:javadoc FROM-CACHE
> Task :sdks:java:extensions:python:processTestResources NO-SOURCE
> Task :sdks:java:extensions:python:testClasses UP-TO-DATE
> Task :runners:core-java:testJar
> Task :sdks:java:extensions:schemaio-expansion-service:spotbugsMain FROM-CACHE
> Task :sdks:java:extensions:schemaio-expansion-service:spotbugsTest SKIPPED
> Task :runners:portability:java:compileJava FROM-CACHE
> Task :runners:portability:java:processResources NO-SOURCE
> Task :runners:portability:java:classes UP-TO-DATE
> Task :runners:portability:java:jar
> Task :runners:portability:java:compileTestJava FROM-CACHE
> Task :runners:portability:java:processTestResources NO-SOURCE
> Task :runners:portability:java:testClasses UP-TO-DATE
> Task :runners:portability:java:testJar

> Task :release:go-licenses:go:dockerRun
+ chmod -R a+w /output/licenses

> Task :runners:flink:1.15:compileTestJava FROM-CACHE
> Task :runners:flink:1.15:testClasses
> Task :runners:flink:1.15:testJar
> Task :sdks:java:extensions:schemaio-expansion-service:shadowJar FROM-CACHE
> Task :sdks:java:extensions:schemaio-expansion-service:checkstyleTest
> Task :sdks:java:extensions:schemaio-expansion-service:checkstyleMain
> Task :release:go-licenses:go:createLicenses
> Task :sdks:go:container:copyGolangLicenses
> Task :sdks:java:extensions:schemaio-expansion-service:test
> Task :sdks:java:extensions:schemaio-expansion-service:check
> Task :sdks:java:extensions:schemaio-expansion-service:build
> Task :sdks:go:container:dockerPrepare
> Task :sdks:java:io:google-cloud-platform:expansion-service:startScripts

> Task :sdks:go:container:docker
#1 [internal] load build definition from Dockerfile
#1 transferring dockerfile: 1.70kB done
#1 DONE 0.0s

#2 [internal] load .dockerignore
#2 transferring context: 2B done
#2 DONE 0.0s

#3 [internal] load metadata for docker.io/library/debian:bullseye
#3 DONE 0.6s

#4 [1/7] FROM docker.io/library/debian:bullseye@sha256:c141beaa9e0767774221cc82efe3a6712a1cc4f75d2699334dfd9a28a6f7357b
#4 CACHED

#5 [internal] load build context
#5 transferring context: 22.37MB 0.2s done
#5 DONE 0.2s

#6 [2/7] RUN apt-get update &&     DEBIAN_FRONTEND=noninteractive apt-get install -y         ca-certificates         &&     rm -rf /var/lib/apt/lists/*
#6 0.589 Get:1 http://deb.debian.org/debian bullseye InRelease [116 kB]
#6 0.657 Get:2 http://deb.debian.org/debian-security bullseye-security InRelease [48.4 kB]
#6 0.701 Get:3 http://deb.debian.org/debian bullseye-updates InRelease [44.1 kB]
#6 0.837 Get:4 http://deb.debian.org/debian bullseye/main amd64 Packages [8062 kB]

> Task :sdks:java:io:google-cloud-platform:expansion-service:distTar

> Task :sdks:go:container:docker
#6 1.119 Get:5 http://deb.debian.org/debian-security bullseye-security/main amd64 Packages [254 kB]
#6 1.120 Get:6 http://deb.debian.org/debian bullseye-updates/main amd64 Packages [17.4 kB]
#6 2.382 Fetched 8542 kB in 2s (4320 kB/s)
#6 2.382 Reading package lists...
#6 3.125 Reading package lists...
#6 3.794 Building dependency tree...
#6 3.964 Reading state information...
#6 4.164 The following additional packages will be installed:
#6 4.164   openssl
#6 4.209 The following NEW packages will be installed:
#6 4.211   ca-certificates openssl
#6 4.254 0 upgraded, 2 newly installed, 0 to remove and 0 not upgraded.
#6 4.254 Need to get 1017 kB of archives.
#6 4.254 After this operation, 1897 kB of additional disk space will be used.
#6 4.254 Get:1 http://deb.debian.org/debian bullseye/main amd64 openssl amd64 1.1.1w-0+deb11u1 [859 kB]
#6 4.326 Get:2 http://deb.debian.org/debian bullseye/main amd64 ca-certificates all 20210119 [158 kB]
#6 5.180 debconf: delaying package configuration, since apt-utils is not installed
#6 5.214 Fetched 1017 kB in 0s (5691 kB/s)
#6 5.239 Selecting previously unselected package openssl.
#6 5.239 (Reading database ... (Reading database ... 5%(Reading database ... 10%(Reading database ... 15%(Reading database ... 20%(Reading database ... 25%(Reading database ... 30%(Reading database ... 35%(Reading database ... 40%(Reading database ... 45%(Reading database ... 50%(Reading database ... 55%(Reading database ... 60%(Reading database ... 65%(Reading database ... 70%(Reading database ... 75%(Reading database ... 80%(Reading database ... 85%(Reading database ... 90%(Reading database ... 95%(Reading database ... 100%(Reading database ... 6664 files and directories currently installed.)
#6 5.271 Preparing to unpack .../openssl_1.1.1w-0+deb11u1_amd64.deb ...
#6 5.276 Unpacking openssl (1.1.1w-0+deb11u1) ...
#6 7.016 Selecting previously unselected package ca-certificates.
#6 7.017 Preparing to unpack .../ca-certificates_20210119_all.deb ...
#6 7.343 Unpacking ca-certificates (20210119) ...
#6 8.247 Setting up openssl (1.1.1w-0+deb11u1) ...
#6 9.374 Setting up ca-certificates (20210119) ...
#6 10.63 Updating certificates in /etc/ssl/certs...
#6 11.35 129 added, 0 removed; done.
#6 11.43 Processing triggers for ca-certificates (20210119) ...
#6 11.43 Updating certificates in /etc/ssl/certs...
#6 11.96 0 added, 0 removed; done.
#6 11.96 Running hooks in /etc/ca-certificates/update.d...
#6 12.06 done.
#6 DONE 13.0s

#7 [3/7] ADD target/linux_amd64/boot /opt/apache/beam/

> Task :sdks:java:io:google-cloud-platform:expansion-service:distZip

> Task :sdks:go:container:docker
#7 DONE 0.3s

#8 [4/7] COPY target/LICENSE /opt/apache/beam/
#8 DONE 0.1s

#9 [5/7] COPY target/NOTICE /opt/apache/beam/
#9 DONE 0.1s

#10 [6/7] COPY target/go-licenses/* /opt/apache/beam/third_party_licenses/golang/
#10 DONE 0.1s

#11 [7/7] RUN if [ "true" = "false" ] ; then     rm -rf /opt/apache/beam/third_party_licenses ;    fi
#11 DONE 1.7s

#12 exporting to image
#12 exporting layers
#12 exporting layers 0.2s done
#12 writing image sha256:ec26ecab497e7b5a4f81b8f2e6848c324f435a28ef405a4d8c2035f9c2d66ad5 done
#12 naming to docker.io/apache/beam_go_sdk:latest done
#12 DONE 0.2s

> Task :sdks:java:io:google-cloud-platform:expansion-service:shadowJar
> Task :sdks:java:io:google-cloud-platform:expansion-service:startShadowScripts
> Task :sdks:java:io:google-cloud-platform:expansion-service:shadowDistTar
> Task :sdks:java:io:google-cloud-platform:expansion-service:shadowDistZip
> Task :sdks:java:io:google-cloud-platform:expansion-service:assemble
> Task :sdks:java:io:google-cloud-platform:expansion-service:analyzeClassesDependencies
> Task :sdks:java:io:google-cloud-platform:expansion-service:analyzeDependencies
> Task :sdks:java:io:google-cloud-platform:expansion-service:test NO-SOURCE
> Task :sdks:java:io:google-cloud-platform:expansion-service:check
> Task :sdks:java:io:google-cloud-platform:expansion-service:build

> Task :sdks:python:installGcpTest
WARNING: There was an error checking the latest version of pip.

FAILURE: Build failed with an exception.

* What went wrong:
Execution failed for task ':sdks:python:container:py38:docker'.
> Process 'command 'docker'' finished with non-zero exit value 1

* Try:
> Run with --stacktrace option to get the stack trace.
> Run with --info or --debug option to get more log output.
> Get more help at https://help.gradle.org.

Deprecated Gradle features were used in this build, making it incompatible with Gradle 9.0.

You can use '--warning-mode all' to show the individual deprecation warnings and determine if they come from your own scripts or plugins.

For more on this, please refer to https://docs.gradle.org/8.3/userguide/command_line_interface.html#sec:command_line_warnings in the Gradle documentation.

BUILD FAILED in 6m 59s
275 actionable tasks: 187 executed, 78 from cache, 10 up-to-date

Publishing build scan...
https://ge.apache.org/s/dpzn6nxnylxhc

Build step 'Invoke Gradle script' changed build result to FAILURE
Build step 'Invoke Gradle script' marked build as failure

---------------------------------------------------------------------
To unsubscribe, e-mail: builds-unsubscribe@beam.apache.org
For additional commands, e-mail: builds-help@beam.apache.org


Jenkins build is back to normal : beam_PostCommit_XVR_Flink #7479

Posted by Apache Jenkins Server <je...@builds.apache.org>.
See <https://ci-beam.apache.org/job/beam_PostCommit_XVR_Flink/7479/display/redirect>


---------------------------------------------------------------------
To unsubscribe, e-mail: builds-unsubscribe@beam.apache.org
For additional commands, e-mail: builds-help@beam.apache.org


Build failed in Jenkins: beam_PostCommit_XVR_Flink #7478

Posted by Apache Jenkins Server <je...@builds.apache.org>.
See <https://ci-beam.apache.org/job/beam_PostCommit_XVR_Flink/7478/display/redirect>

Changes:


------------------------------------------
[...truncated 1.48 MB...]

org.apache.beam.sdk.extensions.python.transforms.PythonMapTest > testPythonMap FAILED
    java.lang.RuntimeException at PythonMapTest.java:41
    java.lang.NullPointerException at Preconditions.java:1010

org.apache.beam.sdk.extensions.python.transforms.PythonMapTest > testPythonFlatMap FAILED
    java.lang.RuntimeException at PythonMapTest.java:54
    java.lang.NullPointerException at Preconditions.java:1010

org.apache.beam.sdk.extensions.python.transforms.RunInferenceTransformTest > testRunInferenceWithKVs FAILED
    java.lang.RuntimeException at RunInferenceTransformTest.java:108
    java.lang.NullPointerException at Preconditions.java:1010

org.apache.beam.sdk.extensions.python.transforms.RunInferenceTransformTest > testRunInference FAILED
    java.lang.RuntimeException at RunInferenceTransformTest.java:60
    java.lang.NullPointerException at Preconditions.java:1010

16 tests completed, 13 failed

> Task :runners:flink:1.15:job-server:validatesCrossLanguageRunnerJavaUsingPython FAILED

> Task :runners:flink:1.15:job-server:validatesCrossLanguageRunnerPythonUsingJava
ImportError while loading conftest '<https://ci-beam.apache.org/job/beam_PostCommit_XVR_Flink/ws/src/sdks/python/conftest.py'.>
conftest.py:22: in <module>
    from apache_beam.options import pipeline_options
apache_beam/__init__.py:88: in <module>
    from apache_beam import io
apache_beam/io/__init__.py:21: in <module>
    from apache_beam.io.avroio import *
apache_beam/io/avroio.py:59: in <module>
    from apache_beam.io import filebasedsink
apache_beam/io/filebasedsink.py:29: in <module>
    from apache_beam.io import iobase
apache_beam/io/iobase.py:54: in <module>
    from apache_beam.transforms import Impulse
apache_beam/transforms/__init__.py:24: in <module>
    from apache_beam.transforms.external import *
apache_beam/transforms/external.py:44: in <module>
    from apache_beam.runners import pipeline_context
apache_beam/runners/__init__.py:24: in <module>
    from apache_beam.runners.direct.test_direct_runner import TestDirectRunner
/usr/lib/python3.8/os.py:223: in makedirs
    mkdir(name, mode)
E   OSError: [Errno 28] No space left on device: '<https://ci-beam.apache.org/job/beam_PostCommit_XVR_Flink/ws/src/sdks/python/apache_beam/runners/direct/__pycache__'>

> Task :runners:flink:1.15:job-server:validatesCrossLanguageRunnerPythonUsingJava FAILED

> Task :runners:flink:1.15:job-server:validatesCrossLanguageRunnerPythonUsingSql FAILED
Traceback (most recent call last):
  File "<https://ci-beam.apache.org/job/beam_PostCommit_XVR_Flink/ws/src/build/gradleenv/1922375555/bin/pytest",> line 8, in <module>
    sys.exit(console_main())
  File "<https://ci-beam.apache.org/job/beam_PostCommit_XVR_Flink/ws/src/build/gradleenv/1922375555/lib/python3.8/site-packages/_pytest/config/__init__.py",> line 192, in console_main
    code = main()
  File "<https://ci-beam.apache.org/job/beam_PostCommit_XVR_Flink/ws/src/build/gradleenv/1922375555/lib/python3.8/site-packages/_pytest/config/__init__.py",> line 150, in main
    config = _prepareconfig(args, plugins)
  File "<https://ci-beam.apache.org/job/beam_PostCommit_XVR_Flink/ws/src/build/gradleenv/1922375555/lib/python3.8/site-packages/_pytest/config/__init__.py",> line 331, in _prepareconfig
    config = pluginmanager.hook.pytest_cmdline_parse(
  File "<https://ci-beam.apache.org/job/beam_PostCommit_XVR_Flink/ws/src/build/gradleenv/1922375555/lib/python3.8/site-packages/pluggy/_hooks.py",> line 493, in __call__
    return self._hookexec(self.name, self._hookimpls, kwargs, firstresult)
  File "<https://ci-beam.apache.org/job/beam_PostCommit_XVR_Flink/ws/src/build/gradleenv/1922375555/lib/python3.8/site-packages/pluggy/_manager.py",> line 115, in _hookexec
    return self._inner_hookexec(hook_name, methods, kwargs, firstresult)
  File "<https://ci-beam.apache.org/job/beam_PostCommit_XVR_Flink/ws/src/build/gradleenv/1922375555/lib/python3.8/site-packages/pluggy/_callers.py",> line 130, in _multicall
    teardown[0].send(outcome)
  File "<https://ci-beam.apache.org/job/beam_PostCommit_XVR_Flink/ws/src/build/gradleenv/1922375555/lib/python3.8/site-packages/_pytest/helpconfig.py",> line 104, in pytest_cmdline_parse
    config: Config = outcome.get_result()
  File "<https://ci-beam.apache.org/job/beam_PostCommit_XVR_Flink/ws/src/build/gradleenv/1922375555/lib/python3.8/site-packages/pluggy/_result.py",> line 114, in get_result
    raise exc.with_traceback(exc.__traceback__)
  File "<https://ci-beam.apache.org/job/beam_PostCommit_XVR_Flink/ws/src/build/gradleenv/1922375555/lib/python3.8/site-packages/pluggy/_callers.py",> line 77, in _multicall
    res = hook_impl.function(*args)
  File "<https://ci-beam.apache.org/job/beam_PostCommit_XVR_Flink/ws/src/build/gradleenv/1922375555/lib/python3.8/site-packages/_pytest/config/__init__.py",> line 1075, in pytest_cmdline_parse
    self.parse(args)
  File "<https://ci-beam.apache.org/job/beam_PostCommit_XVR_Flink/ws/src/build/gradleenv/1922375555/lib/python3.8/site-packages/_pytest/config/__init__.py",> line 1425, in parse
    self._preparse(args, addopts=addopts)
  File "<https://ci-beam.apache.org/job/beam_PostCommit_XVR_Flink/ws/src/build/gradleenv/1922375555/lib/python3.8/site-packages/_pytest/config/__init__.py",> line 1327, in _preparse
    self.hook.pytest_load_initial_conftests(
  File "<https://ci-beam.apache.org/job/beam_PostCommit_XVR_Flink/ws/src/build/gradleenv/1922375555/lib/python3.8/site-packages/pluggy/_hooks.py",> line 493, in __call__
    return self._hookexec(self.name, self._hookimpls, kwargs, firstresult)
  File "<https://ci-beam.apache.org/job/beam_PostCommit_XVR_Flink/ws/src/build/gradleenv/1922375555/lib/python3.8/site-packages/pluggy/_manager.py",> line 115, in _hookexec
    return self._inner_hookexec(hook_name, methods, kwargs, firstresult)
  File "<https://ci-beam.apache.org/job/beam_PostCommit_XVR_Flink/ws/src/build/gradleenv/1922375555/lib/python3.8/site-packages/pluggy/_callers.py",> line 152, in _multicall
    return outcome.get_result()
  File "<https://ci-beam.apache.org/job/beam_PostCommit_XVR_Flink/ws/src/build/gradleenv/1922375555/lib/python3.8/site-packages/pluggy/_result.py",> line 114, in get_result
    raise exc.with_traceback(exc.__traceback__)
  File "<https://ci-beam.apache.org/job/beam_PostCommit_XVR_Flink/ws/src/build/gradleenv/1922375555/lib/python3.8/site-packages/pluggy/_callers.py",> line 62, in _multicall
    next(wrapper_gen)  # first yield
  File "<https://ci-beam.apache.org/job/beam_PostCommit_XVR_Flink/ws/src/build/gradleenv/1922375555/lib/python3.8/site-packages/_pytest/capture.py",> line 149, in pytest_load_initial_conftests
    capman.start_global_capturing()
  File "<https://ci-beam.apache.org/job/beam_PostCommit_XVR_Flink/ws/src/build/gradleenv/1922375555/lib/python3.8/site-packages/_pytest/capture.py",> line 750, in start_global_capturing
    self._global_capturing = _get_multicapture(self._method)
  File "<https://ci-beam.apache.org/job/beam_PostCommit_XVR_Flink/ws/src/build/gradleenv/1922375555/lib/python3.8/site-packages/_pytest/capture.py",> line 692, in _get_multicapture
    return MultiCapture(in_=FDCapture(0), out=FDCapture(1), err=FDCapture(2))
  File "<https://ci-beam.apache.org/job/beam_PostCommit_XVR_Flink/ws/src/build/gradleenv/1922375555/lib/python3.8/site-packages/_pytest/capture.py",> line 466, in __init__
    TemporaryFile(buffering=0),
  File "/usr/lib/python3.8/tempfile.py", line 719, in TemporaryFile
    prefix, suffix, dir, output_type = _sanitize_params(prefix, suffix, dir)
  File "/usr/lib/python3.8/tempfile.py", line 256, in _sanitize_params
    dir = gettempdir()
  File "/usr/lib/python3.8/tempfile.py", line 425, in gettempdir
    tempdir = _get_default_tempdir()
  File "/usr/lib/python3.8/tempfile.py", line 357, in _get_default_tempdir
    raise FileNotFoundError(_errno.ENOENT,
FileNotFoundError: [Errno 2] No usable temporary directory found in ['/tmp', '/var/tmp', '/usr/tmp', '<https://ci-beam.apache.org/job/beam_PostCommit_XVR_Flink/ws/src/sdks/python']>

> Task :runners:flink:1.15:job-server:flinkJobServerCleanup
<https://ci-beam.apache.org/job/beam_PostCommit_XVR_Flink/ws/src/sdks/python/scripts/run_job_server.sh>: line 19: cannot create temp file for here-document: No space left on device

> Task :runners:flink:1.15:job-server:validatesCrossLanguageRunnerCleanup

FAILURE: Build completed with 3 failures.

1: Task failed with an exception.
-----------
* What went wrong:
Execution failed for task ':runners:flink:1.15:job-server:validatesCrossLanguageRunnerJavaUsingPython'.
> There were failing tests. See the report at: file://<https://ci-beam.apache.org/job/beam_PostCommit_XVR_Flink/ws/src/runners/flink/1.15/job-server/build/reports/tests/validatesCrossLanguageRunnerJavaUsingPython/index.html>
==============================================================================

2: Task failed with an exception.
-----------
* What went wrong:
Execution failed for task ':runners:flink:1.15:job-server:validatesCrossLanguageRunnerPythonUsingJava'.
> Process 'command 'sh'' finished with non-zero exit value 4

* Try:
> Run with --stacktrace option to get the stack trace.
> Run with --info or --debug option to get more log output.
> Get more help at https://help.gradle.org.
==============================================================================

3: Task failed with an exception.
-----------
* What went wrong:
Execution failed for task ':runners:flink:1.15:job-server:validatesCrossLanguageRunnerPythonUsingSql'.
> Process 'command 'sh'' finished with non-zero exit value 1

* Try:
> Run with --stacktrace option to get the stack trace.
> Run with --info or --debug option to get more log output.
> Get more help at https://help.gradle.org.
==============================================================================

Deprecated Gradle features were used in this build, making it incompatible with Gradle 9.0.

You can use '--warning-mode all' to show the individual deprecation warnings and determine if they come from your own scripts or plugins.

For more on this, please refer to https://docs.gradle.org/8.3/userguide/command_line_interface.html#sec:command_line_warnings in the Gradle documentation.

BUILD FAILED in 25m 11s
282 actionable tasks: 188 executed, 84 from cache, 10 up-to-date

A build scan cannot be produced as an error occurred gathering build data.
Please report this problem via https://gradle.com/help/plugin and include the following via copy/paste:

----------
Gradle version: 8.3
Plugin version: 3.13.2

java.lang.RuntimeException: Could not serialize event class 'com.gradle.scan.agent.serialization.scan.a.b'.
	at com.gradle.scan.plugin.internal.h.c.c.a(SourceFile:112)
	at com.gradle.scan.plugin.internal.h.a.a(SourceFile:42)
	at com.gradle.scan.plugin.internal.h.a.b(SourceFile:34)
	at com.gradle.scan.plugin.internal.c.c.a(SourceFile:46)
	at com.gradle.scan.plugin.internal.p.d.a(SourceFile:55)
	at com.gradle.scan.plugin.internal.r.a.b(SourceFile:111)
	at com.gradle.scan.plugin.internal.p.d.a(SourceFile:54)
	at com.gradle.scan.plugin.internal.p.b.a(SourceFile:23)
	at org.gradle.internal.enterprise.impl.DefaultGradleEnterprisePluginAdapter.buildFinished(DefaultGradleEnterprisePluginAdapter.java:79)
	at org.gradle.internal.enterprise.core.GradleEnterprisePluginManager.buildFinished(GradleEnterprisePluginManager.java:76)
	at org.gradle.launcher.exec.BuildCompletionNotifyingBuildActionRunner.notifyEnterprisePluginManager(BuildCompletionNotifyingBuildActionRunner.java:53)
	at org.gradle.launcher.exec.BuildCompletionNotifyingBuildActionRunner.run(BuildCompletionNotifyingBuildActionRunner.java:48)
	at org.gradle.launcher.exec.RootBuildLifecycleBuildActionExecutor.lambda$execute$0(RootBuildLifecycleBuildActionExecutor.java:40)
	at org.gradle.composite.internal.DefaultRootBuildState.run(DefaultRootBuildState.java:123)
	at org.gradle.launcher.exec.RootBuildLifecycleBuildActionExecutor.execute(RootBuildLifecycleBuildActionExecutor.java:40)
	at org.gradle.internal.buildtree.InitDeprecationLoggingActionExecutor.execute(InitDeprecationLoggingActionExecutor.java:58)
	at org.gradle.internal.buildtree.DefaultBuildTreeContext.execute(DefaultBuildTreeContext.java:40)
	at org.gradle.launcher.exec.BuildTreeLifecycleBuildActionExecutor.lambda$execute$0(BuildTreeLifecycleBuildActionExecutor.java:65)
	at org.gradle.internal.buildtree.BuildTreeState.run(BuildTreeState.java:58)
	at org.gradle.launcher.exec.BuildTreeLifecycleBuildActionExecutor.execute(BuildTreeLifecycleBuildActionExecutor.java:65)
	at org.gradle.launcher.exec.RunAsBuildOperationBuildActionExecutor$3.call(RunAsBuildOperationBuildActionExecutor.java:61)
	at org.gradle.launcher.exec.RunAsBuildOperationBuildActionExecutor$3.call(RunAsBuildOperationBuildActionExecutor.java:57)
	at org.gradle.internal.operations.DefaultBuildOperationRunner$CallableBuildOperationWorker.execute(DefaultBuildOperationRunner.java:204)
	at org.gradle.internal.operations.DefaultBuildOperationRunner$CallableBuildOperationWorker.execute(DefaultBuildOperationRunner.java:199)
	at org.gradle.internal.operations.DefaultBuildOperationRunner$2.execute(DefaultBuildOperationRunner.java:66)
	at org.gradle.internal.operations.DefaultBuildOperationRunner$2.execute(DefaultBuildOperationRunner.java:59)
	at org.gradle.internal.operations.DefaultBuildOperationRunner.execute(DefaultBuildOperationRunner.java:157)
	at org.gradle.internal.operations.DefaultBuildOperationRunner.execute(DefaultBuildOperationRunner.java:59)
	at org.gradle.internal.operations.DefaultBuildOperationRunner.call(DefaultBuildOperationRunner.java:53)
	at org.gradle.internal.operations.DefaultBuildOperationExecutor.call(DefaultBuildOperationExecutor.java:73)
	at org.gradle.launcher.exec.RunAsBuildOperationBuildActionExecutor.execute(RunAsBuildOperationBuildActionExecutor.java:57)
	at org.gradle.launcher.exec.RunAsWorkerThreadBuildActionExecutor.lambda$execute$0(RunAsWorkerThreadBuildActionExecutor.java:36)
	at org.gradle.internal.work.DefaultWorkerLeaseService.withLocks(DefaultWorkerLeaseService.java:264)
	at org.gradle.internal.work.DefaultWorkerLeaseService.runAsWorkerThread(DefaultWorkerLeaseService.java:128)
	at org.gradle.launcher.exec.RunAsWorkerThreadBuildActionExecutor.execute(RunAsWorkerThreadBuildActionExecutor.java:36)
	at org.gradle.tooling.internal.provider.continuous.ContinuousBuildActionExecutor.execute(ContinuousBuildActionExecutor.java:110)
	at org.gradle.tooling.internal.provider.SubscribableBuildActionExecutor.execute(SubscribableBuildActionExecutor.java:64)
	at org.gradle.internal.session.DefaultBuildSessionContext.execute(DefaultBuildSessionContext.java:46)
	at org.gradle.tooling.internal.provider.BuildSessionLifecycleBuildActionExecuter$ActionImpl.apply(BuildSessionLifecycleBuildActionExecuter.java:92)
	at org.gradle.tooling.internal.provider.BuildSessionLifecycleBuildActionExecuter$ActionImpl.apply(BuildSessionLifecycleBuildActionExecuter.java:80)
	at org.gradle.internal.session.BuildSessionState.run(BuildSessionState.java:69)
	at org.gradle.tooling.internal.provider.BuildSessionLifecycleBuildActionExecuter.execute(BuildSessionLifecycleBuildActionExecuter.java:62)
	at org.gradle.tooling.internal.provider.BuildSessionLifecycleBuildActionExecuter.execute(BuildSessionLifecycleBuildActionExecuter.java:41)
	at org.gradle.tooling.internal.provider.StartParamsValidatingActionExecuter.execute(StartParamsValidatingActionExecuter.java:64)
	at org.gradle.tooling.internal.provider.StartParamsValidatingActionExecuter.execute(StartParamsValidatingActionExecuter.java:32)
	at org.gradle.tooling.internal.provider.SessionFailureReportingActionExecuter.execute(SessionFailureReportingActionExecuter.java:51)
	at org.gradle.tooling.internal.provider.SessionFailureReportingActionExecuter.execute(SessionFailureReportingActionExecuter.java:39)
	at org.gradle.tooling.internal.provider.SetupLoggingActionExecuter.execute(SetupLoggingActionExecuter.java:47)
	at org.gradle.tooling.internal.provider.SetupLoggingActionExecuter.execute(SetupLoggingActionExecuter.java:31)
	at org.gradle.launcher.daemon.server.exec.ExecuteBuild.doBuild(ExecuteBuild.java:65)
	at org.gradle.launcher.daemon.server.exec.BuildCommandOnly.execute(BuildCommandOnly.java:37)
	at org.gradle.launcher.daemon.server.api.DaemonCommandExecution.proceed(DaemonCommandExecution.java:104)
	at org.gradle.launcher.daemon.server.exec.WatchForDisconnection.execute(WatchForDisconnection.java:39)
	at org.gradle.launcher.daemon.server.api.DaemonCommandExecution.proceed(DaemonCommandExecution.java:104)
	at org.gradle.launcher.daemon.server.exec.ResetDeprecationLogger.execute(ResetDeprecationLogger.java:29)
	at org.gradle.launcher.daemon.server.api.DaemonCommandExecution.proceed(DaemonCommandExecution.java:104)
	at org.gradle.launcher.daemon.server.exec.RequestStopIfSingleUsedDaemon.execute(RequestStopIfSingleUsedDaemon.java:35)
	at org.gradle.launcher.daemon.server.api.DaemonCommandExecution.proceed(DaemonCommandExecution.java:104)
	at org.gradle.launcher.daemon.server.exec.ForwardClientInput$2.create(ForwardClientInput.java:78)
	at org.gradle.launcher.daemon.server.exec.ForwardClientInput$2.create(ForwardClientInput.java:75)
	at org.gradle.util.internal.Swapper.swap(Swapper.java:38)
	at org.gradle.launcher.daemon.server.exec.ForwardClientInput.execute(ForwardClientInput.java:75)
	at org.gradle.launcher.daemon.server.api.DaemonCommandExecution.proceed(DaemonCommandExecution.java:104)
	at org.gradle.launcher.daemon.server.exec.LogAndCheckHealth.execute(LogAndCheckHealth.java:53)
	at org.gradle.launcher.daemon.server.api.DaemonCommandExecution.proceed(DaemonCommandExecution.java:104)
	at org.gradle.launcher.daemon.server.exec.LogToClient.doBuild(LogToClient.java:63)
	at org.gradle.launcher.daemon.server.exec.BuildCommandOnly.execute(BuildCommandOnly.java:37)
	at org.gradle.launcher.daemon.server.api.DaemonCommandExecution.proceed(DaemonCommandExecution.java:104)
	at org.gradle.launcher.daemon.server.exec.EstablishBuildEnvironment.doBuild(EstablishBuildEnvironment.java:84)
	at org.gradle.launcher.daemon.server.exec.BuildCommandOnly.execute(BuildCommandOnly.java:37)
	at org.gradle.launcher.daemon.server.api.DaemonCommandExecution.proceed(DaemonCommandExecution.java:104)
	at org.gradle.launcher.daemon.server.exec.StartBuildOrRespondWithBusy$1.run(StartBuildOrRespondWithBusy.java:52)
	at org.gradle.launcher.daemon.server.DaemonStateCoordinator$1.run(DaemonStateCoordinator.java:297)
	at org.gradle.internal.concurrent.ExecutorPolicy$CatchAndRecordFailures.onExecute(ExecutorPolicy.java:64)
	at org.gradle.internal.concurrent.AbstractManagedExecutor$1.run(AbstractManagedExecutor.java:47)
Caused by: java.lang.RuntimeException: java.io.IOException: No space left on device
	at com.gradle.scan.agent.serialization.scan.serializer.d.flush(SourceFile:245)
	at com.gradle.scan.agent.serialization.scan.serializer.d.a(SourceFile:211)
	at com.gradle.scan.agent.serialization.scan.serializer.d.a(SourceFile:338)
	at com.gradle.scan.agent.serialization.scan.serializer.c.a(SourceFile:118)
	at com.gradle.scan.agent.serialization.scan.serializer.c.a(SourceFile:106)
	at com.gradle.scan.agent.serialization.scan.serializer.c.a(SourceFile:75)
	at com.gradle.scan.plugin.internal.h.c.c.a(SourceFile:110)
	... 74 more
Caused by: java.io.IOException: No space left on device
	at com.gradle.scan.agent.serialization.scan.serializer.d.flush(SourceFile:243)
	... 80 more
----------

Build step 'Invoke Gradle script' changed build result to FAILURE
Build step 'Invoke Gradle script' marked build as failure

---------------------------------------------------------------------
To unsubscribe, e-mail: builds-unsubscribe@beam.apache.org
For additional commands, e-mail: builds-help@beam.apache.org


Build failed in Jenkins: beam_PostCommit_XVR_Flink #7477

Posted by Apache Jenkins Server <je...@builds.apache.org>.
See <https://ci-beam.apache.org/job/beam_PostCommit_XVR_Flink/7477/display/redirect>

Changes:


------------------------------------------
[...truncated 143.98 KB...]
Collecting pyhamcrest!=1.10.0,<3.0.0,>=1.9
  Using cached pyhamcrest-2.0.4-py3-none-any.whl (52 kB)
Collecting pyyaml<7.0.0,>=3.12
  Using cached PyYAML-6.0.1-cp38-cp38-manylinux_2_17_x86_64.manylinux2014_x86_64.whl.metadata (2.1 kB)
Collecting requests-mock<2.0,>=1.7
  Using cached requests_mock-1.11.0-py2.py3-none-any.whl.metadata (4.7 kB)
Collecting tenacity<9,>=8.0.0
  Using cached tenacity-8.2.3-py3-none-any.whl.metadata (1.0 kB)
Collecting pytest<8.0,>=7.1.2
  Using cached pytest-7.4.2-py3-none-any.whl.metadata (7.9 kB)
Collecting pytest-xdist<4,>=2.5.0
  Using cached pytest_xdist-3.3.1-py3-none-any.whl.metadata (3.1 kB)
Collecting pytest-timeout<3,>=2.1.0
  Using cached pytest_timeout-2.2.0-py3-none-any.whl.metadata (17 kB)
Collecting scikit-learn>=0.20.0
  Using cached scikit_learn-1.3.1-cp38-cp38-manylinux_2_17_x86_64.manylinux2014_x86_64.whl.metadata (11 kB)
Collecting sqlalchemy<2.0,>=1.3
  Using cached SQLAlchemy-1.4.49-cp38-cp38-manylinux_2_5_x86_64.manylinux1_x86_64.manylinux_2_17_x86_64.manylinux2014_x86_64.whl.metadata (10 kB)
Collecting psycopg2-binary<3.0.0,>=2.8.5
  Using cached psycopg2_binary-2.9.9-cp38-cp38-manylinux_2_17_x86_64.manylinux2014_x86_64.whl.metadata (4.4 kB)
Collecting testcontainers<4.0.0,>=3.0.3 (from testcontainers[mysql]<4.0.0,>=3.0.3; extra == "test")
  Using cached testcontainers-3.7.1-py2.py3-none-any.whl (45 kB)
Collecting cryptography>=41.0.2
  Using cached cryptography-41.0.4-cp37-abi3-manylinux_2_28_x86_64.whl.metadata (5.2 kB)
Collecting hypothesis<=7.0.0,>5.0.0
  Using cached hypothesis-6.88.1-py3-none-any.whl.metadata (5.9 kB)
Requirement already satisfied: cachetools<6,>=3.1.0 in <https://ci-beam.apache.org/job/beam_PostCommit_XVR_Flink/ws/src/build/gradleenv/1922375555/lib/python3.8/site-packages> (5.3.1)
Collecting google-api-core<3,>=2.0.0
  Using cached google_api_core-2.12.0-py3-none-any.whl.metadata (2.7 kB)

> Task :sdks:go:container:dockerPrepare

> Task :sdks:go:container:docker
#1 [internal] load build definition from Dockerfile
#1 transferring dockerfile: 1.70kB done
#1 DONE 0.0s

#2 [internal] load .dockerignore
#2 transferring context: 2B done
#2 DONE 0.0s

#3 [internal] load metadata for docker.io/library/debian:bullseye
#3 DONE 0.3s

#4 [1/7] FROM docker.io/library/debian:bullseye@sha256:c141beaa9e0767774221cc82efe3a6712a1cc4f75d2699334dfd9a28a6f7357b
#4 CACHED

#5 [internal] load build context
#5 transferring context: 22.38MB 0.2s done
#5 DONE 0.2s

#6 [2/7] RUN apt-get update &&     DEBIAN_FRONTEND=noninteractive apt-get install -y         ca-certificates         &&     rm -rf /var/lib/apt/lists/*
#6 0.936 Get:1 http://deb.debian.org/debian bullseye InRelease [116 kB]
#6 1.033 Get:2 http://deb.debian.org/debian-security bullseye-security InRelease [48.4 kB]
#6 1.071 Get:3 http://deb.debian.org/debian bullseye-updates InRelease [44.1 kB]
#6 1.302 Get:4 http://deb.debian.org/debian bullseye/main amd64 Packages [8062 kB]
#6 1.548 Get:5 http://deb.debian.org/debian-security bullseye-security/main amd64 Packages [256 kB]
#6 1.550 Get:6 http://deb.debian.org/debian bullseye-updates/main amd64 Packages [17.4 kB]

> Task :sdks:java:io:google-cloud-platform:expansion-service:distZip
> Task :sdks:java:io:google-cloud-platform:expansion-service:compileTestJava NO-SOURCE
> Task :sdks:java:io:google-cloud-platform:expansion-service:processTestResources NO-SOURCE
> Task :sdks:java:io:google-cloud-platform:expansion-service:testClasses UP-TO-DATE
> Task :sdks:java:io:google-cloud-platform:expansion-service:packageTests

> Task :sdks:go:container:docker
#6 2.876 Fetched 8544 kB in 2s (4214 kB/s)
#6 2.876 Reading package lists...
#6 3.549 Reading package lists...
#6 4.154 Building dependency tree...
#6 4.292 Reading state information...
#6 4.452 The following additional packages will be installed:
#6 4.452   openssl
#6 4.493 The following NEW packages will be installed:
#6 4.494   ca-certificates openssl
#6 4.587 0 upgraded, 2 newly installed, 0 to remove and 0 not upgraded.
#6 4.587 Need to get 1017 kB of archives.
#6 4.587 After this operation, 1897 kB of additional disk space will be used.
#6 4.587 Get:1 http://deb.debian.org/debian bullseye/main amd64 openssl amd64 1.1.1w-0+deb11u1 [859 kB]
#6 4.789 Get:2 http://deb.debian.org/debian bullseye/main amd64 ca-certificates all 20210119 [158 kB]
#6 5.536 debconf: delaying package configuration, since apt-utils is not installed
#6 5.577 Fetched 1017 kB in 0s (3468 kB/s)
#6 5.628 Selecting previously unselected package openssl.
#6 5.628 (Reading database ... (Reading database ... 5%(Reading database ... 10%(Reading database ... 15%(Reading database ... 20%(Reading database ... 25%(Reading database ... 30%(Reading database ... 35%(Reading database ... 40%(Reading database ... 45%(Reading database ... 50%(Reading database ... 55%(Reading database ... 60%(Reading database ... 65%(Reading database ... 70%(Reading database ... 75%(Reading database ... 80%(Reading database ... 85%(Reading database ... 90%(Reading database ... 95%(Reading database ... 100%(Reading database ... 6664 files and directories currently installed.)
#6 5.675 Preparing to unpack .../openssl_1.1.1w-0+deb11u1_amd64.deb ...
#6 5.680 Unpacking openssl (1.1.1w-0+deb11u1) ...
#6 5.844 Selecting previously unselected package ca-certificates.
#6 5.846 Preparing to unpack .../ca-certificates_20210119_all.deb ...
#6 5.849 Unpacking ca-certificates (20210119) ...
#6 5.956 Setting up openssl (1.1.1w-0+deb11u1) ...
#6 5.972 Setting up ca-certificates (20210119) ...
#6 6.719 Updating certificates in /etc/ssl/certs...
#6 7.521 129 added, 0 removed; done.
#6 7.572 Processing triggers for ca-certificates (20210119) ...

> Task :sdks:java:io:google-cloud-platform:expansion-service:shadowJar FROM-CACHE

> Task :sdks:go:container:docker
#6 7.581 Updating certificates in /etc/ssl/certs...
#6 8.117 0 added, 0 removed; done.
#6 8.117 Running hooks in /etc/ca-certificates/update.d...
#6 8.130 done.

> Task :sdks:java:io:google-cloud-platform:expansion-service:startShadowScripts
> Task :sdks:java:io:google-cloud-platform:expansion-service:shadowDistTar

> Task :sdks:go:container:docker
#6 DONE 12.7s

#7 [3/7] ADD target/linux_amd64/boot /opt/apache/beam/
#7 DONE 1.0s

#8 [4/7] COPY target/LICENSE /opt/apache/beam/
#8 DONE 0.2s

#9 [5/7] COPY target/NOTICE /opt/apache/beam/
#9 DONE 0.4s

#10 [6/7] COPY target/go-licenses/* /opt/apache/beam/third_party_licenses/golang/
#10 DONE 0.2s

#11 [7/7] RUN if [ "true" = "false" ] ; then     rm -rf /opt/apache/beam/third_party_licenses ;    fi
#11 DONE 0.3s

#12 exporting to image
#12 exporting layers
#12 exporting layers 0.2s done
#12 writing image sha256:9894985273793e24edf0d683b695baee89d9c3cd5e4eb6ca3b3d1e2c5fe7471d done
#12 naming to docker.io/apache/beam_go_sdk:latest done
#12 DONE 0.2s

> Task :sdks:python:installGcpTest
Using cached fasteners-0.19-py3-none-any.whl (18 kB)
Using cached google_api_core-2.12.0-py3-none-any.whl (121 kB)
Using cached google_auth-2.23.3-py2.py3-none-any.whl (182 kB)
Using cached google_auth_httplib2-0.1.1-py2.py3-none-any.whl (9.3 kB)
Using cached google_cloud_aiplatform-1.35.0-py2.py3-none-any.whl (3.1 MB)
Using cached google_cloud_bigquery-3.12.0-py2.py3-none-any.whl (220 kB)
Using cached google_cloud_bigquery_storage-2.22.0-py2.py3-none-any.whl (190 kB)
Using cached google_cloud_bigtable-2.21.0-py2.py3-none-any.whl (293 kB)
Using cached google_cloud_core-2.3.3-py2.py3-none-any.whl (29 kB)
Using cached google_cloud_datastore-2.18.0-py2.py3-none-any.whl (177 kB)
Using cached google_cloud_dlp-3.12.3-py2.py3-none-any.whl (143 kB)
Using cached google_cloud_language-2.11.1-py2.py3-none-any.whl (138 kB)
Using cached google_cloud_pubsub-2.18.4-py2.py3-none-any.whl (265 kB)
Using cached google_cloud_pubsublite-1.8.3-py2.py3-none-any.whl (288 kB)
Using cached google_cloud_recommendations_ai-0.10.5-py2.py3-none-any.whl (173 kB)
Using cached google_cloud_spanner-3.40.1-py2.py3-none-any.whl (332 kB)
Using cached google_cloud_videointelligence-2.11.4-py2.py3-none-any.whl (229 kB)
Using cached google_cloud_vision-3.4.4-py2.py3-none-any.whl (444 kB)
Using cached grpcio-1.59.0-cp38-cp38-manylinux_2_17_x86_64.manylinux2014_x86_64.whl (5.3 MB)
Using cached hypothesis-6.88.1-py3-none-any.whl (421 kB)
Using cached joblib-1.3.2-py3-none-any.whl (302 kB)
Using cached mock-5.1.0-py3-none-any.whl (30 kB)
Using cached numpy-1.24.4-cp38-cp38-manylinux_2_17_x86_64.manylinux2014_x86_64.whl (17.3 MB)
Using cached orjson-3.9.9-cp38-cp38-manylinux_2_17_x86_64.manylinux2014_x86_64.whl (138 kB)
Using cached proto_plus-1.22.3-py3-none-any.whl (48 kB)
Using cached protobuf-4.24.4-cp37-abi3-manylinux2014_x86_64.whl (311 kB)
Using cached psycopg2_binary-2.9.9-cp38-cp38-manylinux_2_17_x86_64.manylinux2014_x86_64.whl (3.0 MB)
Using cached pymongo-4.5.0-cp38-cp38-manylinux_2_17_x86_64.manylinux2014_x86_64.whl (687 kB)
Using cached pytest-7.4.2-py3-none-any.whl (324 kB)
Using cached pytest_timeout-2.2.0-py3-none-any.whl (13 kB)
Using cached pytest_xdist-3.3.1-py3-none-any.whl (41 kB)
Using cached pytz-2023.3.post1-py2.py3-none-any.whl (502 kB)
Using cached PyYAML-6.0.1-cp38-cp38-manylinux_2_17_x86_64.manylinux2014_x86_64.whl (736 kB)
Using cached regex-2023.10.3-cp38-cp38-manylinux_2_17_x86_64.manylinux2014_x86_64.whl (776 kB)
Using cached requests-2.31.0-py3-none-any.whl (62 kB)
Using cached requests_mock-1.11.0-py2.py3-none-any.whl (28 kB)
Using cached scikit_learn-1.3.1-cp38-cp38-manylinux_2_17_x86_64.manylinux2014_x86_64.whl (11.1 MB)
Using cached SQLAlchemy-1.4.49-cp38-cp38-manylinux_2_5_x86_64.manylinux1_x86_64.manylinux_2_17_x86_64.manylinux2014_x86_64.whl (1.6 MB)
Using cached tenacity-8.2.3-py3-none-any.whl (24 kB)
Using cached typing_extensions-4.8.0-py3-none-any.whl (31 kB)
Using cached botocore-1.31.64-py3-none-any.whl (11.3 MB)
Using cached certifi-2023.7.22-py3-none-any.whl (158 kB)
Using cached cffi-1.16.0-cp38-cp38-manylinux_2_17_x86_64.manylinux2014_x86_64.whl (444 kB)
Using cached charset_normalizer-3.3.0-cp38-cp38-manylinux_2_17_x86_64.manylinux2014_x86_64.whl (137 kB)
Using cached dnspython-2.4.2-py3-none-any.whl (300 kB)
Using cached docker-6.1.3-py3-none-any.whl (148 kB)
Using cached exceptiongroup-1.1.3-py3-none-any.whl (14 kB)
Using cached execnet-2.0.2-py3-none-any.whl (37 kB)
Using cached google_cloud_resource_manager-1.10.4-py2.py3-none-any.whl (320 kB)
Using cached google_cloud_storage-2.12.0-py2.py3-none-any.whl (120 kB)
Using cached google_resumable_media-2.6.0-py2.py3-none-any.whl (80 kB)
Using cached googleapis_common_protos-1.61.0-py2.py3-none-any.whl (230 kB)
Using cached greenlet-3.0.0-cp38-cp38-manylinux_2_24_x86_64.manylinux_2_28_x86_64.whl (617 kB)
Using cached grpcio_status-1.59.0-py3-none-any.whl (14 kB)
Using cached msal-1.24.1-py2.py3-none-any.whl (95 kB)
Using cached pyparsing-3.1.1-py3-none-any.whl (103 kB)
Using cached s3transfer-0.7.0-py3-none-any.whl (79 kB)
Using cached shapely-2.0.2-cp38-cp38-manylinux_2_17_x86_64.manylinux2014_x86_64.whl (2.5 MB)
Using cached threadpoolctl-3.2.0-py3-none-any.whl (15 kB)
Using cached tzlocal-5.1-py3-none-any.whl (21 kB)
Using cached urllib3-1.26.17-py2.py3-none-any.whl (143 kB)
Using cached PyMySQL-1.1.0-py3-none-any.whl (44 kB)
Using cached wrapt-1.16.0rc1-cp38-cp38-manylinux_2_5_x86_64.manylinux1_x86_64.manylinux_2_17_x86_64.manylinux2014_x86_64.whl (82 kB)
Using cached portalocker-2.8.2-py3-none-any.whl (17 kB)
Using cached PyJWT-2.8.0-py3-none-any.whl (22 kB)
Using cached websocket_client-1.6.4-py3-none-any.whl (57 kB)
Building wheels for collected packages: apache-beam
  Building wheel for apache-beam (pyproject.toml): started

> Task :sdks:java:io:google-cloud-platform:expansion-service:shadowDistZip
> Task :sdks:java:io:google-cloud-platform:expansion-service:assemble
> Task :sdks:java:io:google-cloud-platform:expansion-service:analyzeClassesDependencies
> Task :sdks:java:io:google-cloud-platform:expansion-service:analyzeTestClassesDependencies SKIPPED
> Task :sdks:java:io:google-cloud-platform:expansion-service:analyzeDependencies
> Task :sdks:java:io:google-cloud-platform:expansion-service:checkstyleMain NO-SOURCE
> Task :sdks:java:io:google-cloud-platform:expansion-service:checkstyleTest NO-SOURCE
> Task :sdks:java:io:google-cloud-platform:expansion-service:javadoc NO-SOURCE
> Task :sdks:java:io:google-cloud-platform:expansion-service:spotbugsMain NO-SOURCE
> Task :sdks:java:io:google-cloud-platform:expansion-service:spotbugsTest SKIPPED
> Task :sdks:java:io:google-cloud-platform:expansion-service:spotlessJava FROM-CACHE
> Task :sdks:java:io:google-cloud-platform:expansion-service:spotlessJavaCheck UP-TO-DATE
> Task :sdks:java:io:google-cloud-platform:expansion-service:spotlessCheck UP-TO-DATE
> Task :sdks:java:io:google-cloud-platform:expansion-service:test NO-SOURCE
> Task :sdks:java:io:google-cloud-platform:expansion-service:check
> Task :sdks:java:io:google-cloud-platform:expansion-service:build
> Task :runners:flink:1.15:job-server:shadowJar
> Task :runners:flink:1.15:job-server:flinkJobServerSetup
> Task :runners:flink:1.15:job-server:flinkJobServerCleanup

> Task :sdks:python:installGcpTest
WARNING: There was an error checking the latest version of pip.

FAILURE: Build failed with an exception.

* What went wrong:
Execution failed for task ':sdks:python:container:py38:docker'.
> Process 'command 'docker'' finished with non-zero exit value 1

* Try:
> Run with --stacktrace option to get the stack trace.
> Run with --info or --debug option to get more log output.
> Get more help at https://help.gradle.org.

Deprecated Gradle features were used in this build, making it incompatible with Gradle 9.0.

You can use '--warning-mode all' to show the individual deprecation warnings and determine if they come from your own scripts or plugins.

For more on this, please refer to https://docs.gradle.org/8.3/userguide/command_line_interface.html#sec:command_line_warnings in the Gradle documentation.

BUILD FAILED in 6m 25s
275 actionable tasks: 189 executed, 76 from cache, 10 up-to-date

Publishing build scan...
https://ge.apache.org/s/jto5sgxj4r27a

Build step 'Invoke Gradle script' changed build result to FAILURE
Build step 'Invoke Gradle script' marked build as failure

---------------------------------------------------------------------
To unsubscribe, e-mail: builds-unsubscribe@beam.apache.org
For additional commands, e-mail: builds-help@beam.apache.org