You are viewing a plain text version of this content. The canonical link for it is here.
Posted to dev@kafka.apache.org by Apache Jenkins Server <je...@builds.apache.org> on 2018/03/27 04:51:33 UTC

Build failed in Jenkins: kafka-0.10.1-jdk7 #133

See <https://builds.apache.org/job/kafka-0.10.1-jdk7/133/display/redirect?page=changes>

Changes:

[github] KAFKA-6054: Fix upgrade path from Kafka Streams v0.10.0 (#4746)

------------------------------------------
Started by an SCM change
[EnvInject] - Loading node environment variables.
Building remotely on H29 (ubuntu xenial) in workspace <https://builds.apache.org/job/kafka-0.10.1-jdk7/ws/>
Cloning the remote Git repository
Cloning repository https://github.com/apache/kafka.git
 > git init <https://builds.apache.org/job/kafka-0.10.1-jdk7/ws/> # timeout=10
Fetching upstream changes from https://github.com/apache/kafka.git
 > git --version # timeout=10
 > git fetch --tags --progress https://github.com/apache/kafka.git +refs/heads/*:refs/remotes/origin/*
 > git config remote.origin.url https://github.com/apache/kafka.git # timeout=10
 > git config --add remote.origin.fetch +refs/heads/*:refs/remotes/origin/* # timeout=10
 > git config remote.origin.url https://github.com/apache/kafka.git # timeout=10
Fetching upstream changes from https://github.com/apache/kafka.git
 > git fetch --tags --progress https://github.com/apache/kafka.git +refs/heads/*:refs/remotes/origin/*
 > git rev-parse refs/remotes/origin/0.10.1^{commit} # timeout=10
 > git rev-parse refs/remotes/origin/origin/0.10.1^{commit} # timeout=10
Checking out Revision faac933aeee5d976008a17248650943923728408 (refs/remotes/origin/0.10.1)
 > git config core.sparsecheckout # timeout=10
 > git checkout -f faac933aeee5d976008a17248650943923728408
Commit message: "KAFKA-6054: Fix upgrade path from Kafka Streams v0.10.0 (#4746)"
 > git rev-list --no-walk 1691a7a256859dcbc91b8db7d63ae7d14f794373 # timeout=10
ERROR: No tool found matching GRADLE_2_4_RC_2_HOME
[kafka-0.10.1-jdk7] $ /bin/bash -xe /tmp/jenkins461985903126424680.sh
+ rm -rf <https://builds.apache.org/job/kafka-0.10.1-jdk7/ws/.gradle>
+ /bin/gradle
/tmp/jenkins461985903126424680.sh: line 4: /bin/gradle: No such file or directory
Build step 'Execute shell' marked build as failure
Recording test results
ERROR: No tool found matching GRADLE_2_4_RC_2_HOME
ERROR: Step ?Publish JUnit test result report? failed: No test report files were found. Configuration error?
ERROR: No tool found matching GRADLE_2_4_RC_2_HOME
Not sending mail to unregistered user github@alasdairhodge.co.uk

Jenkins build is back to normal : kafka-0.10.1-jdk7 #136

Posted by Apache Jenkins Server <je...@builds.apache.org>.
See <https://builds.apache.org/job/kafka-0.10.1-jdk7/136/display/redirect?page=changes>


Build failed in Jenkins: kafka-0.10.1-jdk7 #135

Posted by Apache Jenkins Server <je...@builds.apache.org>.
See <https://builds.apache.org/job/kafka-0.10.1-jdk7/135/display/redirect>

------------------------------------------
[...truncated 588.74 KB...]
org.apache.kafka.streams.processor.internals.StreamPartitionAssignorTest > shouldMapUserEndPointToTopicPartitions PASSED

org.apache.kafka.streams.processor.internals.StreamPartitionAssignorTest > shouldAddUserDefinedEndPointToSubscription STARTED

org.apache.kafka.streams.processor.internals.StreamPartitionAssignorTest > shouldAddUserDefinedEndPointToSubscription PASSED

org.apache.kafka.streams.processor.internals.StreamPartitionAssignorTest > testAssignWithStandbyReplicas STARTED

org.apache.kafka.streams.processor.internals.StreamPartitionAssignorTest > testAssignWithStandbyReplicas PASSED

org.apache.kafka.streams.processor.internals.StreamPartitionAssignorTest > testAssignWithNewTasks STARTED

org.apache.kafka.streams.processor.internals.StreamPartitionAssignorTest > testAssignWithNewTasks PASSED

org.apache.kafka.streams.processor.internals.StreamPartitionAssignorTest > shouldExposeHostStateToTopicPartitionsOnAssignment STARTED

org.apache.kafka.streams.processor.internals.StreamPartitionAssignorTest > shouldExposeHostStateToTopicPartitionsOnAssignment PASSED

org.apache.kafka.streams.processor.internals.StreamPartitionAssignorTest > shouldReturnLowestAssignmentVersionForDifferentSubscriptionVersions STARTED

org.apache.kafka.streams.processor.internals.StreamPartitionAssignorTest > shouldReturnLowestAssignmentVersionForDifferentSubscriptionVersions PASSED

org.apache.kafka.streams.processor.internals.StreamPartitionAssignorTest > testAssignWithStates STARTED

org.apache.kafka.streams.processor.internals.StreamPartitionAssignorTest > testAssignWithStates PASSED

org.apache.kafka.streams.processor.internals.StreamPartitionAssignorTest > shouldThrowExceptionIfApplicationServerConfigPortIsNotAnInteger STARTED

org.apache.kafka.streams.processor.internals.StreamPartitionAssignorTest > shouldThrowExceptionIfApplicationServerConfigPortIsNotAnInteger PASSED

org.apache.kafka.streams.processor.internals.StreamPartitionAssignorTest > shouldDownGradeSubscription STARTED

org.apache.kafka.streams.processor.internals.StreamPartitionAssignorTest > shouldDownGradeSubscription PASSED

org.apache.kafka.streams.processor.internals.StreamPartitionAssignorTest > shouldReturnEmptyClusterMetadataIfItHasntBeenBuilt STARTED

org.apache.kafka.streams.processor.internals.StreamPartitionAssignorTest > shouldReturnEmptyClusterMetadataIfItHasntBeenBuilt PASSED

org.apache.kafka.streams.processor.internals.StreamPartitionAssignorTest > testAssignBasic STARTED

org.apache.kafka.streams.processor.internals.StreamPartitionAssignorTest > testAssignBasic PASSED

org.apache.kafka.streams.processor.internals.StreamPartitionAssignorTest > testOnAssignment STARTED

org.apache.kafka.streams.processor.internals.StreamPartitionAssignorTest > testOnAssignment PASSED

org.apache.kafka.streams.processor.internals.StreamPartitionAssignorTest > testAssignWithInternalTopicThatsSourceIsAnotherInternalTopic STARTED

org.apache.kafka.streams.processor.internals.StreamPartitionAssignorTest > testAssignWithInternalTopicThatsSourceIsAnotherInternalTopic PASSED

org.apache.kafka.streams.processor.internals.StreamPartitionAssignorTest > testSubscription STARTED

org.apache.kafka.streams.processor.internals.StreamPartitionAssignorTest > testSubscription PASSED

org.apache.kafka.streams.processor.internals.StreamPartitionAssignorTest > shouldSetClusterMetadataOnAssignment STARTED

org.apache.kafka.streams.processor.internals.StreamPartitionAssignorTest > shouldSetClusterMetadataOnAssignment PASSED

org.apache.kafka.streams.processor.internals.StreamPartitionAssignorTest > testAssignWithInternalTopics STARTED

org.apache.kafka.streams.processor.internals.StreamPartitionAssignorTest > testAssignWithInternalTopics PASSED

org.apache.kafka.streams.processor.TopologyBuilderTest > shouldNotAllowNullProcessorSupplier STARTED

org.apache.kafka.streams.processor.TopologyBuilderTest > shouldNotAllowNullProcessorSupplier PASSED

org.apache.kafka.streams.processor.TopologyBuilderTest > shouldNotSetApplicationIdToNull STARTED

org.apache.kafka.streams.processor.TopologyBuilderTest > shouldNotSetApplicationIdToNull PASSED

org.apache.kafka.streams.processor.TopologyBuilderTest > testSourceTopics STARTED

org.apache.kafka.streams.processor.TopologyBuilderTest > testSourceTopics PASSED

org.apache.kafka.streams.processor.TopologyBuilderTest > shouldNotAllowNullNameWhenAddingSink STARTED

org.apache.kafka.streams.processor.TopologyBuilderTest > shouldNotAllowNullNameWhenAddingSink PASSED

org.apache.kafka.streams.processor.TopologyBuilderTest > testNamedTopicMatchesAlreadyProvidedPattern STARTED

org.apache.kafka.streams.processor.TopologyBuilderTest > testNamedTopicMatchesAlreadyProvidedPattern PASSED

org.apache.kafka.streams.processor.TopologyBuilderTest > shouldAddInternalTopicConfigWithCompactAndDeleteSetForWindowStores STARTED

org.apache.kafka.streams.processor.TopologyBuilderTest > shouldAddInternalTopicConfigWithCompactAndDeleteSetForWindowStores PASSED

org.apache.kafka.streams.processor.TopologyBuilderTest > shouldAddInternalTopicConfigWithCompactForNonWindowStores STARTED

org.apache.kafka.streams.processor.TopologyBuilderTest > shouldAddInternalTopicConfigWithCompactForNonWindowStores PASSED

org.apache.kafka.streams.processor.TopologyBuilderTest > testAddSinkWithSameName STARTED

org.apache.kafka.streams.processor.TopologyBuilderTest > testAddSinkWithSameName PASSED

org.apache.kafka.streams.processor.TopologyBuilderTest > testAddSinkWithSelfParent STARTED

org.apache.kafka.streams.processor.TopologyBuilderTest > testAddSinkWithSelfParent PASSED

org.apache.kafka.streams.processor.TopologyBuilderTest > testAddProcessorWithSelfParent STARTED

org.apache.kafka.streams.processor.TopologyBuilderTest > testAddProcessorWithSelfParent PASSED

org.apache.kafka.streams.processor.TopologyBuilderTest > shouldAssociateStateStoreNameWhenStateStoreSupplierIsInternal STARTED

org.apache.kafka.streams.processor.TopologyBuilderTest > shouldAssociateStateStoreNameWhenStateStoreSupplierIsInternal PASSED

org.apache.kafka.streams.processor.TopologyBuilderTest > testAddStateStoreWithSink STARTED

org.apache.kafka.streams.processor.TopologyBuilderTest > testAddStateStoreWithSink PASSED

org.apache.kafka.streams.processor.TopologyBuilderTest > testTopicGroups STARTED

org.apache.kafka.streams.processor.TopologyBuilderTest > testTopicGroups PASSED

org.apache.kafka.streams.processor.TopologyBuilderTest > testBuild STARTED

org.apache.kafka.streams.processor.TopologyBuilderTest > testBuild PASSED

org.apache.kafka.streams.processor.TopologyBuilderTest > shouldNotAddNullStateStoreSupplier STARTED

org.apache.kafka.streams.processor.TopologyBuilderTest > shouldNotAddNullStateStoreSupplier PASSED

org.apache.kafka.streams.processor.TopologyBuilderTest > shouldNotAllowNullNameWhenAddingSource STARTED

org.apache.kafka.streams.processor.TopologyBuilderTest > shouldNotAllowNullNameWhenAddingSource PASSED

org.apache.kafka.streams.processor.TopologyBuilderTest > shouldNotAllowNullTopicWhenAddingSink STARTED

org.apache.kafka.streams.processor.TopologyBuilderTest > shouldNotAllowNullTopicWhenAddingSink PASSED

org.apache.kafka.streams.processor.TopologyBuilderTest > testAddStateStoreWithSource STARTED

org.apache.kafka.streams.processor.TopologyBuilderTest > testAddStateStoreWithSource PASSED

org.apache.kafka.streams.processor.TopologyBuilderTest > shouldThroughOnUnassignedStateStoreAccess STARTED

org.apache.kafka.streams.processor.TopologyBuilderTest > shouldThroughOnUnassignedStateStoreAccess PASSED

org.apache.kafka.streams.processor.TopologyBuilderTest > shouldNotAllowNullProcessorNameWhenConnectingProcessorAndStateStores STARTED

org.apache.kafka.streams.processor.TopologyBuilderTest > shouldNotAllowNullProcessorNameWhenConnectingProcessorAndStateStores PASSED

org.apache.kafka.streams.processor.TopologyBuilderTest > testAddSourceWithSameName STARTED

org.apache.kafka.streams.processor.TopologyBuilderTest > testAddSourceWithSameName PASSED

org.apache.kafka.streams.processor.TopologyBuilderTest > testAddMoreThanOnePatternSourceNode STARTED

org.apache.kafka.streams.processor.TopologyBuilderTest > testAddMoreThanOnePatternSourceNode PASSED

org.apache.kafka.streams.processor.TopologyBuilderTest > testAddProcessorWithSameName STARTED

org.apache.kafka.streams.processor.TopologyBuilderTest > testAddProcessorWithSameName PASSED

org.apache.kafka.streams.processor.TopologyBuilderTest > shouldSetCorrectSourceNodesWithRegexUpdatedTopics STARTED

org.apache.kafka.streams.processor.TopologyBuilderTest > shouldSetCorrectSourceNodesWithRegexUpdatedTopics PASSED

org.apache.kafka.streams.processor.TopologyBuilderTest > testAddSourceWithSameTopic STARTED

org.apache.kafka.streams.processor.TopologyBuilderTest > testAddSourceWithSameTopic PASSED

org.apache.kafka.streams.processor.TopologyBuilderTest > testTopicGroupsByStateStore STARTED

org.apache.kafka.streams.processor.TopologyBuilderTest > testTopicGroupsByStateStore PASSED

org.apache.kafka.streams.processor.TopologyBuilderTest > testAddStateStoreWithDuplicates STARTED

org.apache.kafka.streams.processor.TopologyBuilderTest > testAddStateStoreWithDuplicates PASSED

org.apache.kafka.streams.processor.TopologyBuilderTest > testPatternSourceTopic STARTED

org.apache.kafka.streams.processor.TopologyBuilderTest > testPatternSourceTopic PASSED

org.apache.kafka.streams.processor.TopologyBuilderTest > shouldAssociateStateStoreNameWhenStateStoreSupplierIsExternal STARTED

org.apache.kafka.streams.processor.TopologyBuilderTest > shouldAssociateStateStoreNameWhenStateStoreSupplierIsExternal PASSED

org.apache.kafka.streams.processor.TopologyBuilderTest > testAddSinkWithWrongParent STARTED

org.apache.kafka.streams.processor.TopologyBuilderTest > testAddSinkWithWrongParent PASSED

org.apache.kafka.streams.processor.TopologyBuilderTest > testPatternMatchesAlreadyProvidedTopicSource STARTED

org.apache.kafka.streams.processor.TopologyBuilderTest > testPatternMatchesAlreadyProvidedTopicSource PASSED

org.apache.kafka.streams.processor.TopologyBuilderTest > testAddSinkConnectedWithMultipleParent STARTED

org.apache.kafka.streams.processor.TopologyBuilderTest > testAddSinkConnectedWithMultipleParent PASSED

org.apache.kafka.streams.processor.TopologyBuilderTest > testSubscribeTopicNameAndPattern STARTED

org.apache.kafka.streams.processor.TopologyBuilderTest > testSubscribeTopicNameAndPattern PASSED

org.apache.kafka.streams.processor.TopologyBuilderTest > shouldNotAddNullInternalTopic STARTED

org.apache.kafka.streams.processor.TopologyBuilderTest > shouldNotAddNullInternalTopic PASSED

org.apache.kafka.streams.processor.TopologyBuilderTest > testAddProcessorWithWrongParent STARTED

org.apache.kafka.streams.processor.TopologyBuilderTest > testAddProcessorWithWrongParent PASSED

org.apache.kafka.streams.processor.TopologyBuilderTest > shouldNotAllowNullNameWhenAddingProcessor STARTED

org.apache.kafka.streams.processor.TopologyBuilderTest > shouldNotAllowNullNameWhenAddingProcessor PASSED

org.apache.kafka.streams.processor.TopologyBuilderTest > testAddStateStore STARTED

org.apache.kafka.streams.processor.TopologyBuilderTest > testAddStateStore PASSED

org.apache.kafka.streams.processor.TopologyBuilderTest > testAddSinkConnectedWithParent STARTED

org.apache.kafka.streams.processor.TopologyBuilderTest > testAddSinkConnectedWithParent PASSED

org.apache.kafka.streams.processor.TopologyBuilderTest > testAddStateStoreWithNonExistingProcessor STARTED

org.apache.kafka.streams.processor.TopologyBuilderTest > testAddStateStoreWithNonExistingProcessor PASSED

org.apache.kafka.streams.processor.TopologyBuilderTest > shouldAddInternalTopicConfigWithCleanupPolicyDeleteForInternalTopics STARTED

org.apache.kafka.streams.processor.TopologyBuilderTest > shouldAddInternalTopicConfigWithCleanupPolicyDeleteForInternalTopics PASSED

org.apache.kafka.streams.processor.TopologyBuilderTest > shouldCorrectlyMapStateStoreToInternalTopics STARTED

org.apache.kafka.streams.processor.TopologyBuilderTest > shouldCorrectlyMapStateStoreToInternalTopics PASSED

520 tests completed, 2 failed
:streams:test FAILED

FAILURE: Build failed with an exception.

* What went wrong:
Execution failed for task ':streams:test'.
> There were failing tests. See the report at: file://<https://builds.apache.org/job/kafka-0.10.1-jdk7/ws/streams/build/reports/tests/test/index.html>

* Try:
Run with --stacktrace option to get the stack trace. Run with --info or --debug option to get more log output.

BUILD FAILED

Total time: 2 hrs 12 mins 23.305 secs
Build step 'Execute shell' marked build as failure
Recording test results
ERROR: No tool found matching GRADLE_2_4_RC_2_HOME
Setting GRADLE_4_4_HOME=/home/jenkins/tools/gradle/4.4
ERROR: No tool found matching GRADLE_2_4_RC_2_HOME
Setting GRADLE_4_4_HOME=/home/jenkins/tools/gradle/4.4
Not sending mail to unregistered user github@alasdairhodge.co.uk
Not sending mail to unregistered user ismael@juma.me.uk

Build failed in Jenkins: kafka-0.10.1-jdk7 #134

Posted by Apache Jenkins Server <je...@builds.apache.org>.
See <https://builds.apache.org/job/kafka-0.10.1-jdk7/134/display/redirect?page=changes>

Changes:

[ismael] MINOR: use jdk8 to build/run system tests (#4944)

------------------------------------------
Started by an SCM change
[EnvInject] - Loading node environment variables.
Building remotely on ubuntu-eu3 (ubuntu xenial) in workspace <https://builds.apache.org/job/kafka-0.10.1-jdk7/ws/>
Cloning the remote Git repository
Cloning repository https://github.com/apache/kafka.git
 > git init <https://builds.apache.org/job/kafka-0.10.1-jdk7/ws/> # timeout=10
Fetching upstream changes from https://github.com/apache/kafka.git
 > git --version # timeout=10
 > git fetch --tags --progress https://github.com/apache/kafka.git +refs/heads/*:refs/remotes/origin/*
 > git config remote.origin.url https://github.com/apache/kafka.git # timeout=10
 > git config --add remote.origin.fetch +refs/heads/*:refs/remotes/origin/* # timeout=10
 > git config remote.origin.url https://github.com/apache/kafka.git # timeout=10
Fetching upstream changes from https://github.com/apache/kafka.git
 > git fetch --tags --progress https://github.com/apache/kafka.git +refs/heads/*:refs/remotes/origin/*
 > git rev-parse refs/remotes/origin/0.10.1^{commit} # timeout=10
 > git rev-parse refs/remotes/origin/origin/0.10.1^{commit} # timeout=10
Checking out Revision 2a2def1d9f52422231591c810e637433ac3fc160 (refs/remotes/origin/0.10.1)
 > git config core.sparsecheckout # timeout=10
 > git checkout -f 2a2def1d9f52422231591c810e637433ac3fc160
Commit message: "MINOR: use jdk8 to build/run system tests (#4944)"
 > git rev-list --no-walk faac933aeee5d976008a17248650943923728408 # timeout=10
ERROR: No tool found matching GRADLE_2_4_RC_2_HOME
[kafka-0.10.1-jdk7] $ /bin/bash -xe /tmp/jenkins3377613501328666319.sh
+ rm -rf <https://builds.apache.org/job/kafka-0.10.1-jdk7/ws/.gradle>
+ /bin/gradle
/tmp/jenkins3377613501328666319.sh: line 4: /bin/gradle: No such file or directory
Build step 'Execute shell' marked build as failure
Recording test results
ERROR: No tool found matching GRADLE_2_4_RC_2_HOME
ERROR: Step ‘Publish JUnit test result report’ failed: No test report files were found. Configuration error?
ERROR: No tool found matching GRADLE_2_4_RC_2_HOME
Not sending mail to unregistered user github@alasdairhodge.co.uk
Not sending mail to unregistered user ismael@juma.me.uk