You are viewing a plain text version of this content. The canonical link for it is here.
Posted to builds@hbase.apache.org by Apache Jenkins Server <je...@builds.apache.org> on 2017/05/02 06:21:57 UTC

Build failed in Jenkins: HBase-1.4 » JDK_1_8,Hadoop&&!H13 #714

See <https://builds.apache.org/job/HBase-1.4/jdk=JDK_1_8,label=Hadoop&&!H13/714/display/redirect?page=changes>

Changes:

[anoopsamjohn] HBASE-17757 Unify blocksize after encoding to decrease memory fragment

------------------------------------------
[...truncated 2.24 MB...]
test_row_2/C:col35/1493705176372/Put/vlen=10/seqid=0 val= \x05\xE2\xA7t7\x1A\xB1lL\xFB
test_row_2/C:col36/1493705176372/Put/vlen=10/seqid=0 val= \x05\xE2\xA7t7\x1A\xB1lL\xFB
test_row_2/C:col37/1493705176372/Put/vlen=10/seqid=0 val= \x05\xE2\xA7t7\x1A\xB1lL\xFB
test_row_2/C:col38/1493705176372/Put/vlen=10/seqid=0 val= \x05\xE2\xA7t7\x1A\xB1lL\xFB
test_row_2/C:col39/1493705176372/Put/vlen=10/seqid=0 val= \x05\xE2\xA7t7\x1A\xB1lL\xFB
test_row_2/C:col4/1493705176372/Put/vlen=10/seqid=0 val= \x05\xE2\xA7t7\x1A\xB1lL\xFB
test_row_2/C:col40/1493705176372/Put/vlen=10/seqid=0 val= \x05\xE2\xA7t7\x1A\xB1lL\xFB
test_row_2/C:col41/1493705176372/Put/vlen=10/seqid=0 val= \x05\xE2\xA7t7\x1A\xB1lL\xFB
test_row_2/C:col42/1493705176372/Put/vlen=10/seqid=0 val= \x05\xE2\xA7t7\x1A\xB1lL\xFB
test_row_2/C:col43/1493705176372/Put/vlen=10/seqid=0 val= \x05\xE2\xA7t7\x1A\xB1lL\xFB
test_row_2/C:col44/1493705176372/Put/vlen=10/seqid=0 val= \x05\xE2\xA7t7\x1A\xB1lL\xFB
test_row_2/C:col45/1493705176372/Put/vlen=10/seqid=0 val= \x05\xE2\xA7t7\x1A\xB1lL\xFB
test_row_2/C:col46/1493705176372/Put/vlen=10/seqid=0 val= \x05\xE2\xA7t7\x1A\xB1lL\xFB
test_row_2/C:col47/1493705176372/Put/vlen=10/seqid=0 val= \x05\xE2\xA7t7\x1A\xB1lL\xFB
test_row_2/C:col48/1493705176372/Put/vlen=10/seqid=0 val= \x05\xE2\xA7t7\x1A\xB1lL\xFB
test_row_2/C:col49/1493705176372/Put/vlen=10/seqid=0 val= \x05\xE2\xA7t7\x1A\xB1lL\xFB
test_row_2/C:col5/1493705176372/Put/vlen=10/seqid=0 val= \x05\xE2\xA7t7\x1A\xB1lL\xFB
test_row_2/C:col6/1493705176372/Put/vlen=10/seqid=0 val= \x05\xE2\xA7t7\x1A\xB1lL\xFB
test_row_2/C:col7/1493705176372/Put/vlen=10/seqid=0 val= \x05\xE2\xA7t7\x1A\xB1lL\xFB
test_row_2/C:col8/1493705176372/Put/vlen=10/seqid=0 val= \x05\xE2\xA7t7\x1A\xB1lL\xFB
test_row_2/C:col9/1493705176372/Put/vlen=10/seqid=0 val= \x05\xE2\xA7t7\x1A\xB1lL\xFB

	at org.apache.hadoop.hbase.TestAcidGuarantees$AtomicGetReader.gotFailure(TestAcidGuarantees.java:188)
	at org.apache.hadoop.hbase.TestAcidGuarantees$AtomicGetReader.doAnAction(TestAcidGuarantees.java:168)
	at org.apache.hadoop.hbase.MultithreadedTestUtil$RepeatingTestThread.doWork(MultithreadedTestUtil.java:147)
	at org.apache.hadoop.hbase.MultithreadedTestUtil$TestThread.run(MultithreadedTestUtil.java:123)

Running org.apache.hadoop.hbase.replication.regionserver.TestRegionReplicaReplicationEndpointNoMaster
Tests run: 4, Failures: 0, Errors: 0, Skipped: 0, Time elapsed: 18.269 sec - in org.apache.hadoop.hbase.replication.regionserver.TestRegionReplicaReplicationEndpointNoMaster
Tests run: 9, Failures: 0, Errors: 0, Skipped: 0, Time elapsed: 82.1 sec - in org.apache.hadoop.hbase.replication.regionserver.TestRegionReplicaReplicationEndpoint
Running org.apache.hadoop.hbase.replication.regionserver.TestReplicationSink
Running org.apache.hadoop.hbase.replication.regionserver.TestReplicationSourceManager
Tests run: 6, Failures: 0, Errors: 0, Skipped: 0, Time elapsed: 5.024 sec - in org.apache.hadoop.hbase.replication.regionserver.TestReplicationSink
Tests run: 9, Failures: 0, Errors: 0, Skipped: 0, Time elapsed: 10.851 sec - in org.apache.hadoop.hbase.replication.regionserver.TestReplicationSourceManager
Running org.apache.hadoop.hbase.replication.regionserver.TestGlobalThrottler
Running org.apache.hadoop.hbase.replication.TestReplicationSyncUpToolWithBulkLoadedData
Tests run: 10, Failures: 0, Errors: 0, Skipped: 0, Time elapsed: 169.655 sec - in org.apache.hadoop.hbase.TestZooKeeper
Running org.apache.hadoop.hbase.replication.TestReplicationTrackerZKImpl
Tests run: 5, Failures: 0, Errors: 0, Skipped: 0, Time elapsed: 0.855 sec - in org.apache.hadoop.hbase.replication.TestReplicationTrackerZKImpl
Tests run: 1, Failures: 0, Errors: 0, Skipped: 0, Time elapsed: 38.455 sec - in org.apache.hadoop.hbase.replication.TestReplicationSyncUpToolWithBulkLoadedData
Running org.apache.hadoop.hbase.replication.TestReplicationKillMasterRSCompressed
Tests run: 3, Failures: 0, Errors: 0, Skipped: 0, Time elapsed: 182.366 sec - in org.apache.hadoop.hbase.replication.TestSerialReplication
Running org.apache.hadoop.hbase.replication.TestMultiSlaveReplication
Tests run: 1, Failures: 0, Errors: 0, Skipped: 0, Time elapsed: 66.449 sec - in org.apache.hadoop.hbase.replication.regionserver.TestGlobalThrottler
Tests run: 1, Failures: 0, Errors: 0, Skipped: 0, Time elapsed: 15.875 sec - in org.apache.hadoop.hbase.replication.TestReplicationKillMasterRSCompressed
Running org.apache.hadoop.hbase.replication.TestReplicationKillMasterRS
Tests run: 8, Failures: 0, Errors: 0, Skipped: 0, Time elapsed: 221.532 sec - in org.apache.hadoop.hbase.replication.regionserver.TestReplicationWALReaderManager
Tests run: 1, Failures: 0, Errors: 0, Skipped: 0, Time elapsed: 12.804 sec - in org.apache.hadoop.hbase.replication.TestReplicationKillMasterRS
Running org.apache.hadoop.hbase.replication.TestReplicationChangingPeerRegionservers
Running org.apache.hadoop.hbase.replication.TestReplicationStatus
Tests run: 1, Failures: 0, Errors: 0, Skipped: 0, Time elapsed: 6.194 sec - in org.apache.hadoop.hbase.replication.TestReplicationChangingPeerRegionservers
Tests run: 1, Failures: 0, Errors: 0, Skipped: 0, Time elapsed: 13.577 sec - in org.apache.hadoop.hbase.replication.TestReplicationStatus
Running org.apache.hadoop.hbase.replication.TestReplicationKillSlaveRS
Running org.apache.hadoop.hbase.replication.multiwal.TestReplicationKillMasterRSCompressedWithMultipleWAL
Tests run: 2, Failures: 0, Errors: 0, Skipped: 0, Time elapsed: 67.667 sec - in org.apache.hadoop.hbase.replication.TestMultiSlaveReplication
Running org.apache.hadoop.hbase.replication.multiwal.TestReplicationSyncUpToolWithMultipleWAL
Tests run: 1, Failures: 0, Errors: 0, Skipped: 0, Time elapsed: 12.978 sec - in org.apache.hadoop.hbase.replication.TestReplicationKillSlaveRS
Tests run: 1, Failures: 0, Errors: 0, Skipped: 0, Time elapsed: 14.858 sec - in org.apache.hadoop.hbase.replication.multiwal.TestReplicationKillMasterRSCompressedWithMultipleWAL
Running org.apache.hadoop.hbase.replication.TestMasterReplication
Running org.apache.hadoop.hbase.replication.multiwal.TestReplicationEndpointWithMultipleWAL
Running org.apache.hadoop.hbase.replication.TestPerTableCFReplication
Tests run: 7, Failures: 0, Errors: 0, Skipped: 0, Time elapsed: 11.243 sec - in org.apache.hadoop.hbase.replication.multiwal.TestReplicationEndpointWithMultipleWAL
Running org.apache.hadoop.hbase.replication.TestReplicationDisableInactivePeer
Running org.apache.hadoop.hbase.replication.TestReplicationWithTags
Tests run: 1, Failures: 0, Errors: 0, Skipped: 0, Time elapsed: 20.678 sec - in org.apache.hadoop.hbase.replication.TestReplicationDisableInactivePeer
Tests run: 1, Failures: 0, Errors: 0, Skipped: 0, Time elapsed: 2.97 sec - in org.apache.hadoop.hbase.replication.TestReplicationWithTags
Tests run: 3, Failures: 0, Errors: 0, Skipped: 0, Time elapsed: 37.623 sec - in org.apache.hadoop.hbase.replication.TestPerTableCFReplication
Tests run: 1, Failures: 0, Errors: 0, Skipped: 0, Time elapsed: 62.96 sec - in org.apache.hadoop.hbase.replication.multiwal.TestReplicationSyncUpToolWithMultipleWAL
Running org.apache.hadoop.hbase.replication.TestReplicationSource
Tests run: 2, Failures: 0, Errors: 0, Skipped: 0, Time elapsed: 1.695 sec - in org.apache.hadoop.hbase.replication.TestReplicationSource
Running org.apache.hadoop.hbase.replication.TestReplicationStateZKImpl
Tests run: 9, Failures: 0, Errors: 0, Skipped: 0, Time elapsed: 1.196 sec - in org.apache.hadoop.hbase.replication.TestReplicationStateZKImpl
Running org.apache.hadoop.hbase.fs.TestBlockReorder
Running org.apache.hadoop.hbase.replication.TestReplicationEndpoint
Running org.apache.hadoop.hbase.replication.TestReplicationSmallTests
Tests run: 7, Failures: 0, Errors: 0, Skipped: 0, Time elapsed: 12.102 sec - in org.apache.hadoop.hbase.replication.TestReplicationEndpoint
Running org.apache.hadoop.hbase.replication.TestReplicationSyncUpTool
Tests run: 3, Failures: 0, Errors: 0, Skipped: 0, Time elapsed: 27.236 sec - in org.apache.hadoop.hbase.fs.TestBlockReorder
Running org.apache.hadoop.hbase.trace.TestHTraceHooks
Running org.apache.hadoop.hbase.TestMovedRegionsCleaner
Tests run: 1, Failures: 0, Errors: 0, Skipped: 0, Time elapsed: 11.246 sec - in org.apache.hadoop.hbase.TestMovedRegionsCleaner
Tests run: 1, Failures: 0, Errors: 0, Skipped: 0, Time elapsed: 14.872 sec - in org.apache.hadoop.hbase.trace.TestHTraceHooks
Running org.apache.hadoop.hbase.TestMetaTableLocator
Tests run: 7, Failures: 0, Errors: 0, Skipped: 0, Time elapsed: 3.827 sec - in org.apache.hadoop.hbase.TestMetaTableLocator
Running org.apache.hadoop.hbase.namespace.TestNamespaceAuditor
Running org.apache.hadoop.hbase.mapred.TestTableMapReduceUtil
Tests run: 1, Failures: 0, Errors: 0, Skipped: 0, Time elapsed: 62.88 sec - in org.apache.hadoop.hbase.replication.TestReplicationSyncUpTool
Tests run: 13, Failures: 0, Errors: 0, Skipped: 0, Time elapsed: 83.832 sec - in org.apache.hadoop.hbase.replication.TestReplicationSmallTests
Running org.apache.hadoop.hbase.mapred.TestTableSnapshotInputFormat
Running org.apache.hadoop.hbase.mapred.TestMultiTableSnapshotInputFormat
Tests run: 4, Failures: 0, Errors: 0, Skipped: 0, Time elapsed: 36.971 sec - in org.apache.hadoop.hbase.mapred.TestMultiTableSnapshotInputFormat
Running org.apache.hadoop.hbase.mapred.TestTableInputFormat
Tests run: 12, Failures: 0, Errors: 0, Skipped: 1, Time elapsed: 111.068 sec - in org.apache.hadoop.hbase.namespace.TestNamespaceAuditor
Tests run: 8, Failures: 0, Errors: 0, Skipped: 0, Time elapsed: 236.976 sec - in org.apache.hadoop.hbase.replication.TestMasterReplication
Tests run: 4, Failures: 0, Errors: 0, Skipped: 0, Time elapsed: 95.896 sec - in org.apache.hadoop.hbase.mapred.TestTableMapReduceUtil
Running org.apache.hadoop.hbase.TestMultiVersions
Running org.apache.hadoop.hbase.mapred.TestTableMapReduce
Tests run: 7, Failures: 0, Errors: 0, Skipped: 0, Time elapsed: 104.251 sec - in org.apache.hadoop.hbase.mapred.TestTableSnapshotInputFormat
Tests run: 3, Failures: 0, Errors: 0, Skipped: 0, Time elapsed: 9.022 sec - in org.apache.hadoop.hbase.TestMultiVersions
Tests run: 2, Failures: 0, Errors: 0, Skipped: 0, Time elapsed: 18.024 sec - in org.apache.hadoop.hbase.mapred.TestTableMapReduce
Tests run: 8, Failures: 0, Errors: 0, Skipped: 0, Time elapsed: 87.302 sec - in org.apache.hadoop.hbase.mapred.TestTableInputFormat

Results :

Failed tests: 
org.apache.hadoop.hbase.regionserver.TestScannerHeartbeatMessages.testScannerHeartbeatMessages(org.apache.hadoop.hbase.regionserver.TestScannerHeartbeatMessages)
  Run 1: TestScannerHeartbeatMessages.testScannerHeartbeatMessages:207->testImportanceOfHeartbeats:237 Heartbeats messages are disabled, an exception should be thrown. If an exception  is not thrown, the test case is not testing the importance of heartbeat messages
  Run 2: TestScannerHeartbeatMessages.testScannerHeartbeatMessages:207->testImportanceOfHeartbeats:237 Heartbeats messages are disabled, an exception should be thrown. If an exception  is not thrown, the test case is not testing the importance of heartbeat messages
  Run 3: TestScannerHeartbeatMessages.testScannerHeartbeatMessages:207->testImportanceOfHeartbeats:237 Heartbeats messages are disabled, an exception should be thrown. If an exception  is not thrown, the test case is not testing the importance of heartbeat messages

Tests in error: 
  TestAcidGuarantees.testGetAtomicity:337->runTestAtomicity:254->runTestAtomicity:315 » Runtime
Flaked tests: 
org.apache.hadoop.hbase.regionserver.TestCompactionInDeadRegionServer.test(org.apache.hadoop.hbase.regionserver.TestCompactionInDeadRegionServer)
  Run 1: TestCompactionInDeadRegionServer.test:132 Should fail as our wal file has already been closed, and walDir has also been renamed
  Run 2: PASS


Tests run: 2778, Failures: 1, Errors: 1, Skipped: 57, Flakes: 1

[INFO] ------------------------------------------------------------------------
[INFO] Reactor Summary:
[INFO] 
[INFO] Apache HBase ...................................... SUCCESS [1:39.483s]
[INFO] Apache HBase - Checkstyle ......................... SUCCESS [14.833s]
[INFO] Apache HBase - Resource Bundle .................... SUCCESS [0.133s]
[INFO] Apache HBase - Annotations ........................ SUCCESS [0.980s]
[INFO] Apache HBase - Protocol ........................... SUCCESS [16.274s]
[INFO] Apache HBase - Common ............................. SUCCESS [2:32.713s]
[INFO] Apache HBase - Procedure .......................... SUCCESS [3:33.902s]
[INFO] Apache HBase - Hadoop Compatibility ............... SUCCESS [10.532s]
[INFO] Apache HBase - Hadoop Two Compatibility ........... SUCCESS [17.421s]
[INFO] Apache HBase - Client ............................. SUCCESS [1:36.557s]
[INFO] Apache HBase - Prefix Tree ........................ SUCCESS [7.606s]
[INFO] Apache HBase - Server ............................. FAILURE [1:25:18.869s]
[INFO] Apache HBase - Testing Util ....................... SKIPPED
[INFO] Apache HBase - Thrift ............................. SKIPPED
[INFO] Apache HBase - Rest ............................... SKIPPED
[INFO] Apache HBase - Shell .............................. SKIPPED
[INFO] Apache HBase - Integration Tests .................. SKIPPED
[INFO] Apache HBase - Examples ........................... SKIPPED
[INFO] Apache HBase - External Block Cache ............... SKIPPED
[INFO] Apache HBase - Assembly ........................... SKIPPED
[INFO] Apache HBase - Shaded ............................. SKIPPED
[INFO] Apache HBase - Shaded - Client .................... SKIPPED
[INFO] Apache HBase - Shaded - Server .................... SKIPPED
[INFO] Apache HBase - Archetypes ......................... SKIPPED
[INFO] Apache HBase - Exemplar for hbase-client archetype  SKIPPED
[INFO] Apache HBase - Exemplar for hbase-shaded-client archetype  SKIPPED
[INFO] Apache HBase - Archetype builder .................. SKIPPED
[INFO] ------------------------------------------------------------------------
[INFO] BUILD FAILURE
[INFO] ------------------------------------------------------------------------
[INFO] Total time: 1:36:19.769s
[INFO] Finished at: Tue May 02 06:15:59 UTC 2017
[INFO] Final Memory: 98M/829M
[INFO] ------------------------------------------------------------------------
[ERROR] Failed to execute goal org.apache.maven.plugins:maven-surefire-plugin:2.18.1:test (secondPartTestsExecution) on project hbase-server: ExecutionException: java.lang.RuntimeException: java.lang.RuntimeException: org.apache.maven.surefire.report.ReporterException: When writing xml report stdout/stderr: /tmp/stderr6697003753907488529deferred (No such file or directory) -> [Help 1]
[ERROR] 
[ERROR] To see the full stack trace of the errors, re-run Maven with the -e switch.
[ERROR] Re-run Maven using the -X switch to enable full debug logging.
[ERROR] 
[ERROR] For more information about the errors and possible solutions, please read the following articles:
[ERROR] [Help 1] http://cwiki.apache.org/confluence/display/MAVEN/MojoFailureException
[ERROR] 
[ERROR] After correcting the problems, you can resume the build with the command
[ERROR]   mvn <goals> -rf :hbase-server
Build step 'Invoke top-level Maven targets' marked build as failure
Performing Post build task...
Match found for :.* : True
Logical operation result is TRUE
Running script  : # Post-build task script. TODO: Check this in and have all builds reference check-in.
pwd && ls
# NOTE!!!! The below code has been copied and pasted from ./dev-tools/run-test.sh
# Do not change here without syncing there and vice-versa.
ZOMBIE_TESTS_COUNT=`jps -v | grep surefirebooter | grep -e '-Dhbase.test' | wc -l`
if [[ $ZOMBIE_TESTS_COUNT != 0 ]] ; then
 echo "Suspicious java process found - waiting 30s to see if there are just slow to stop"
 sleep 30
 ZOMBIE_TESTS_COUNT=`jps -v | grep surefirebooter | grep -e '-Dhbase.test' | wc -l`
 if [[ $ZOMBIE_TESTS_COUNT != 0 ]] ; then
   echo " {color:red}There appear to be $ZOMBIE_TESTS_COUNT zombie tests{color}, they should have been killed by surefire but survived"
   jps -v | grep surefirebooter | grep -e '-Dhbase.test'
   jps -v | grep surefirebooter | grep -e '-Dhbase.test' | cut -d ' ' -f 1 | xargs -n 1 jstack
   # Exit with error
   exit 1
 else
   echo "We're ok: there is no zombie test, but some tests took some time to stop"
 fi
else
  echo "We're ok: there is no zombie test"
fi
Setting JDK_1_7_LATEST__HOME=/home/jenkins/tools/java/latest1.7
Setting JDK_1_8_LATEST__HOME=/home/jenkins/tools/java/latest1.8
[30b16b4c] $ /bin/bash -xe /tmp/hudson2548310269566091606.sh
+ pwd
<https://builds.apache.org/job/HBase-1.4/jdk=JDK_1_8,label=Hadoop&&!H13/ws/>
+ ls
bin
CHANGES.txt
conf
dev-support
extra_env_var
hbase-annotations
hbase-archetypes
hbase-assembly
hbase-checkstyle
hbase-client
hbase-common
hbase-examples
hbase-external-blockcache
hbase-hadoop2-compat
hbase-hadoop-compat
hbase-it
hbase-native-client
hbase-prefix-tree
hbase-procedure
hbase-protocol
hbase-resource-bundle
hbase-rest
hbase-server
hbase-shaded
hbase-shell
hbase-testing-util
hbase-thrift
LICENSE.txt
NOTICE.txt
pom.xml
README.txt
src
target
++ jps -v
++ grep surefirebooter
++ grep -e -Dhbase.test
++ wc -l
+ ZOMBIE_TESTS_COUNT=0
+ [[ 0 != 0 ]]
+ echo 'We'\''re ok: there is no zombie test'
We're ok: there is no zombie test
POST BUILD TASK : SUCCESS
END OF POST BUILD TASK : 0
Archiving artifacts
Setting JDK_1_7_LATEST__HOME=/home/jenkins/tools/java/latest1.7
Setting JDK_1_8_LATEST__HOME=/home/jenkins/tools/java/latest1.8
Recording test results
Setting JDK_1_7_LATEST__HOME=/home/jenkins/tools/java/latest1.7
Setting JDK_1_8_LATEST__HOME=/home/jenkins/tools/java/latest1.8
Setting JDK_1_7_LATEST__HOME=/home/jenkins/tools/java/latest1.7
Setting JDK_1_8_LATEST__HOME=/home/jenkins/tools/java/latest1.8

Jenkins build is back to normal : HBase-1.4 » JDK_1_8,Hadoop&&!H13 #715

Posted by Apache Jenkins Server <je...@builds.apache.org>.
See <https://builds.apache.org/job/HBase-1.4/jdk=JDK_1_8,label=Hadoop&&!H13/715/display/redirect?page=changes>