You are viewing a plain text version of this content. The canonical link for it is here.
Posted to builds@cassandra.apache.org by Apache Jenkins Server <je...@builds.apache.org> on 2022/05/28 01:41:03 UTC
Build complete: Cassandra-4.1 #41 [FAILURE] 0f83fff99247dd0a4246e1b08ea4a023772ace1c
-------------------------------------------------------------------------------
Build Cassandra-4.1 #41 Failure
URL: https://ci-cassandra.apache.org/job/Cassandra-4.1/41/
-------------------------------------------------------------------------------
Changes:
[Ekaterina Dimitrova] Add utests_system_keyspace_directory to pre-commit tests workflow in
-------------------------------------------------------------------------------
Failed Tests:
26 tests failed.
FAILED: dtest-novnode.paging_test.TestPagingDatasetChanges.test_data_change_impacting_later_page
FAILED: dtest-novnode.replace_address_test.TestReplaceAddress.test_replace_with_insufficient_replicas
FAILED: dtest-novnode.replication_test.TestSnitchConfigurationUpdate.test_rf_expand_property_file_snitch
FAILED: dtest-novnode.snapshot_test.TestSnapshot.test_basic_snapshot_and_restore
FAILED: dtest-novnode.transient_replication_test.TestTransientReplicationRepairStreamEntireSSTable.test_transient_incremental_repair
FAILED: dtest-novnode.write_failures_test.TestWriteFailures.test_mutation_any
FAILED: dtest-novnode.cqlsh_tests.test_cqlsh.TestCqlshSmoke.test_drop_index
FAILED: dtest-novnode.cqlsh_tests.test_cqlsh_copy.TestCqlshCopy.test_source_copy_round_trip
FAILED: dtest-novnode.repair_tests.repair_test.TestRepair.test_local_dc_repair
FAILED: dtest-novnode.client_request_metrics_test.TestClientRequestMetrics.test_client_request_metrics
FAILED: dtest-upgrade.upgrade_tests.paging_test.TestPagingDataNodes3RF3_Upgrade_indev_3_0_x_To_indev_4_1_x.test_paging_using_secondary_indexes
FAILED: dtest-upgrade.upgrade_tests.paging_test.TestPagingDatasetChangesNodes3RF3_Upgrade_current_3_11_x_To_indev_4_1_x.test_data_change_impacting_later_page
FAILED: dtest.bootstrap_test.TestBootstrap.test_simultaneous_bootstrap
FAILED: org.apache.cassandra.distributed.upgrade.BatchUpgradeTest.batchTest
FAILED: org.apache.cassandra.distributed.test.thresholds.TombstoneCountWarningTest.failThresholdSinglePartition
FAILED: org.apache.cassandra.distributed.test.TopPartitionsTest.basicRangeTombstonesTest[Incremental]
FAILED: org.apache.cassandra.net.ProxyHandlerConnectionsTest.testExpireSome-cdc
FAILED: org.apache.cassandra.cql3.validation.operations.CompactStorageTest.testIndicesOnCompactTable
FAILED: org.apache.cassandra.cql3.validation.operations.CompactStorageTest.testEmptyRestrictionValueWithMultipleClusteringColumnsAndOrderBy
FAILED: org.apache.cassandra.cql3.validation.operations.CompactStorageTest.testDeleteWithNoClusteringColumns
FAILED: org.apache.cassandra.cql3.validation.operations.CompactStorageTest.testAllowFilteringOnPartitionKeyOnCompactTablesWithoutIndices
FAILED: org.apache.cassandra.cql3.validation.operations.SelectTest.testIndexQueryWithValueOver64K
FAILED: org.apache.cassandra.cql3.validation.operations.SelectTest.testEmptyRestrictionValueWithMultipleClusteringColumnsAndOrderBy
FAILED: org.apache.cassandra.cql3.validation.operations.SelectTest.testFilterWithIndexForContains
FAILED: org.apache.cassandra.db.SinglePartitionSliceCommandTest.testPartitionDeletionRangeDeletionTie-compression
FAILED: org.apache.cassandra.cql3.ViewFilteringClustering1Test.testClusteringKeySliceRestrictions[3]
-------------------------------------------------------------------------------
For complete test report and logs see https://nightlies.apache.org/cassandra/Cassandra-4.1/41/