You are viewing a plain text version of this content. The canonical link for it is here.
Posted to commits@tuscany.apache.org by Apache Hudson Server <hu...@hudson.apache.org> on 2010/11/15 08:38:21 UTC
Build failed in Hudson: Tuscany-2x #939
See <https://hudson.apache.org/hudson/job/Tuscany-2x/939/changes>
Changes:
[bdaniel] TUSCANY-3664 Add support for multiple operation output types
[bdaniel] TUSCANY-3664 Add support for multiple operation output types
[bdaniel] TUSCANY-3664 Add support for multiple operation output types
------------------------------------------
[...truncated 30404 lines...]
at org.apache.maven.surefire.suite.AbstractDirectoryTestSuite.executeTestSet(AbstractDirectoryTestSuite.java:140)
at org.apache.maven.surefire.suite.AbstractDirectoryTestSuite.execute(AbstractDirectoryTestSuite.java:127)
at org.apache.maven.surefire.Surefire.run(Surefire.java:177)
at sun.reflect.NativeMethodAccessorImpl.invoke0(Native Method)
at sun.reflect.NativeMethodAccessorImpl.invoke(NativeMethodAccessorImpl.java:39)
at sun.reflect.DelegatingMethodAccessorImpl.invoke(DelegatingMethodAccessorImpl.java:25)
at java.lang.reflect.Method.invoke(Method.java:597)
at org.apache.tuscany.maven.plugin.surefire.OSGiSurefireBooter.runSuitesInProcess(OSGiSurefireBooter.java:355)
at org.apache.tuscany.maven.plugin.surefire.OSGiSurefireBooter.main(OSGiSurefireBooter.java:852)
Nov 15, 2010 3:21:14 AM org.apache.tuscany.sca.binding.sca.provider.DefaultSCABindingMapper <init>
WARNING: Mapped binding for binding.sca is not supported: {http://docs.oasis-open.org/ns/opencsa/sca/200912}binding.ws
Nov 15, 2010 3:21:14 AM org.mortbay.log.Slf4jLog info
INFO: Logging to org.slf4j.impl.JDK14LoggerAdapter(org.mortbay.log) via org.mortbay.log.Slf4jLog
Nov 15, 2010 3:21:14 AM org.apache.tuscany.sca.http.jetty.JettyLogger info
INFO: jetty-6.1.x
Nov 15, 2010 3:21:14 AM org.apache.tuscany.sca.http.jetty.JettyLogger info
INFO: Started SelectChannelConnector@localhost:8085
Nov 15, 2010 3:21:14 AM org.apache.wink.server.internal.servlet.RestServlet getApplication
WARNING: applicationConfigLocation property was not defined.
Nov 15, 2010 3:21:14 AM org.apache.wink.server.internal.servlet.RestServlet getApplication
INFO: Using application classes null named in init-param applicationConfigLocation
Nov 15, 2010 3:21:14 AM org.apache.tuscany.sca.http.jetty.JettyServer addServletMapping
INFO: Added Servlet mapping: http://localhost:8085/calculator/*
Nov 15, 2010 3:21:14 AM org.apache.tuscany.sca.core.assembly.impl.EndpointRegistryImpl addEndpoint
INFO: Add endpoint - (@30836962)Endpoint: URI = CalculatorServiceComponent#service-binding(CalculatorService/CalculatorService)
Nov 15, 2010 3:21:14 AM org.apache.tuscany.sca.core.assembly.impl.EndpointRegistryImpl addEndpoint
INFO: Add endpoint - (@28630940)Endpoint: URI = AddServiceComponent#service-binding(AddServiceImpl/AddServiceImpl)
Nov 15, 2010 3:21:14 AM org.apache.tuscany.sca.core.assembly.impl.EndpointRegistryImpl addEndpoint
INFO: Add endpoint - (@29663640)Endpoint: URI = SubtractServiceComponent#service-binding(SubtractServiceImpl/SubtractServiceImpl)
Nov 15, 2010 3:21:14 AM org.apache.tuscany.sca.core.assembly.impl.EndpointRegistryImpl addEndpoint
INFO: Add endpoint - (@5057297)Endpoint: URI = MultiplyServiceComponent#service-binding(MultiplyServiceImpl/MultiplyServiceImpl)
Nov 15, 2010 3:21:14 AM org.apache.tuscany.sca.core.assembly.impl.EndpointRegistryImpl addEndpoint
INFO: Add endpoint - (@4629956)Endpoint: URI = DivideServiceComponent#service-binding(DivideServiceImpl/DivideServiceImpl)
Nov 15, 2010 3:21:14 AM org.apache.tuscany.sca.node.impl.NodeImpl stop
INFO: Stopping node: http://tuscany.apache.org/sca/1.1/nodes/default0
Nov 15, 2010 3:21:14 AM org.apache.tuscany.sca.core.assembly.impl.EndpointRegistryImpl removeEndpoint
INFO: Remove endpoint - (@30836962)Endpoint: URI = CalculatorServiceComponent#service-binding(CalculatorService/CalculatorService)
Nov 15, 2010 3:21:14 AM org.apache.tuscany.sca.http.jetty.JettyServer removeServletMapping
INFO: Removed Servlet mapping: /calculator/*
Nov 15, 2010 3:21:14 AM org.apache.tuscany.sca.core.assembly.impl.EndpointRegistryImpl removeEndpoint
INFO: Remove endpoint - (@28630940)Endpoint: URI = AddServiceComponent#service-binding(AddServiceImpl/AddServiceImpl)
Nov 15, 2010 3:21:14 AM org.apache.tuscany.sca.core.assembly.impl.EndpointRegistryImpl removeEndpoint
INFO: Remove endpoint - (@29663640)Endpoint: URI = SubtractServiceComponent#service-binding(SubtractServiceImpl/SubtractServiceImpl)
Nov 15, 2010 3:21:14 AM org.apache.tuscany.sca.core.assembly.impl.EndpointRegistryImpl removeEndpoint
INFO: Remove endpoint - (@5057297)Endpoint: URI = MultiplyServiceComponent#service-binding(MultiplyServiceImpl/MultiplyServiceImpl)
Nov 15, 2010 3:21:14 AM org.apache.tuscany.sca.core.assembly.impl.EndpointRegistryImpl removeEndpoint
INFO: Remove endpoint - (@4629956)Endpoint: URI = DivideServiceComponent#service-binding(DivideServiceImpl/DivideServiceImpl)
Tests run: 5, Failures: 0, Errors: 0, Skipped: 0, Time elapsed: 2.094 sec
Results :
Tests run: 5, Failures: 0, Errors: 0, Skipped: 0
[INFO] [jar:jar {execution: default-jar}]
[INFO] Building jar: <https://hudson.apache.org/hudson/job/Tuscany-2x/ws/sca-2x/samples/running-tuscany/maven-osgi-junit/calculator-rest-osgi/target/sample-maven-osgi-junit-calculator-rest-osgi.jar>
[INFO] [install:install {execution: default-install}]
[INFO] Installing <https://hudson.apache.org/hudson/job/Tuscany-2x/ws/sca-2x/samples/running-tuscany/maven-osgi-junit/calculator-rest-osgi/target/sample-maven-osgi-junit-calculator-rest-osgi.jar> to /export/home/hudson/.m2/repository/org/apache/tuscany/sca/sample-maven-osgi-junit-calculator-rest-osgi/2.0-SNAPSHOT/sample-maven-osgi-junit-calculator-rest-osgi-2.0-SNAPSHOT.jar
[HUDSON] Archiving <https://hudson.apache.org/hudson/job/Tuscany-2x/ws/sca-2x/samples/running-tuscany/maven-osgi-junit/calculator-rest-osgi/pom.xml> to /home/hudson/hudson/jobs/Tuscany-2x/modules/org.apache.tuscany.sca$sample-maven-osgi-junit-calculator-rest-osgi/builds/2010-11-15_01-15-29/archive/org.apache.tuscany.sca/sample-maven-osgi-junit-calculator-rest-osgi/2.0-SNAPSHOT/pom.xml
[HUDSON] Archiving <https://hudson.apache.org/hudson/job/Tuscany-2x/ws/sca-2x/samples/running-tuscany/maven-osgi-junit/calculator-rest-osgi/target/sample-maven-osgi-junit-calculator-rest-osgi.jar> to /home/hudson/hudson/jobs/Tuscany-2x/modules/org.apache.tuscany.sca$sample-maven-osgi-junit-calculator-rest-osgi/builds/2010-11-15_01-15-29/archive/org.apache.tuscany.sca/sample-maven-osgi-junit-calculator-rest-osgi/2.0-SNAPSHOT/sample-maven-osgi-junit-calculator-rest-osgi.jar
[INFO] ------------------------------------------------------------------------
[INFO] Building Apache Tuscany SCA Maven OSGI Junit plugin Samples
[INFO] task-segment: [clean, install]
[INFO] ------------------------------------------------------------------------
[INFO] [clean:clean {execution: default-clean}]
[INFO] [enforcer:enforce {execution: enforce-plugin-versions}]
[INFO] [remote-resources:process {execution: default}]
[INFO] [site:attach-descriptor {execution: default-attach-descriptor}]
[INFO] [install:install {execution: default-install}]
[INFO] Installing <https://hudson.apache.org/hudson/job/Tuscany-2x/ws/sca-2x/samples/running-tuscany/maven-osgi-junit/pom.xml> to /export/home/hudson/.m2/repository/org/apache/tuscany/sca/sample-maven-osgi-junit/2.0-SNAPSHOT/sample-maven-osgi-junit-2.0-SNAPSHOT.pom
[HUDSON] Archiving <https://hudson.apache.org/hudson/job/Tuscany-2x/ws/sca-2x/samples/running-tuscany/maven-osgi-junit/pom.xml> to /home/hudson/hudson/jobs/Tuscany-2x/modules/org.apache.tuscany.sca$sample-maven-osgi-junit/builds/2010-11-15_01-15-29/archive/org.apache.tuscany.sca/sample-maven-osgi-junit/2.0-SNAPSHOT/pom.xml
[HUDSON] Archiving /export/home/hudson/.m2/repository/org/apache/tuscany/sca/sample-maven-osgi-junit/2.0-SNAPSHOT/sample-maven-osgi-junit-2.0-SNAPSHOT.pom to /home/hudson/hudson/jobs/Tuscany-2x/modules/org.apache.tuscany.sca$sample-maven-osgi-junit/builds/2010-11-15_01-15-29/archive/org.apache.tuscany.sca/sample-maven-osgi-junit/2.0-SNAPSHOT/sample-maven-osgi-junit-2.0-SNAPSHOT.pom
[INFO] ------------------------------------------------------------------------
[INFO] Building Apache Tuscany SCA Sample Maven JUnit Calculator Contribution
[INFO] task-segment: [clean, install]
[INFO] ------------------------------------------------------------------------
[INFO] [clean:clean {execution: default-clean}]
[INFO] [enforcer:enforce {execution: enforce-plugin-versions}]
[INFO] [remote-resources:process {execution: default}]
[INFO] [resources:resources {execution: default-resources}]
[INFO] Using 'UTF-8' encoding to copy filtered resources.
[INFO] Copying 3 resources
[INFO] Copying 1 resource
[INFO] [compiler:compile {execution: default-compile}]
[INFO] Compiling 11 source files to <https://hudson.apache.org/hudson/job/Tuscany-2x/ws/sca-2x/samples/running-tuscany/maven-junit/calculator-contribution/target/classes>
[INFO] [resources:testResources {execution: default-testResources}]
[INFO] Using 'UTF-8' encoding to copy filtered resources.
[INFO] skip non existing resourceDirectory <https://hudson.apache.org/hudson/job/Tuscany-2x/ws/sca-2x/samples/running-tuscany/maven-junit/calculator-contribution/src/test/resources>
[INFO] [compiler:testCompile {execution: default-testCompile}]
[INFO] Compiling 1 source file to <https://hudson.apache.org/hudson/job/Tuscany-2x/ws/sca-2x/samples/running-tuscany/maven-junit/calculator-contribution/target/test-classes>
[INFO] [surefire:test {execution: default-test}]
[INFO] Surefire report directory: <https://hudson.apache.org/hudson/job/Tuscany-2x/ws/sca-2x/samples/running-tuscany/maven-junit/calculator-contribution/target/surefire-reports>
-------------------------------------------------------
T E S T S
-------------------------------------------------------
Running calculator.CalculatorTestCase
Nov 15, 2010 3:21:34 AM org.apache.tuscany.sca.node.impl.NodeImpl start
INFO: Starting node: http://tuscany.apache.org/sca/1.1/nodes/default0 domain: default
Nov 15, 2010 3:21:34 AM org.apache.tuscany.sca.node.impl.NodeFactoryImpl loadContributions
INFO: Loading contribution: <https://hudson.apache.org/hudson/job/Tuscany-2x/ws/sca-2x/samples/running-tuscany/maven-junit/calculator-contribution/./target/classes/>
Nov 15, 2010 3:21:35 AM org.apache.tuscany.sca.core.assembly.impl.EndpointRegistryImpl addEndpoint
INFO: Add endpoint - (@33440105)Endpoint: URI = CalculatorServiceComponent#service-binding(CalculatorService/CalculatorService)
Nov 15, 2010 3:21:35 AM org.apache.tuscany.sca.core.assembly.impl.EndpointRegistryImpl addEndpoint
INFO: Add endpoint - (@24678922)Endpoint: URI = AddServiceComponent#service-binding(AddService/AddService)
Nov 15, 2010 3:21:35 AM org.apache.tuscany.sca.core.assembly.impl.EndpointRegistryImpl addEndpoint
INFO: Add endpoint - (@12319324)Endpoint: URI = SubtractServiceComponent#service-binding(SubtractService/SubtractService)
Nov 15, 2010 3:21:35 AM org.apache.tuscany.sca.core.assembly.impl.EndpointRegistryImpl addEndpoint
INFO: Add endpoint - (@20045467)Endpoint: URI = MultiplyServiceComponent#service-binding(MultiplyService/MultiplyService)
Nov 15, 2010 3:21:35 AM org.apache.tuscany.sca.core.assembly.impl.EndpointRegistryImpl addEndpoint
INFO: Add endpoint - (@17667533)Endpoint: URI = DivideServiceComponent#service-binding(DivideService/DivideService)
Nov 15, 2010 3:21:35 AM org.apache.tuscany.sca.core.assembly.impl.EndpointRegistryImpl addEndpoint
INFO: Add endpoint - (@15070318)Endpoint: URI = CalculatorClient#service-binding(CalculatorClient/CalculatorClient)
SCA API ClassLoader: sun.misc.Launcher$AppClassLoader@17182c1
3 + 2=5.0
3 - 2=1.0
3 * 2=6.0
3 / 2=1.5
Nov 15, 2010 3:21:35 AM org.apache.tuscany.sca.node.impl.NodeImpl stop
INFO: Stopping node: http://tuscany.apache.org/sca/1.1/nodes/default0
Nov 15, 2010 3:21:35 AM org.apache.tuscany.sca.core.assembly.impl.EndpointRegistryImpl removeEndpoint
INFO: Remove endpoint - (@33440105)Endpoint: URI = CalculatorServiceComponent#service-binding(CalculatorService/CalculatorService)
Nov 15, 2010 3:21:35 AM org.apache.tuscany.sca.core.assembly.impl.EndpointRegistryImpl removeEndpoint
INFO: Remove endpoint - (@24678922)Endpoint: URI = AddServiceComponent#service-binding(AddService/AddService)
Nov 15, 2010 3:21:35 AM org.apache.tuscany.sca.core.assembly.impl.EndpointRegistryImpl removeEndpoint
INFO: Remove endpoint - (@12319324)Endpoint: URI = SubtractServiceComponent#service-binding(SubtractService/SubtractService)
Nov 15, 2010 3:21:35 AM org.apache.tuscany.sca.core.assembly.impl.EndpointRegistryImpl removeEndpoint
INFO: Remove endpoint - (@20045467)Endpoint: URI = MultiplyServiceComponent#service-binding(MultiplyService/MultiplyService)
Nov 15, 2010 3:21:35 AM org.apache.tuscany.sca.core.assembly.impl.EndpointRegistryImpl removeEndpoint
INFO: Remove endpoint - (@17667533)Endpoint: URI = DivideServiceComponent#service-binding(DivideService/DivideService)
Nov 15, 2010 3:21:35 AM org.apache.tuscany.sca.core.assembly.impl.EndpointRegistryImpl removeEndpoint
INFO: Remove endpoint - (@15070318)Endpoint: URI = CalculatorClient#service-binding(CalculatorClient/CalculatorClient)
Tests run: 1, Failures: 0, Errors: 0, Skipped: 0, Time elapsed: 1.222 sec
Results :
Tests run: 1, Failures: 0, Errors: 0, Skipped: 0
[HUDSON] Recording test results
[INFO] [jar:jar {execution: default-jar}]
[INFO] Building jar: <https://hudson.apache.org/hudson/job/Tuscany-2x/ws/sca-2x/samples/running-tuscany/maven-junit/calculator-contribution/target/sample-maven-junit-calculator-contribution.jar>
[INFO] [install:install {execution: default-install}]
[INFO] Installing <https://hudson.apache.org/hudson/job/Tuscany-2x/ws/sca-2x/samples/running-tuscany/maven-junit/calculator-contribution/target/sample-maven-junit-calculator-contribution.jar> to /export/home/hudson/.m2/repository/org/apache/tuscany/sca/sample-maven-junit-calculator-contribution/2.0-SNAPSHOT/sample-maven-junit-calculator-contribution-2.0-SNAPSHOT.jar
[HUDSON] Archiving <https://hudson.apache.org/hudson/job/Tuscany-2x/ws/sca-2x/samples/running-tuscany/maven-junit/calculator-contribution/pom.xml> to /home/hudson/hudson/jobs/Tuscany-2x/modules/org.apache.tuscany.sca$sample-maven-junit-calculator-contribution/builds/2010-11-15_01-15-29/archive/org.apache.tuscany.sca/sample-maven-junit-calculator-contribution/2.0-SNAPSHOT/pom.xml
[HUDSON] Archiving <https://hudson.apache.org/hudson/job/Tuscany-2x/ws/sca-2x/samples/running-tuscany/maven-junit/calculator-contribution/target/sample-maven-junit-calculator-contribution.jar> to /home/hudson/hudson/jobs/Tuscany-2x/modules/org.apache.tuscany.sca$sample-maven-junit-calculator-contribution/builds/2010-11-15_01-15-29/archive/org.apache.tuscany.sca/sample-maven-junit-calculator-contribution/2.0-SNAPSHOT/sample-maven-junit-calculator-contribution.jar
[INFO] ------------------------------------------------------------------------
[INFO] Building Apache Tuscany SCA Sample Maven Junit
[INFO] task-segment: [clean, install]
[INFO] ------------------------------------------------------------------------
[INFO] [clean:clean {execution: default-clean}]
[INFO] [enforcer:enforce {execution: enforce-plugin-versions}]
[INFO] [remote-resources:process {execution: default}]
[INFO] [site:attach-descriptor {execution: default-attach-descriptor}]
[INFO] [install:install {execution: default-install}]
[INFO] Installing <https://hudson.apache.org/hudson/job/Tuscany-2x/ws/sca-2x/samples/running-tuscany/maven-junit/pom.xml> to /export/home/hudson/.m2/repository/org/apache/tuscany/sca/tuscany-sample-maven-junit/2.0-SNAPSHOT/tuscany-sample-maven-junit-2.0-SNAPSHOT.pom
[HUDSON] Archiving <https://hudson.apache.org/hudson/job/Tuscany-2x/ws/sca-2x/samples/running-tuscany/maven-junit/pom.xml> to /home/hudson/hudson/jobs/Tuscany-2x/modules/org.apache.tuscany.sca$tuscany-sample-maven-junit/builds/2010-11-15_01-15-29/archive/org.apache.tuscany.sca/tuscany-sample-maven-junit/2.0-SNAPSHOT/pom.xml
[HUDSON] Archiving /export/home/hudson/.m2/repository/org/apache/tuscany/sca/tuscany-sample-maven-junit/2.0-SNAPSHOT/tuscany-sample-maven-junit-2.0-SNAPSHOT.pom to /home/hudson/hudson/jobs/Tuscany-2x/modules/org.apache.tuscany.sca$tuscany-sample-maven-junit/builds/2010-11-15_01-15-29/archive/org.apache.tuscany.sca/tuscany-sample-maven-junit/2.0-SNAPSHOT/tuscany-sample-maven-junit-2.0-SNAPSHOT.pom
[INFO] ------------------------------------------------------------------------
[INFO] Building Apache Tuscany SCA Web 2.0 Feature
[INFO] task-segment: [clean, install]
[INFO] ------------------------------------------------------------------------
[INFO] [clean:clean {execution: default-clean}]
[INFO] [enforcer:enforce {execution: enforce-plugin-versions}]
[INFO] [remote-resources:process {execution: default}]
[INFO] [site:attach-descriptor {execution: default-attach-descriptor}]
[INFO] [install:install {execution: default-install}]
[INFO] Installing <https://hudson.apache.org/hudson/job/Tuscany-2x/ws/sca-2x/features/web20/pom.xml> to /export/home/hudson/.m2/repository/org/apache/tuscany/sca/tuscany-feature-web20/2.0-SNAPSHOT/tuscany-feature-web20-2.0-SNAPSHOT.pom
[HUDSON] Archiving <https://hudson.apache.org/hudson/job/Tuscany-2x/ws/sca-2x/features/web20/pom.xml> to /home/hudson/hudson/jobs/Tuscany-2x/modules/org.apache.tuscany.sca$tuscany-feature-web20/builds/2010-11-15_01-15-29/archive/org.apache.tuscany.sca/tuscany-feature-web20/2.0-SNAPSHOT/pom.xml
[HUDSON] Archiving /export/home/hudson/.m2/repository/org/apache/tuscany/sca/tuscany-feature-web20/2.0-SNAPSHOT/tuscany-feature-web20-2.0-SNAPSHOT.pom to /home/hudson/hudson/jobs/Tuscany-2x/modules/org.apache.tuscany.sca$tuscany-feature-web20/builds/2010-11-15_01-15-29/archive/org.apache.tuscany.sca/tuscany-feature-web20/2.0-SNAPSHOT/tuscany-feature-web20-2.0-SNAPSHOT.pom
[INFO] ------------------------------------------------------------------------
[INFO] Building Apache Tuscany SCA Sample Launcher Shell
[INFO] task-segment: [clean, install]
[INFO] ------------------------------------------------------------------------
[INFO] [clean:clean {execution: default-clean}]
[INFO] [enforcer:enforce {execution: enforce-plugin-versions}]
[INFO] [remote-resources:process {execution: default}]
[INFO] [resources:resources {execution: default-resources}]
[INFO] Using 'UTF-8' encoding to copy filtered resources.
[INFO] skip non existing resourceDirectory <https://hudson.apache.org/hudson/job/Tuscany-2x/ws/sca-2x/samples/running-tuscany/shell/src/main/resources>
[INFO] Copying 1 resource
[INFO] [compiler:compile {execution: default-compile}]
[INFO] Compiling 2 source files to <https://hudson.apache.org/hudson/job/Tuscany-2x/ws/sca-2x/samples/running-tuscany/shell/target/classes>
[INFO] [resources:testResources {execution: default-testResources}]
[INFO] Using 'UTF-8' encoding to copy filtered resources.
[INFO] skip non existing resourceDirectory <https://hudson.apache.org/hudson/job/Tuscany-2x/ws/sca-2x/samples/running-tuscany/shell/src/test/resources>
[INFO] [compiler:testCompile {execution: default-testCompile}]
[INFO] No sources to compile
[INFO] [surefire:test {execution: default-test}]
[INFO] No tests to run.
[HUDSON] Recording test results
[INFO] [war:war {execution: default-war}]
[INFO] Packaging webapp
[INFO] Assembling webapp[sample-launcher-shell] in [<https://hudson.apache.org/hudson/job/Tuscany-2x/ws/sca-2x/samples/running-tuscany/shell/target/scashell]>
[INFO] Processing war project
[INFO] Copying webapp resources[<https://hudson.apache.org/hudson/job/Tuscany-2x/ws/sca-2x/samples/running-tuscany/shell/src/main/webapp]>
[INFO] Webapp assembled in [465 msecs]
[INFO] Building war: <https://hudson.apache.org/hudson/job/Tuscany-2x/ws/sca-2x/samples/running-tuscany/shell/target/scashell.war>
[INFO] [install:install {execution: default-install}]
[INFO] Installing <https://hudson.apache.org/hudson/job/Tuscany-2x/ws/sca-2x/samples/running-tuscany/shell/target/scashell.war> to /export/home/hudson/.m2/repository/org/apache/tuscany/sca/sample-launcher-shell/2.0-SNAPSHOT/sample-launcher-shell-2.0-SNAPSHOT.war
[HUDSON] Archiving <https://hudson.apache.org/hudson/job/Tuscany-2x/ws/sca-2x/samples/running-tuscany/shell/pom.xml> to /home/hudson/hudson/jobs/Tuscany-2x/modules/org.apache.tuscany.sca$sample-launcher-shell/builds/2010-11-15_01-15-29/archive/org.apache.tuscany.sca/sample-launcher-shell/2.0-SNAPSHOT/pom.xml
[HUDSON] Archiving <https://hudson.apache.org/hudson/job/Tuscany-2x/ws/sca-2x/samples/running-tuscany/shell/target/scashell.war> to /home/hudson/hudson/jobs/Tuscany-2x/modules/org.apache.tuscany.sca$sample-launcher-shell/builds/2010-11-15_01-15-29/archive/org.apache.tuscany.sca/sample-launcher-shell/2.0-SNAPSHOT/scashell.war
Build timed out. Aborting
ERROR: Failed to parse POMs
hudson.remoting.ChannelClosedException: channel is already closed
at hudson.remoting.Channel.send(Channel.java:467)
at hudson.remoting.ProxyOutputStream._write(ProxyOutputStream.java:123)
at hudson.remoting.ProxyOutputStream.write(ProxyOutputStream.java:103)
at hudson.remoting.RemoteOutputStream.write(RemoteOutputStream.java:110)
at java.io.BufferedOutputStream.flushBuffer(BufferedOutputStream.java:65)
at java.io.BufferedOutputStream.flush(BufferedOutputStream.java:123)
at java.io.BufferedOutputStream.flush(BufferedOutputStream.java:124)
at java.io.ObjectOutputStream$BlockDataOutputStream.flush(ObjectOutputStream.java:1793)
at java.io.ObjectOutputStream.flush(ObjectOutputStream.java:699)
at hudson.remoting.Channel.send(Channel.java:473)
at hudson.remoting.Request.call(Request.java:149)
at hudson.remoting.Channel.call(Channel.java:630)
at hudson.maven.ProcessCache$MavenProcess.call(ProcessCache.java:156)
at hudson.maven.MavenModuleSetBuild$RunnerImpl.doRun(MavenModuleSetBuild.java:536)
at hudson.model.AbstractBuild$AbstractRunner.run(AbstractBuild.java:416)
at hudson.model.Run.run(Run.java:1324)
at hudson.maven.MavenModuleSetBuild.run(MavenModuleSetBuild.java:349)
at hudson.model.ResourceController.execute(ResourceController.java:88)
at hudson.model.Executor.run(Executor.java:139)
Caused by: java.io.StreamCorruptedException: invalid type code: 00
at java.io.ObjectInputStream.readObject0(ObjectInputStream.java:1355)
at java.io.ObjectInputStream.defaultReadFields(ObjectInputStream.java:1946)
at java.io.ObjectInputStream.readSerialData(ObjectInputStream.java:1870)
at java.io.ObjectInputStream.readOrdinaryObject(ObjectInputStream.java:1752)
at java.io.ObjectInputStream.readObject0(ObjectInputStream.java:1328)
at java.io.ObjectInputStream.readObject(ObjectInputStream.java:350)
at hudson.remoting.Channel$ReaderThread.run(Channel.java:948)
FATAL: channel is already closed
hudson.remoting.ChannelClosedException: channel is already closed
at hudson.remoting.Channel.send(Channel.java:467)
at hudson.remoting.Request.call(Request.java:105)
at hudson.remoting.Channel.call(Channel.java:630)
at hudson.Launcher$RemoteLauncher.kill(Launcher.java:744)
at hudson.model.AbstractBuild$AbstractRunner.run(AbstractBuild.java:421)
at hudson.model.Run.run(Run.java:1324)
at hudson.maven.MavenModuleSetBuild.run(MavenModuleSetBuild.java:349)
at hudson.model.ResourceController.execute(ResourceController.java:88)
at hudson.model.Executor.run(Executor.java:139)
Caused by: java.io.StreamCorruptedException: invalid type code: 00
at java.io.ObjectInputStream.readObject0(ObjectInputStream.java:1355)
at java.io.ObjectInputStream.defaultReadFields(ObjectInputStream.java:1946)
at java.io.ObjectInputStream.readSerialData(ObjectInputStream.java:1870)
at java.io.ObjectInputStream.readOrdinaryObject(ObjectInputStream.java:1752)
at java.io.ObjectInputStream.readObject0(ObjectInputStream.java:1328)
at java.io.ObjectInputStream.readObject(ObjectInputStream.java:350)
at hudson.remoting.Channel$ReaderThread.run(Channel.java:948)
Build failed in Hudson: Tuscany-2x #940
Posted by Apache Hudson Server <hu...@hudson.apache.org>.
See <https://hudson.apache.org/hudson/job/Tuscany-2x/940/changes>
Changes:
[antelder] Update some itests for base + extensions
[antelder] Fix potential NPE when bpel is unresolved
[antelder] TUSCANY-3760: Update the eclipse build profile to use the new eclipse-pde instead of the distribution
------------------------------------------
[...truncated 12587 lines...]
A testing/itest/operation-overloading/src/main/java/org/apache/tuscany/sca/test/opoverload
A testing/itest/operation-overloading/src/main/java/org/apache/tuscany/sca/test/opoverload/impl
AU testing/itest/operation-overloading/src/main/java/org/apache/tuscany/sca/test/opoverload/impl/OverloadATarget.java
AU testing/itest/operation-overloading/src/main/java/org/apache/tuscany/sca/test/opoverload/impl/OverloadASource.java
AU testing/itest/operation-overloading/src/main/java/org/apache/tuscany/sca/test/opoverload/OverloadASourceTarget.java
A testing/itest/operation-overloading/src/main/resources
AU testing/itest/operation-overloading/src/main/resources/OperationOverload.composite
AU testing/itest/operation-overloading/pom.xml
A testing/itest/node-launcher-equinox
A testing/itest/node-launcher-equinox/src
A testing/itest/node-launcher-equinox/src/test
A testing/itest/node-launcher-equinox/src/test/java
A testing/itest/node-launcher-equinox/src/test/java/hello
AU testing/itest/node-launcher-equinox/src/test/java/hello/HelloWorldClient.java
AU testing/itest/node-launcher-equinox/src/test/java/hello/HelloWorld.java
AU testing/itest/node-launcher-equinox/src/test/java/hello/HelloWorldImpl.java
A testing/itest/node-launcher-equinox/src/test/java/org
A testing/itest/node-launcher-equinox/src/test/java/org/apache
A testing/itest/node-launcher-equinox/src/test/java/org/apache/tuscany
A testing/itest/node-launcher-equinox/src/test/java/org/apache/tuscany/sca
A testing/itest/node-launcher-equinox/src/test/java/org/apache/tuscany/sca/node
A testing/itest/node-launcher-equinox/src/test/java/org/apache/tuscany/sca/node/equinox
A testing/itest/node-launcher-equinox/src/test/java/org/apache/tuscany/sca/node/equinox/launcher
AU testing/itest/node-launcher-equinox/src/test/java/org/apache/tuscany/sca/node/equinox/launcher/NodeLauncherTestCase.java
AU testing/itest/node-launcher-equinox/src/test/java/org/apache/tuscany/sca/node/equinox/launcher/EquinoxOSGiHostTestCase.java
A testing/itest/node-launcher-equinox/src/test/resources
AU testing/itest/node-launcher-equinox/src/test/resources/HelloWorld.composite
A testing/itest/node-launcher-equinox/pom.xml
A testing/itest/base
A testing/itest/base/dependencies
A testing/itest/base/dependencies/src
A testing/itest/base/dependencies/src/test
A testing/itest/base/dependencies/src/test/java
A testing/itest/base/dependencies/src/test/java/org
A testing/itest/base/dependencies/src/test/java/org/apache
A testing/itest/base/dependencies/src/test/java/org/apache/tuscany
A testing/itest/base/dependencies/src/test/java/org/apache/tuscany/sca
A testing/itest/base/dependencies/src/test/java/org/apache/tuscany/sca/itest
A testing/itest/base/dependencies/src/test/java/org/apache/tuscany/sca/itest/base
A testing/itest/base/dependencies/src/test/java/org/apache/tuscany/sca/itest/base/dependencies
A testing/itest/base/dependencies/src/test/java/org/apache/tuscany/sca/itest/base/dependencies/ValidateDependenciesTestCase.java
A testing/itest/base/dependencies/pom.xml
A testing/itest/base/pom.xml
A testing/itest/callback-basic
A testing/itest/callback-basic/src
A testing/itest/callback-basic/src/test
A testing/itest/callback-basic/src/test/java
A testing/itest/callback-basic/src/test/java/org
A testing/itest/callback-basic/src/test/java/org/apache
A testing/itest/callback-basic/src/test/java/org/apache/tuscany
A testing/itest/callback-basic/src/test/java/org/apache/tuscany/sca
A testing/itest/callback-basic/src/test/java/org/apache/tuscany/sca/test
AU testing/itest/callback-basic/src/test/java/org/apache/tuscany/sca/test/CallBackBasicTestCase.java
A testing/itest/callback-basic/src/main
A testing/itest/callback-basic/src/main/java
A testing/itest/callback-basic/src/main/java/org
A testing/itest/callback-basic/src/main/java/org/apache
A testing/itest/callback-basic/src/main/java/org/apache/tuscany
A testing/itest/callback-basic/src/main/java/org/apache/tuscany/sca
A testing/itest/callback-basic/src/main/java/org/apache/tuscany/sca/test
AU testing/itest/callback-basic/src/main/java/org/apache/tuscany/sca/test/CallBackBasicClientImpl.java
AU testing/itest/callback-basic/src/main/java/org/apache/tuscany/sca/test/CallBackBasicService.java
AU testing/itest/callback-basic/src/main/java/org/apache/tuscany/sca/test/CallBackBasicServiceImpl.java
AU testing/itest/callback-basic/src/main/java/org/apache/tuscany/sca/test/CallBackBasicCallBack.java
AU testing/itest/callback-basic/src/main/java/org/apache/tuscany/sca/test/CallBackBasicClient.java
A testing/itest/callback-basic/src/main/resources
AU testing/itest/callback-basic/src/main/resources/CallBackBasicTest.composite
A testing/itest/callback-basic/src/main/resources/META-INF
AU testing/itest/callback-basic/src/main/resources/META-INF/sca-contribution.xml
AU testing/itest/callback-basic/pom.xml
A testing/compliance-tests
A testing/compliance-tests/assembly
A testing/compliance-tests/assembly/src
A testing/compliance-tests/assembly/src/test
A testing/compliance-tests/assembly/src/test/java
A testing/compliance-tests/assembly/src/test/java/org
A testing/compliance-tests/assembly/src/test/java/org/apache
A testing/compliance-tests/assembly/src/test/java/org/apache/tuscany
A testing/compliance-tests/assembly/src/test/java/org/apache/tuscany/sca
A testing/compliance-tests/assembly/src/test/java/org/apache/tuscany/sca/otest
A testing/compliance-tests/assembly/src/test/java/org/apache/tuscany/sca/otest/TuscanyRuntimeBridge.java
A testing/compliance-tests/assembly/src/test/resources
A testing/compliance-tests/assembly/src/test/resources/tuscany-oasis-sca-tests-errors.properties
A testing/compliance-tests/assembly/src/test/resources/oasis-sca-tests.properties
A testing/compliance-tests/assembly/src/main
A testing/compliance-tests/assembly/src/main/resources
A testing/compliance-tests/assembly/pom.xml
A testing/compliance-tests/policy
A testing/compliance-tests/policy/src
A testing/compliance-tests/policy/src/test
A testing/compliance-tests/policy/src/test/java
A testing/compliance-tests/policy/src/test/java/org
A testing/compliance-tests/policy/src/test/java/org/apache
A testing/compliance-tests/policy/src/test/java/org/apache/tuscany
A testing/compliance-tests/policy/src/test/java/org/apache/tuscany/sca
A testing/compliance-tests/policy/src/test/java/org/apache/tuscany/sca/otest
A testing/compliance-tests/policy/src/test/java/org/apache/tuscany/sca/otest/TuscanyRuntimeBridge.java
A testing/compliance-tests/policy/src/test/resources
A testing/compliance-tests/policy/src/test/resources/tuscany-oasis-sca-tests-errors.properties
A testing/compliance-tests/policy/src/test/resources/oasis-sca-tests.properties
A testing/compliance-tests/policy/pom.xml
A testing/compliance-tests/binding-jms
A testing/compliance-tests/binding-jms/src
A testing/compliance-tests/binding-jms/src/test
A testing/compliance-tests/binding-jms/src/test/java
A testing/compliance-tests/binding-jms/src/test/java/org
A testing/compliance-tests/binding-jms/src/test/java/org/apache
A testing/compliance-tests/binding-jms/src/test/java/org/apache/tuscany
A testing/compliance-tests/binding-jms/src/test/java/org/apache/tuscany/sca
A testing/compliance-tests/binding-jms/src/test/java/org/apache/tuscany/sca/otest
AU testing/compliance-tests/binding-jms/src/test/java/org/apache/tuscany/sca/otest/TuscanyRuntimeBridge.java
A testing/compliance-tests/binding-jms/src/test/resources
AU testing/compliance-tests/binding-jms/src/test/resources/tuscany-oasis-sca-tests-errors.properties
AU testing/compliance-tests/binding-jms/src/test/resources/oasis-sca-tests.properties
AU testing/compliance-tests/binding-jms/pom.xml
A testing/compliance-tests/binding-ws
A testing/compliance-tests/binding-ws/src
A testing/compliance-tests/binding-ws/src/test
A testing/compliance-tests/binding-ws/src/test/java
A testing/compliance-tests/binding-ws/src/test/java/org
A testing/compliance-tests/binding-ws/src/test/java/org/apache
A testing/compliance-tests/binding-ws/src/test/java/org/apache/tuscany
A testing/compliance-tests/binding-ws/src/test/java/org/apache/tuscany/sca
A testing/compliance-tests/binding-ws/src/test/java/org/apache/tuscany/sca/otest
AU testing/compliance-tests/binding-ws/src/test/java/org/apache/tuscany/sca/otest/TuscanyRuntimeBridge.java
A testing/compliance-tests/binding-ws/src/test/resources
AU testing/compliance-tests/binding-ws/src/test/resources/tuscany-oasis-sca-tests-errors.properties
AU testing/compliance-tests/binding-ws/src/test/resources/oasis-sca-tests.properties
A testing/compliance-tests/binding-ws/sca_variables.dtd
AU testing/compliance-tests/binding-ws/pom.xml
A testing/compliance-tests/java-caa
A testing/compliance-tests/java-caa/src
A testing/compliance-tests/java-caa/src/test
A testing/compliance-tests/java-caa/src/test/java
A testing/compliance-tests/java-caa/src/test/java/org
A testing/compliance-tests/java-caa/src/test/java/org/apache
A testing/compliance-tests/java-caa/src/test/java/org/apache/tuscany
A testing/compliance-tests/java-caa/src/test/java/org/apache/tuscany/sca
A testing/compliance-tests/java-caa/src/test/java/org/apache/tuscany/sca/otest
A testing/compliance-tests/java-caa/src/test/java/org/apache/tuscany/sca/otest/TuscanyRuntimeBridge.java
A testing/compliance-tests/java-caa/src/test/resources
A testing/compliance-tests/java-caa/src/test/resources/tuscany-oasis-sca-tests-errors.properties
A testing/compliance-tests/java-caa/src/test/resources/oasis-sca-tests.properties
A testing/compliance-tests/java-caa/pom.xml
A testing/compliance-tests/java-ci
A testing/compliance-tests/java-ci/src
A testing/compliance-tests/java-ci/src/test
A testing/compliance-tests/java-ci/src/test/java
A testing/compliance-tests/java-ci/src/test/java/org
A testing/compliance-tests/java-ci/src/test/java/org/apache
A testing/compliance-tests/java-ci/src/test/java/org/apache/tuscany
A testing/compliance-tests/java-ci/src/test/java/org/apache/tuscany/sca
A testing/compliance-tests/java-ci/src/test/java/org/apache/tuscany/sca/otest
A testing/compliance-tests/java-ci/src/test/java/org/apache/tuscany/sca/otest/TuscanyRuntimeBridge.java
A testing/compliance-tests/java-ci/src/test/resources
A testing/compliance-tests/java-ci/src/test/resources/tuscany-oasis-sca-tests-errors.properties
A testing/compliance-tests/java-ci/src/test/resources/oasis-sca-tests.properties
A testing/compliance-tests/java-ci/pom.xml
A testing/compliance-tests/pom.xml
A features
A features/web20
AU features/web20/pom.xml
A features/osgi
AU features/osgi/pom.xml
A features/sdo
AU features/sdo/pom.xml
A features/ejava
AU features/ejava/pom.xml
A features/all
AU features/all/pom.xml
A features/core
AU features/core/pom.xml
A features/api
AU features/api/pom.xml
A features/eclipse-pde
AU features/eclipse-pde/pom.xml
AU features/pom.xml
A features/process
AU features/process/pom.xml
A features/webapp
AU features/webapp/pom.xml
A features/webservice
AU features/webservice/pom.xml
U .
At revision 1035210
Parsing POMs
[sca-2x] $ /home/hudson/tools/java/latest1.6/bin/java -Xmx756m -Xms756m -XX:MaxPermSize=512m -cp /home/hudson/hudson-slave/maven-agent.jar:/home/hudson/tools/maven/latest/boot/classworlds-1.1.jar hudson.maven.agent.Main /home/hudson/tools/maven/latest /home/hudson/hudson-slave/slave.jar /home/hudson/hudson-slave/maven-interceptor.jar 34060 /home/hudson/hudson-slave/maven2.1-interceptor.jar
<===[HUDSON REMOTING CAPACITY]===>channel started
Executing Maven: -B -f <https://hudson.apache.org/hudson/job/Tuscany-2x/ws/sca-2x/pom.xml> clean install -DbuildZips=false -U
[INFO] Scanning for projects...
[INFO] ------------------------------------------------------------------------
[ERROR] FATAL ERROR
[INFO] ------------------------------------------------------------------------
[INFO] Error building POM (may not be this project's POM).
Project ID: unknown
POM Location: <https://hudson.apache.org/hudson/job/Tuscany-2x/ws/sca-2x/pom.xml>
Reason: Parse error reading POM. Reason: Unrecognised association: 'modules' (position: START_TAG seen ...</module>\n <modules>... @320:26) for project unknown at <https://hudson.apache.org/hudson/job/Tuscany-2x/ws/sca-2x/pom.xml>
[INFO] ------------------------------------------------------------------------
[INFO] Trace
org.apache.maven.reactor.MavenExecutionException: Parse error reading POM. Reason: Unrecognised association: 'modules' (position: START_TAG seen ...</module>\n <modules>... @320:26) for project unknown at <https://hudson.apache.org/hudson/job/Tuscany-2x/ws/sca-2x/pom.xml>
at org.apache.maven.DefaultMaven.getProjects(DefaultMaven.java:404)
at org.apache.maven.DefaultMaven.doExecute(DefaultMaven.java:272)
at org.apache.maven.DefaultMaven.execute(DefaultMaven.java:138)
at org.apache.maven.cli.MavenCli.main(MavenCli.java:362)
at sun.reflect.NativeMethodAccessorImpl.invoke0(Native Method)
at sun.reflect.NativeMethodAccessorImpl.invoke(NativeMethodAccessorImpl.java:39)
at sun.reflect.DelegatingMethodAccessorImpl.invoke(DelegatingMethodAccessorImpl.java:25)
at java.lang.reflect.Method.invoke(Method.java:597)
at org.codehaus.classworlds.Launcher.launchEnhanced(Launcher.java:315)
at org.codehaus.classworlds.Launcher.launch(Launcher.java:255)
at hudson.maven.agent.Main.launch(Main.java:165)
at hudson.maven.MavenBuilder.call(MavenBuilder.java:165)
at hudson.maven.MavenModuleSetBuild$Builder.call(MavenModuleSetBuild.java:750)
at hudson.maven.MavenModuleSetBuild$Builder.call(MavenModuleSetBuild.java:694)
at hudson.remoting.UserRequest.perform(UserRequest.java:114)
at hudson.remoting.UserRequest.perform(UserRequest.java:48)
at hudson.remoting.Request$2.run(Request.java:270)
at java.util.concurrent.Executors$RunnableAdapter.call(Executors.java:441)
at java.util.concurrent.FutureTask$Sync.innerRun(FutureTask.java:303)
at java.util.concurrent.FutureTask.run(FutureTask.java:138)
at java.util.concurrent.ThreadPoolExecutor$Worker.runTask(ThreadPoolExecutor.java:886)
at java.util.concurrent.ThreadPoolExecutor$Worker.run(ThreadPoolExecutor.java:908)
at java.lang.Thread.run(Thread.java:619)
Caused by: org.apache.maven.project.InvalidProjectModelException: Parse error reading POM. Reason: Unrecognised association: 'modules' (position: START_TAG seen ...</module>\n <modules>... @320:26) for project unknown at <https://hudson.apache.org/hudson/job/Tuscany-2x/ws/sca-2x/pom.xml>
at org.apache.maven.project.DefaultMavenProjectBuilder.readModel(DefaultMavenProjectBuilder.java:1610)
at org.apache.maven.project.DefaultMavenProjectBuilder.readModel(DefaultMavenProjectBuilder.java:1571)
at org.apache.maven.project.DefaultMavenProjectBuilder.buildFromSourceFileInternal(DefaultMavenProjectBuilder.java:506)
at org.apache.maven.project.DefaultMavenProjectBuilder.build(DefaultMavenProjectBuilder.java:200)
at org.apache.maven.DefaultMaven.getProject(DefaultMaven.java:604)
at org.apache.maven.DefaultMaven.collectProjects(DefaultMaven.java:487)
at org.apache.maven.DefaultMaven.getProjects(DefaultMaven.java:391)
... 22 more
Caused by: org.codehaus.plexus.util.xml.pull.XmlPullParserException: Unrecognised association: 'modules' (position: START_TAG seen ...</module>\n <modules>... @320:26)
at org.apache.maven.model.io.xpp3.MavenXpp3Reader.parseProfile(MavenXpp3Reader.java:2932)
at org.apache.maven.model.io.xpp3.MavenXpp3Reader.parseModel(MavenXpp3Reader.java:2006)
at org.apache.maven.model.io.xpp3.MavenXpp3Reader.read(MavenXpp3Reader.java:3912)
at org.apache.maven.project.DefaultMavenProjectBuilder.readModel(DefaultMavenProjectBuilder.java:1606)
... 28 more
[INFO] ------------------------------------------------------------------------
[INFO] Total time: < 1 second
[INFO] Finished at: Mon Nov 15 10:29:26 UTC 2010
[INFO] Final Memory: 5M/724M
[INFO] ------------------------------------------------------------------------
channel stopped