You are viewing a plain text version of this content. The canonical link for it is here.
Posted to issues@tez.apache.org by Apache Jenkins Server <je...@builds.apache.org> on 2015/09/14 12:27:37 UTC
Failed: TEZ-2812 PreCommit Build #1126
Jira: https://issues.apache.org/jira/browse/TEZ-2812
Build: https://builds.apache.org/job/PreCommit-TEZ-Build/1126/
###################################################################################
########################## LAST 60 LINES OF THE CONSOLE ###########################
[...truncated 1530 lines...]
/home/jenkins/tools/maven/latest/bin/mvn clean install -fn -DTezPatchProcess
cat: /home/jenkins/jenkins-slave/workspace/PreCommit-TEZ-Build@2/../patchprocess/testrun.txt: No such file or directory
awk: cannot open /home/jenkins/jenkins-slave/workspace/PreCommit-TEZ-Build@2/../patchprocess/testrun.txt (No such file or directory)
{color:red}-1 overall{color}. Here are the results of testing the latest attachment
http://issues.apache.org/jira/secure/attachment/12755686/TEZ-2812.2.patch
against master revision b6f15dc.
{color:green}+1 @author{color}. The patch does not contain any @author tags.
{color:red}-1 tests included{color}. The patch doesn't appear to include any new or modified tests.
Please justify why no new tests are needed for this patch.
Also please list what manual steps were performed to verify this patch.
{color:green}+1 javac{color}. The applied patch does not increase the total number of javac compiler warnings.
{color:green}+1 javadoc{color}. There were no new javadoc warning messages.
{color:green}+1 findbugs{color}. The patch does not introduce any new Findbugs (version 3.0.1) warnings.
{color:green}+1 release audit{color}. The applied patch does not increase the total number of release audit warnings.
{color:red}-1 core tests{color}. The patch failed these unit tests in :
org.apache.tez.runtime.library.common.sort.impl.TestPipelinedSorter
Test results: https://builds.apache.org/job/PreCommit-TEZ-Build/1126//testReport/
Console output: https://builds.apache.org/job/PreCommit-TEZ-Build/1126//console
This message is automatically generated.
======================================================================
======================================================================
Adding comment to Jira.
======================================================================
======================================================================
Comment added.
f5676d08559fe3bc8cc47c753510daab294d0e30 logged out
======================================================================
======================================================================
Finished build.
======================================================================
======================================================================
Build step 'Execute shell' marked build as failure
Archiving artifacts
[description-setter] Could not determine description.
Recording test results
Publish JUnit test result report is waiting for a checkpoint on PreCommit-TEZ-Build #1125
Email was triggered for: Failure
Sending email for trigger: Failure
###################################################################################
############################## FAILED TESTS (if any) ##############################
3 tests failed.
FAILED: org.apache.tez.runtime.library.common.sort.impl.TestPipelinedSorter.testWithLargeKeyValue
Error Message:
/tmp/org.apache.tez.runtime.library.common.sort.impl.TestPipelinedSorter/output/ae6de1d8-7bda-4b36-bc8d-bcee43dece6e_0/file.out
Stack Trace:
java.io.FileNotFoundException: /tmp/org.apache.tez.runtime.library.common.sort.impl.TestPipelinedSorter/output/ae6de1d8-7bda-4b36-bc8d-bcee43dece6e_0/file.out
at org.apache.hadoop.fs.RawLocalFileSystem.open(RawLocalFileSystem.java:198)
at org.apache.hadoop.fs.FileSystem.open(FileSystem.java:766)
at org.apache.tez.runtime.library.common.sort.impl.TezMerger$Segment.init(TezMerger.java:310)
at org.apache.tez.runtime.library.common.sort.impl.TezMerger$MergeQueue.merge(TezMerger.java:690)
at org.apache.tez.runtime.library.common.sort.impl.TezMerger$MergeQueue.merge(TezMerger.java:631)
at org.apache.tez.runtime.library.common.sort.impl.TezMerger.merge(TezMerger.java:168)
at org.apache.tez.runtime.library.common.sort.impl.PipelinedSorter.flush(PipelinedSorter.java:641)
at org.apache.tez.runtime.library.common.sort.impl.TestPipelinedSorter.writeData(TestPipelinedSorter.java:474)
at org.apache.tez.runtime.library.common.sort.impl.TestPipelinedSorter.basicTest(TestPipelinedSorter.java:368)
at org.apache.tez.runtime.library.common.sort.impl.TestPipelinedSorter.testWithLargeKeyValue(TestPipelinedSorter.java:177)
FAILED: org.apache.tez.runtime.library.common.sort.impl.TestPipelinedSorter.testExceedsKVWithMultiplePartitions
Error Message:
/tmp/org.apache.tez.runtime.library.common.sort.impl.TestPipelinedSorter/output/465d328d-dcbe-469c-8df5-386a881cbbf5_0/file.out
Stack Trace:
java.io.FileNotFoundException: /tmp/org.apache.tez.runtime.library.common.sort.impl.TestPipelinedSorter/output/465d328d-dcbe-469c-8df5-386a881cbbf5_0/file.out
at org.apache.hadoop.fs.RawLocalFileSystem.open(RawLocalFileSystem.java:198)
at org.apache.hadoop.fs.FileSystem.open(FileSystem.java:766)
at org.apache.tez.runtime.library.common.sort.impl.TezMerger$Segment.init(TezMerger.java:310)
at org.apache.tez.runtime.library.common.sort.impl.TezMerger$MergeQueue.merge(TezMerger.java:690)
at org.apache.tez.runtime.library.common.sort.impl.TezMerger$MergeQueue.merge(TezMerger.java:631)
at org.apache.tez.runtime.library.common.sort.impl.TezMerger.merge(TezMerger.java:168)
at org.apache.tez.runtime.library.common.sort.impl.PipelinedSorter.flush(PipelinedSorter.java:641)
at org.apache.tez.runtime.library.common.sort.impl.TestPipelinedSorter.writeData(TestPipelinedSorter.java:474)
at org.apache.tez.runtime.library.common.sort.impl.TestPipelinedSorter.testExceedsKVWithMultiplePartitions(TestPipelinedSorter.java:200)
REGRESSION: org.apache.tez.runtime.library.common.sort.impl.TestPipelinedSorter.basicTestWithSmallBlockSize
Error Message:
No space available in any of the local directories.
Stack Trace:
org.apache.hadoop.util.DiskChecker$DiskErrorException: No space available in any of the local directories.
at org.apache.hadoop.fs.LocalDirAllocator$AllocatorPerContext.getLocalPathForWrite(LocalDirAllocator.java:366)
at org.apache.hadoop.fs.LocalDirAllocator.getLocalPathForWrite(LocalDirAllocator.java:150)
at org.apache.hadoop.fs.LocalDirAllocator.getLocalPathForWrite(LocalDirAllocator.java:131)
at org.apache.tez.runtime.library.common.task.local.output.TezTaskOutputFiles.getSpillFileForWrite(TezTaskOutputFiles.java:207)
at org.apache.tez.runtime.library.common.sort.impl.PipelinedSorter.spillSingleRecord(PipelinedSorter.java:365)
at org.apache.tez.runtime.library.common.sort.impl.PipelinedSorter.collect(PipelinedSorter.java:313)
at org.apache.tez.runtime.library.common.sort.impl.PipelinedSorter.collect(PipelinedSorter.java:319)
at org.apache.tez.runtime.library.common.sort.impl.PipelinedSorter.collect(PipelinedSorter.java:319)
at org.apache.tez.runtime.library.common.sort.impl.PipelinedSorter.collect(PipelinedSorter.java:319)
at org.apache.tez.runtime.library.common.sort.impl.PipelinedSorter.collect(PipelinedSorter.java:319)
at org.apache.tez.runtime.library.common.sort.impl.PipelinedSorter.collect(PipelinedSorter.java:319)
at org.apache.tez.runtime.library.common.sort.impl.PipelinedSorter.write(PipelinedSorter.java:266)
at org.apache.tez.runtime.library.common.sort.impl.TestPipelinedSorter.writeData(TestPipelinedSorter.java:471)
at org.apache.tez.runtime.library.common.sort.impl.TestPipelinedSorter.basicTest(TestPipelinedSorter.java:368)
at org.apache.tez.runtime.library.common.sort.impl.TestPipelinedSorter.basicTestWithSmallBlockSize(TestPipelinedSorter.java:170)