You are viewing a plain text version of this content. The canonical link for it is here.
Posted to hdfs-dev@hadoop.apache.org by Apache Jenkins Server <je...@builds.apache.org> on 2012/04/02 12:32:37 UTC
Hadoop-Hdfs-22-branch - Build # 128 - Failure
See https://builds.apache.org/job/Hadoop-Hdfs-22-branch/128/
###################################################################################
########################## LAST 60 LINES OF THE CONSOLE ###########################
[...truncated 1036 lines...]
[ivy:resolve] SERVER ERROR: Service Temporarily Unavailable url=https://repository.apache.org/content/repositories/snapshots/com/thoughtworks/paranamer/paranamer-ant/2.3/paranamer-ant-2.3.pom
[ivy:resolve] SERVER ERROR: Service Temporarily Unavailable url=https://repository.apache.org/content/repositories/snapshots/com/thoughtworks/paranamer/paranamer-ant/2.3/paranamer-ant-2.3.jar
[ivy:resolve] SERVER ERROR: Service Temporarily Unavailable url=https://repository.apache.org/content/repositories/snapshots/com/thoughtworks/paranamer/paranamer-ant/2.3/paranamer-ant-2.3-sources.jar
[ivy:resolve] SERVER ERROR: Service Temporarily Unavailable url=https://repository.apache.org/content/repositories/snapshots/com/thoughtworks/paranamer/paranamer-ant/2.3/paranamer-ant-2.3-javadoc.jar
[ivy:resolve] SERVER ERROR: Service Temporarily Unavailable url=https://repository.apache.org/content/repositories/snapshots/com/thoughtworks/paranamer/paranamer-generator/2.3/paranamer-generator-2.3.pom
[ivy:resolve] SERVER ERROR: Service Temporarily Unavailable url=https://repository.apache.org/content/repositories/snapshots/com/thoughtworks/paranamer/paranamer-generator/2.3/paranamer-generator-2.3.jar
[ivy:resolve] SERVER ERROR: Service Temporarily Unavailable url=https://repository.apache.org/content/repositories/snapshots/com/thoughtworks/paranamer/paranamer-generator/2.3/paranamer-generator-2.3-sources.jar
[ivy:resolve] SERVER ERROR: Service Temporarily Unavailable url=https://repository.apache.org/content/repositories/snapshots/com/thoughtworks/paranamer/paranamer-generator/2.3/paranamer-generator-2.3-javadoc.jar
[ivy:resolve] SERVER ERROR: Service Temporarily Unavailable url=https://repository.apache.org/content/repositories/snapshots/com/thoughtworks/qdox/qdox/1.12/qdox-1.12.pom
[ivy:resolve] SERVER ERROR: Service Temporarily Unavailable url=https://repository.apache.org/content/repositories/snapshots/com/thoughtworks/qdox/qdox/1.12/qdox-1.12.jar
[ivy:resolve] SERVER ERROR: Service Temporarily Unavailable url=https://repository.apache.org/content/repositories/snapshots/com/thoughtworks/qdox/qdox/1.12/qdox-1.12-sources.jar
[ivy:resolve] SERVER ERROR: Service Temporarily Unavailable url=https://repository.apache.org/content/repositories/snapshots/com/thoughtworks/qdox/qdox/1.12/qdox-1.12-javadoc.jar
[ivy:resolve] SERVER ERROR: Service Temporarily Unavailable url=https://repository.apache.org/content/repositories/snapshots/asm/asm/3.3/asm-3.3.pom
[ivy:resolve] SERVER ERROR: Service Temporarily Unavailable url=https://repository.apache.org/content/repositories/snapshots/asm/asm/3.3/asm-3.3.jar
[ivy:resolve] SERVER ERROR: Service Temporarily Unavailable url=https://repository.apache.org/content/repositories/snapshots/asm/asm-parent/3.3/asm-parent-3.3.pom
[ivy:resolve] SERVER ERROR: Service Temporarily Unavailable url=https://repository.apache.org/content/repositories/snapshots/asm/asm-parent/3.3/asm-parent-3.3.jar
[ivy:resolve] SERVER ERROR: Service Temporarily Unavailable url=https://repository.apache.org/content/repositories/snapshots/asm/asm/3.3/asm-3.3-sources.jar
[ivy:resolve] SERVER ERROR: Service Temporarily Unavailable url=https://repository.apache.org/content/repositories/snapshots/asm/asm/3.3/asm-3.3-javadoc.jar
[ivy:resolve] SERVER ERROR: Service Temporarily Unavailable url=https://repository.apache.org/content/repositories/snapshots/org/apache/ant/ant/1.7.1/ant-1.7.1.pom
[ivy:resolve] SERVER ERROR: Service Temporarily Unavailable url=https://repository.apache.org/content/repositories/snapshots/org/apache/ant/ant/1.7.1/ant-1.7.1.jar
[ivy:resolve] SERVER ERROR: Service Temporarily Unavailable url=https://repository.apache.org/content/repositories/snapshots/org/apache/ant/ant-parent/1.7.1/ant-parent-1.7.1.pom
[ivy:resolve] SERVER ERROR: Service Temporarily Unavailable url=https://repository.apache.org/content/repositories/snapshots/org/apache/ant/ant-parent/1.7.1/ant-parent-1.7.1.jar
[ivy:resolve] SERVER ERROR: Service Temporarily Unavailable url=https://repository.apache.org/content/repositories/snapshots/org/apache/ant/ant/1.7.1/ant-1.7.1-sources.jar
[ivy:resolve] SERVER ERROR: Service Temporarily Unavailable url=https://repository.apache.org/content/repositories/snapshots/org/apache/ant/ant/1.7.1/ant-1.7.1-javadoc.jar
[ivy:resolve] SERVER ERROR: Service Temporarily Unavailable url=https://repository.apache.org/content/repositories/snapshots/org/apache/ant/ant-launcher/1.7.1/ant-launcher-1.7.1.pom
[ivy:resolve] SERVER ERROR: Service Temporarily Unavailable url=https://repository.apache.org/content/repositories/snapshots/org/apache/ant/ant-launcher/1.7.1/ant-launcher-1.7.1.jar
[ivy:resolve] SERVER ERROR: Service Temporarily Unavailable url=https://repository.apache.org/content/repositories/snapshots/org/apache/ant/ant-launcher/1.7.1/ant-launcher-1.7.1-sources.jar
[ivy:resolve] SERVER ERROR: Service Temporarily Unavailable url=https://repository.apache.org/content/repositories/snapshots/org/apache/ant/ant-launcher/1.7.1/ant-launcher-1.7.1-javadoc.jar
[ivy:resolve]
[ivy:resolve] :: USE VERBOSE OR DEBUG MESSAGE LEVEL FOR MORE DETAILS
BUILD FAILED
/home/jenkins/jenkins-slave/workspace/Hadoop-Hdfs-22-branch/trunk/build.xml:1814: impossible to resolve dependencies:
resolve failed - see output for details
Total time: 47 seconds
======================================================================
======================================================================
STORE: saving artifacts
======================================================================
======================================================================
mv: cannot stat `build/*.tar.gz': No such file or directory
mv: cannot stat `build/*.jar': No such file or directory
mv: cannot stat `build/test/findbugs': No such file or directory
mv: cannot stat `build/docs/api': No such file or directory
Build Failed
Build step 'Execute shell' marked build as failure
[FINDBUGS] Skipping publisher since build result is FAILURE
Archiving artifacts
Recording test results
Publishing Javadoc
Recording fingerprints
Updating HDFS-2991
Email was triggered for: Failure
Sending email for trigger: Failure
###################################################################################
############################## FAILED TESTS (if any) ##############################
No tests ran.
Hadoop-Hdfs-22-branch - Build # 129 - Still Failing
Posted by Apache Jenkins Server <je...@builds.apache.org>.
See https://builds.apache.org/job/Hadoop-Hdfs-22-branch/129/
###################################################################################
########################## LAST 60 LINES OF THE CONSOLE ###########################
[...truncated 3620 lines...]
compile-hdfs-test:
[delete] Deleting directory /home/jenkins/jenkins-slave/workspace/Hadoop-Hdfs-22-branch/trunk/build-fi/test/cache
[mkdir] Created dir: /home/jenkins/jenkins-slave/workspace/Hadoop-Hdfs-22-branch/trunk/build-fi/test/cache
[copy] Copying 1 file to /home/jenkins/jenkins-slave/workspace/Hadoop-Hdfs-22-branch/trunk/build-fi/test/cache
[copy] Copying 1 file to /home/jenkins/jenkins-slave/workspace/Hadoop-Hdfs-22-branch/trunk/build-fi/test/cache
[copy] Copying 1 file to /home/jenkins/jenkins-slave/workspace/Hadoop-Hdfs-22-branch/trunk/build-fi/test/cache
[copy] Copying 1 file to /home/jenkins/jenkins-slave/workspace/Hadoop-Hdfs-22-branch/trunk/build-fi/test/cache
[copy] Copying 1 file to /home/jenkins/jenkins-slave/workspace/Hadoop-Hdfs-22-branch/trunk/build-fi/test/cache
[copy] Copying 1 file to /home/jenkins/jenkins-slave/workspace/Hadoop-Hdfs-22-branch/trunk/build-fi/test/cache
[copy] Copying 1 file to /home/jenkins/jenkins-slave/workspace/Hadoop-Hdfs-22-branch/trunk/build-fi/test/cache
[copy] Copying 1 file to /home/jenkins/jenkins-slave/workspace/Hadoop-Hdfs-22-branch/trunk/build-fi/test/cache
[copy] Copying 1 file to /home/jenkins/jenkins-slave/workspace/Hadoop-Hdfs-22-branch/trunk/build-fi/test/cache
[copy] Copying 1 file to /home/jenkins/jenkins-slave/workspace/Hadoop-Hdfs-22-branch/trunk/build-fi/test/cache
run-test-hdfs-excluding-commit-and-smoke:
[mkdir] Created dir: /home/jenkins/jenkins-slave/workspace/Hadoop-Hdfs-22-branch/trunk/build-fi/test/data
[mkdir] Created dir: /home/jenkins/jenkins-slave/workspace/Hadoop-Hdfs-22-branch/trunk/build-fi/test/logs
[copy] Copying 1 file to /home/jenkins/jenkins-slave/workspace/Hadoop-Hdfs-22-branch/trunk/build-fi/test/extraconf
[copy] Copying 1 file to /home/jenkins/jenkins-slave/workspace/Hadoop-Hdfs-22-branch/trunk/build-fi/test/extraconf
[junit] WARNING: multiple versions of ant detected in path for junit
[junit] jar:file:/home/jenkins/tools/ant/latest/lib/ant.jar!/org/apache/tools/ant/Project.class
[junit] and jar:file:/home/jenkins/.ivy2/cache/org.apache.ant/ant/jars/ant-1.7.1.jar!/org/apache/tools/ant/Project.class
[junit] Running org.apache.hadoop.fs.TestFiListPath
[junit] Tests run: 2, Failures: 0, Errors: 0, Time elapsed: 1.947 sec
[junit] Running org.apache.hadoop.fs.TestFiRename
[junit] Tests run: 4, Failures: 0, Errors: 0, Time elapsed: 21.579 sec
[junit] Running org.apache.hadoop.hdfs.TestFiHFlush
[junit] Tests run: 9, Failures: 0, Errors: 0, Time elapsed: 13.328 sec
[junit] Running org.apache.hadoop.hdfs.TestFiHftp
[junit] Tests run: 1, Failures: 0, Errors: 0, Time elapsed: 35.566 sec
[junit] Running org.apache.hadoop.hdfs.TestFiPipelines
[junit] Tests run: 3, Failures: 0, Errors: 0, Time elapsed: 4.866 sec
[junit] Running org.apache.hadoop.hdfs.server.datanode.TestFiDataTransferProtocol
[junit] Tests run: 29, Failures: 0, Errors: 0, Time elapsed: 206.469 sec
[junit] Running org.apache.hadoop.hdfs.server.datanode.TestFiDataTransferProtocol2
[junit] Tests run: 10, Failures: 0, Errors: 0, Time elapsed: 319.766 sec
[junit] Running org.apache.hadoop.hdfs.server.datanode.TestFiPipelineClose
[junit] Tests run: 3, Failures: 0, Errors: 0, Time elapsed: 34.891 sec
checkfailure:
-run-test-hdfs-fault-inject-withtestcaseonly:
run-test-hdfs-fault-inject:
BUILD FAILED
/home/jenkins/jenkins-slave/workspace/Hadoop-Hdfs-22-branch/trunk/build.xml:764: Tests failed!
Total time: 71 minutes 5 seconds
Build step 'Execute shell' marked build as failure
[FINDBUGS] Skipping publisher since build result is FAILURE
Archiving artifacts
Recording test results
Publishing Javadoc
Recording fingerprints
Updating HDFS-2246
Email was triggered for: Failure
Sending email for trigger: Failure
###################################################################################
############################## FAILED TESTS (if any) ##############################
1 tests failed.
REGRESSION: org.apache.hadoop.hdfs.TestParallelRead.testParallelRead
Error Message:
Timeout occurred. Please note the time in the report does not reflect the time until the timeout.
Stack Trace:
junit.framework.AssertionFailedError: Timeout occurred. Please note the time in the report does not reflect the time until the timeout.