You are viewing a plain text version of this content. The canonical link for it is here.
Posted to dev@zookeeper.apache.org by Apache Jenkins Server <je...@builds.apache.org> on 2019/09/14 13:39:08 UTC
ZooKeeper_branch35_jdk8 - Build # 1541 - Still Failing
See https://builds.apache.org/job/ZooKeeper_branch35_jdk8/1541/
###################################################################################
########################## LAST 60 LINES OF THE CONSOLE ###########################
[...truncated 68.35 KB...]
[junit] Running org.apache.zookeeper.test.SaslSuperUserTest in thread 3
[junit] Running org.apache.zookeeper.test.ServerCnxnTest in thread 2
[junit] Tests run: 1, Failures: 0, Errors: 0, Skipped: 0, Time elapsed: 0.825 sec, Thread: 3, Class: org.apache.zookeeper.test.SaslSuperUserTest
[junit] Running org.apache.zookeeper.test.SessionInvalidationTest in thread 3
[junit] Tests run: 1, Failures: 0, Errors: 0, Skipped: 0, Time elapsed: 0.996 sec, Thread: 3, Class: org.apache.zookeeper.test.SessionInvalidationTest
[junit] Tests run: 1, Failures: 0, Errors: 0, Skipped: 0, Time elapsed: 3.406 sec, Thread: 2, Class: org.apache.zookeeper.test.ServerCnxnTest
[junit] Running org.apache.zookeeper.test.SessionTest in thread 3
[junit] Running org.apache.zookeeper.test.SessionTimeoutTest in thread 2
[junit] Tests run: 4, Failures: 0, Errors: 0, Skipped: 0, Time elapsed: 1.967 sec, Thread: 2, Class: org.apache.zookeeper.test.SessionTimeoutTest
[junit] Running org.apache.zookeeper.test.SessionTrackerCheckTest in thread 2
[junit] Tests run: 2, Failures: 0, Errors: 0, Skipped: 0, Time elapsed: 0.098 sec, Thread: 2, Class: org.apache.zookeeper.test.SessionTrackerCheckTest
[junit] Running org.apache.zookeeper.test.SessionUpgradeTest in thread 2
[junit] Tests run: 1, Failures: 0, Errors: 0, Skipped: 0, Time elapsed: 25.791 sec, Thread: 1, Class: org.apache.zookeeper.test.RestoreCommittedLogTest
[junit] Running org.apache.zookeeper.test.StandaloneTest in thread 1
[junit] Tests run: 4, Failures: 0, Errors: 0, Skipped: 0, Time elapsed: 2.75 sec, Thread: 1, Class: org.apache.zookeeper.test.StandaloneTest
[junit] Running org.apache.zookeeper.test.StatTest in thread 1
[junit] Tests run: 4, Failures: 0, Errors: 0, Skipped: 0, Time elapsed: 1.676 sec, Thread: 1, Class: org.apache.zookeeper.test.StatTest
[junit] Tests run: 5, Failures: 0, Errors: 0, Skipped: 0, Time elapsed: 13.585 sec, Thread: 3, Class: org.apache.zookeeper.test.SessionTest
[junit] Running org.apache.zookeeper.test.StaticHostProviderTest in thread 1
[junit] Running org.apache.zookeeper.test.StringUtilTest in thread 3
[junit] Tests run: 1, Failures: 0, Errors: 0, Skipped: 0, Time elapsed: 0.071 sec, Thread: 3, Class: org.apache.zookeeper.test.StringUtilTest
[junit] Running org.apache.zookeeper.test.SyncCallTest in thread 3
[junit] Tests run: 1, Failures: 0, Errors: 0, Skipped: 0, Time elapsed: 0.776 sec, Thread: 3, Class: org.apache.zookeeper.test.SyncCallTest
[junit] Tests run: 26, Failures: 0, Errors: 0, Skipped: 0, Time elapsed: 2.132 sec, Thread: 1, Class: org.apache.zookeeper.test.StaticHostProviderTest
[junit] Running org.apache.zookeeper.test.TruncateTest in thread 3
[junit] Running org.apache.zookeeper.test.WatchEventWhenAutoResetTest in thread 1
[junit] Tests run: 3, Failures: 0, Errors: 0, Skipped: 0, Time elapsed: 10.997 sec, Thread: 3, Class: org.apache.zookeeper.test.TruncateTest
[junit] Running org.apache.zookeeper.test.WatchedEventTest in thread 3
[junit] Tests run: 4, Failures: 0, Errors: 0, Skipped: 0, Time elapsed: 0.088 sec, Thread: 3, Class: org.apache.zookeeper.test.WatchedEventTest
[junit] Running org.apache.zookeeper.test.WatcherFuncTest in thread 3
[junit] Tests run: 4, Failures: 0, Errors: 0, Skipped: 0, Time elapsed: 24.747 sec, Thread: 2, Class: org.apache.zookeeper.test.SessionUpgradeTest
[junit] Running org.apache.zookeeper.test.WatcherTest in thread 2
[junit] Tests run: 6, Failures: 0, Errors: 0, Skipped: 0, Time elapsed: 3.09 sec, Thread: 3, Class: org.apache.zookeeper.test.WatcherFuncTest
[junit] Running org.apache.zookeeper.test.X509AuthTest in thread 3
[junit] Tests run: 3, Failures: 0, Errors: 0, Skipped: 0, Time elapsed: 0.097 sec, Thread: 3, Class: org.apache.zookeeper.test.X509AuthTest
[junit] Running org.apache.zookeeper.test.ZkDatabaseCorruptionTest in thread 3
[junit] Tests run: 4, Failures: 0, Errors: 0, Skipped: 0, Time elapsed: 23.302 sec, Thread: 1, Class: org.apache.zookeeper.test.WatchEventWhenAutoResetTest
[junit] Running org.apache.zookeeper.test.ZooKeeperQuotaTest in thread 1
[junit] Tests run: 1, Failures: 0, Errors: 0, Skipped: 0, Time elapsed: 0.89 sec, Thread: 1, Class: org.apache.zookeeper.test.ZooKeeperQuotaTest
[junit] Running org.apache.zookeeper.util.PemReaderTest in thread 1
[junit] Tests run: 2, Failures: 0, Errors: 0, Skipped: 0, Time elapsed: 12.292 sec, Thread: 3, Class: org.apache.zookeeper.test.ZkDatabaseCorruptionTest
[junit] Running org.apache.jute.BinaryInputArchiveTest in thread 3
[junit] Tests run: 1, Failures: 0, Errors: 0, Skipped: 0, Time elapsed: 0.084 sec, Thread: 3, Class: org.apache.jute.BinaryInputArchiveTest
[junit] Tests run: 64, Failures: 0, Errors: 0, Skipped: 0, Time elapsed: 3.886 sec, Thread: 1, Class: org.apache.zookeeper.util.PemReaderTest
[junit] Tests run: 8, Failures: 0, Errors: 0, Skipped: 0, Time elapsed: 32.566 sec, Thread: 2, Class: org.apache.zookeeper.test.WatcherTest
[junit] Tests run: 13, Failures: 0, Errors: 0, Skipped: 0, Time elapsed: 274.003 sec, Thread: 4, Class: org.apache.zookeeper.test.ReconfigTest
fail.build.on.test.failure:
BUILD FAILED
/home/jenkins/jenkins-slave/workspace/ZooKeeper_branch35_jdk8/build.xml:1333: The following error occurred while executing this line:
/home/jenkins/jenkins-slave/workspace/ZooKeeper_branch35_jdk8/build.xml:1337: Tests failed!
Total time: 25 minutes 34 seconds
Build step 'Invoke Ant' marked build as failure
Archiving artifacts
Recording test results
Email was triggered for: Failure - Any
Sending email for trigger: Failure - Any
###################################################################################
############################## FAILED TESTS (if any) ##############################
1 tests failed.
FAILED: org.apache.zookeeper.server.quorum.QuorumPeerMainTest.testLeaderOutOfView
Error Message:
null
Stack Trace:
junit.framework.AssertionFailedError
at org.apache.zookeeper.server.quorum.QuorumPeerMainTest.testLeaderOutOfView(QuorumPeerMainTest.java:1096)
at org.apache.zookeeper.JUnit4ZKTestRunner$LoggedInvokeMethod.evaluate(JUnit4ZKTestRunner.java:80)