You are viewing a plain text version of this content. The canonical link for it is here.
Posted to builds@lucene.apache.org by Policeman Jenkins Server <je...@thetaphi.de> on 2022/04/18 04:46:29 UTC

[JENKINS] Lucene-main-Windows (64bit/jdk-18) - Build # 10722 - Still Unstable!

Build: https://jenkins.thetaphi.de/job/Lucene-main-Windows/10722/
Java: 64bit/jdk-18 -XX:+UseCompressedOops -XX:+UseParallelGC

2 tests failed.
FAILED:  org.apache.lucene.facet.taxonomy.directory.TestAlwaysRefreshDirectoryTaxonomyReader.classMethod

Error Message:
java.lang.Exception: Suite timeout exceeded (>= 7200000 msec).

Stack Trace:
java.lang.Exception: Suite timeout exceeded (>= 7200000 msec).
	at __randomizedtesting.SeedInfo.seed([CB91B4FBBF3C4398]:0)


FAILED:  org.apache.lucene.facet.taxonomy.directory.TestAlwaysRefreshDirectoryTaxonomyReader.testAlwaysRefreshDirectoryTaxonomyReader

Error Message:
java.lang.Exception: Test abandoned because suite timeout was reached.

Stack Trace:
java.lang.Exception: Test abandoned because suite timeout was reached.
	at __randomizedtesting.SeedInfo.seed([CB91B4FBBF3C4398]:0)