You are viewing a plain text version of this content. The canonical link for it is here.
Posted to builds@beam.apache.org by Apache Jenkins Server <je...@builds.apache.org> on 2021/03/21 10:00:32 UTC

beam_PostCommit_Java - Build # 7346 - Aborted!

beam_PostCommit_Java - Build # 7346 - Aborted:

Check console output at https://ci-beam.apache.org/job/beam_PostCommit_Java/7346/ to view the results.

Jenkins build is back to normal : beam_PostCommit_Java #7354

Posted by Apache Jenkins Server <je...@builds.apache.org>.
See <https://ci-beam.apache.org/job/beam_PostCommit_Java/7354/display/redirect?page=changes>


---------------------------------------------------------------------
To unsubscribe, e-mail: builds-unsubscribe@beam.apache.org
For additional commands, e-mail: builds-help@beam.apache.org


Build failed in Jenkins: beam_PostCommit_Java #7353

Posted by Apache Jenkins Server <je...@builds.apache.org>.
See <https://ci-beam.apache.org/job/beam_PostCommit_Java/7353/display/redirect?page=changes>

Changes:

[noreply] Fix a typo in license names

[noreply] Revert "Merge pull request #11767: [BEAM-11648] BigQuery Storage API

[Kenneth Knowles] Sickbay failing MapState and SetState tests for Dataflow streaming

[Kenneth Knowles] Exclude unsupported committed metrics for Dataflow streaming

[Kenneth Knowles] Increase Dataflow streaming ValidatesRunner timeout


------------------------------------------
[...truncated 118.60 KB...]

> Task :sdks:java:io:hadoop-format:runHadoopFormatIO292ElasticIT

> Task :sdks:java:container:java8:docker
 ---> c7c34222507e
Step 11/17 : COPY target/LICENSE /opt/apache/beam/
 ---> af27f416f3c9
Step 12/17 : COPY target/NOTICE /opt/apache/beam/
 ---> d685472d066d
Step 13/17 : ADD target/third_party_licenses /opt/apache/beam/third_party_licenses/
 ---> 75266651dd73
Step 14/17 : COPY target/LICENSE target/go-licenses/* /opt/apache/beam/third_party_licenses/golang/
 ---> 549cda011ead
Step 15/17 : RUN rm /opt/apache/beam/third_party_licenses/golang/LICENSE
 ---> Running in 9569a5d95f01
Removing intermediate container 9569a5d95f01
 ---> d56b2959aa1f
Step 16/17 : RUN if [ "${pull_licenses}" = "false" ] ; then     rm -rf /opt/apache/beam/third_party_licenses ;    fi
 ---> Running in 96d1e4638432
Removing intermediate container 96d1e4638432
 ---> 160bae73da24
Step 17/17 : ENTRYPOINT ["/opt/apache/beam/boot"]
 ---> Running in 825c5e1acd8d
Removing intermediate container 825c5e1acd8d
 ---> 6e0802d9f627
Successfully built 6e0802d9f627
Successfully tagged apache/beam_java8_sdk:2.30.0.dev

> Task :sdks:java:io:kafka:kafkaVersion231Test
> Task :sdks:java:io:kafka:kafkaVersion241BatchIT
> Task :sdks:java:io:hadoop-format:runHadoopFormatIO292IT
> Task :sdks:java:io:kafka:kafkaVersion241Test
> Task :sdks:java:io:hadoop-format:runHadoopFormatIO292Test
> Task :sdks:java:io:kafka:kafkaVersion251BatchIT
> Task :sdks:java:io:hadoop-format:runHadoopFormatIO321ElasticIT
> Task :sdks:java:io:kafka:kafkaVersion251Test
> Task :sdks:java:io:kafka:kafkaVersionsCompatibilityTest
> Task :sdks:java:io:hadoop-format:runHadoopFormatIO321IT
> Task :sdks:java:io:hadoop-format:runHadoopFormatIO321Test
> Task :sdks:java:io:hadoop-format:hadoopVersionsTest
> Task :javaHadoopVersionsTest

> Task :runners:google-cloud-dataflow-java:examplesJavaLegacyWorkerIntegrationTest

***********************************************************
***********************************************************
**********************Set Up Pubsub************************
The Pub/Sub topic has been set up for this example: projects/apache-beam-testing/topics/testpipeline-jenkins-0323001634-c1dd5a3a
The Pub/Sub subscription has been set up for this example: projects/apache-beam-testing/subscriptions/testpipeline-jenkins-0323001634-c1dd5a3a
******************Set Up Big Query Table*******************
The BigQuery table has been set up for this example: apache-beam-testing:traffic_max_lane_flow_1616458594033.traffic_max_lane_flow_table
*************************Tear Down*************************
The Pub/Sub topic has been deleted: projects/apache-beam-testing/topics/testpipeline-jenkins-0323001634-c1dd5a3a
The Pub/Sub subscription has been deleted: projects/apache-beam-testing/subscriptions/testpipeline-jenkins-0323001634-c1dd5a3a
The BigQuery table might contain the example's output, and it is not deleted automatically: apache-beam-testing:traffic_max_lane_flow_1616458594033.traffic_max_lane_flow_table
Please go to the Developers Console to delete it manually. Otherwise, you may be charged for its usage.
***********************************************************
***********************************************************

> Task :sdks:java:extensions:zetasketch:postCommit

> Task :runners:google-cloud-dataflow-java:examplesJavaLegacyWorkerIntegrationTest

***********************************************************
***********************************************************
**********************Set Up Pubsub************************
The Pub/Sub topic has been set up for this example: projects/apache-beam-testing/topics/testpipeline-jenkins-0323002940-9ca0ad75
The Pub/Sub subscription has been set up for this example: projects/apache-beam-testing/subscriptions/testpipeline-jenkins-0323002940-9ca0ad75
******************Set Up Big Query Table*******************
The BigQuery table has been set up for this example: apache-beam-testing:traffic_routes_1616459379640.traffic_routes_table
*************************Tear Down*************************
The Pub/Sub topic has been deleted: projects/apache-beam-testing/topics/testpipeline-jenkins-0323002940-9ca0ad75
The Pub/Sub subscription has been deleted: projects/apache-beam-testing/subscriptions/testpipeline-jenkins-0323002940-9ca0ad75
The BigQuery table might contain the example's output, and it is not deleted automatically: apache-beam-testing:traffic_routes_1616459379640.traffic_routes_table
Please go to the Developers Console to delete it manually. Otherwise, you may be charged for its usage.
***********************************************************
***********************************************************

> Task :runners:google-cloud-dataflow-java:googleCloudPlatformLegacyWorkerIntegrationTest
> Task :runners:google-cloud-dataflow-java:googleCloudPlatformLegacyWorkerKmsIntegrationTest
> Task :runners:google-cloud-dataflow-java:postCommit

> Task :runners:google-cloud-dataflow-java:buildAndPushDockerContainer
WARNING: `gcloud docker` will not be supported for Docker client versions above 18.03.

As an alternative, use `gcloud auth configure-docker` to configure `docker` to
use `gcloud` as a credential helper, then use `docker` as you would for non-GCR
registries, e.g. `docker pull gcr.io/project-id/my-image`. Add
`--verbosity=error` to silence this warning: `gcloud docker
--verbosity=error -- pull gcr.io/project-id/my-image`.

See: https://cloud.google.com/container-registry/docs/support/deprecation-notices#gcloud-docker

The push refers to repository [us.gcr.io/apache-beam-testing/java-postcommit-it/java]
d558c6fb158e: Preparing
2b7f00525d0b: Preparing
86b32a987e66: Preparing
117fc61a044a: Preparing
fb6fb8890136: Preparing
ee7da2de2b61: Preparing
b3d5c182872f: Preparing
8e376678b1e7: Preparing
0dc73ffab993: Preparing
70e20e473a44: Preparing
988aa98d14b4: Preparing
8a970d4156d3: Preparing
09ac04d65797: Preparing
59f1e8e1ce66: Preparing
bde301416dd2: Preparing
81496d8c72c2: Preparing
644448d6e877: Preparing
0e41e5bdb921: Preparing
8e376678b1e7: Waiting
644448d6e877: Waiting
bde301416dd2: Waiting
988aa98d14b4: Waiting
0dc73ffab993: Waiting
09ac04d65797: Waiting
81496d8c72c2: Waiting
b3d5c182872f: Waiting
ee7da2de2b61: Waiting
0e41e5bdb921: Waiting
fb6fb8890136: Pushed
117fc61a044a: Pushed
d558c6fb158e: Pushed
2b7f00525d0b: Pushed
8e376678b1e7: Pushed
b3d5c182872f: Pushed
86b32a987e66: Pushed
8a970d4156d3: Layer already exists
09ac04d65797: Layer already exists
59f1e8e1ce66: Layer already exists
bde301416dd2: Layer already exists
81496d8c72c2: Layer already exists
644448d6e877: Layer already exists
0e41e5bdb921: Layer already exists
70e20e473a44: Pushed
988aa98d14b4: Pushed
ee7da2de2b61: Pushed
0dc73ffab993: Pushed
20210323000103: digest: sha256:758f5354929c0bca90b2460958c9fceea579987adbe6acdeb48ba03c98bd4859 size: 4099

> Task :runners:google-cloud-dataflow-java:coreSDKJavaRunnerV2IntegrationTest NO-SOURCE
> Task :runners:google-cloud-dataflow-java:examplesJavaRunnerV2IntegrationTest

***********************************************************
***********************************************************
**********************Set Up Pubsub************************
The Pub/Sub topic has been set up for this example: projects/apache-beam-testing/topics/testpipeline-jenkins-0323014436-2c12acb5
The Pub/Sub subscription has been set up for this example: projects/apache-beam-testing/subscriptions/testpipeline-jenkins-0323014436-2c12acb5
******************Set Up Big Query Table*******************
The BigQuery table has been set up for this example: apache-beam-testing:traffic_routes_1616463871810.traffic_routes_table
*************************Tear Down*************************
The Pub/Sub topic has been deleted: projects/apache-beam-testing/topics/testpipeline-jenkins-0323014436-2c12acb5
The Pub/Sub subscription has been deleted: projects/apache-beam-testing/subscriptions/testpipeline-jenkins-0323014436-2c12acb5
The BigQuery table might contain the example's output, and it is not deleted automatically: apache-beam-testing:traffic_routes_1616463871810.traffic_routes_table
Please go to the Developers Console to delete it manually. Otherwise, you may be charged for its usage.
***********************************************************
***********************************************************

***********************************************************
***********************************************************
**********************Set Up Pubsub************************
The Pub/Sub topic has been set up for this example: projects/apache-beam-testing/topics/testpipeline-jenkins-0323020823-dac67804
The Pub/Sub subscription has been set up for this example: projects/apache-beam-testing/subscriptions/testpipeline-jenkins-0323020823-dac67804
******************Set Up Big Query Table*******************
The BigQuery table has been set up for this example: apache-beam-testing:traffic_max_lane_flow_1616465303474.traffic_max_lane_flow_table
*************************Tear Down*************************
The Pub/Sub topic has been deleted: projects/apache-beam-testing/topics/testpipeline-jenkins-0323020823-dac67804
The Pub/Sub subscription has been deleted: projects/apache-beam-testing/subscriptions/testpipeline-jenkins-0323020823-dac67804
The BigQuery table might contain the example's output, and it is not deleted automatically: apache-beam-testing:traffic_max_lane_flow_1616465303474.traffic_max_lane_flow_table
Please go to the Developers Console to delete it manually. Otherwise, you may be charged for its usage.
***********************************************************
***********************************************************

> Task :runners:google-cloud-dataflow-java:googleCloudPlatformRunnerV2IntegrationTest

org.apache.beam.sdk.io.gcp.pubsub.PubsubReadIT > testReadPubsubMessageId FAILED
    java.lang.AssertionError at PubsubReadIT.java:90

org.apache.beam.sdk.io.gcp.pubsub.PubsubReadIT > testReadPublicData FAILED
    java.lang.AssertionError at PubsubReadIT.java:62

36 tests completed, 2 failed, 1 skipped

> Task :runners:google-cloud-dataflow-java:googleCloudPlatformRunnerV2IntegrationTest FAILED

> Task :runners:google-cloud-dataflow-java:cleanUpDockerImages
Untagged: us.gcr.io/apache-beam-testing/java-postcommit-it/java:20210323000103
Untagged: us.gcr.io/apache-beam-testing/java-postcommit-it/java@sha256:758f5354929c0bca90b2460958c9fceea579987adbe6acdeb48ba03c98bd4859
Deleted: sha256:6e0802d9f627788926969b86919da3f78a07b9b6aaacc3aa27a5792f961e269b
Deleted: sha256:160bae73da247b57f00743881d9e7d8627a00690637862b54d3b8f2a32e67f9a
Deleted: sha256:d56b2959aa1f035a7248a0e0fc1e93de574ab61689eff91a888d8643201a9402
Deleted: sha256:e9a5a46a040ee0238648df98649a0d6f405c7a492bac00a40ff8a0633356560f
Deleted: sha256:549cda011eadcb16113dd236cc85f143545b06013bcc89fa61b521dbe977a67b
Deleted: sha256:3a580d69f87ff3c43de8e1232bea8e791db1707ddf32afcaf61bdabeede2bb16
Deleted: sha256:75266651dd73e00ee6123393eb150f8b85ffb0be93b71d320ee2a14ca44b34ef
Deleted: sha256:51255a78c4e9072449942bafafc4e94918337dfe6f49259fad2d7ca717e6603f
Deleted: sha256:d685472d066d5b2bc4a1934680d328bb73613a69b26409f7ec25fb01c769a606
Deleted: sha256:b83ea6c1f3f691502e797682488fe95a67c48a2238f4f9563c9da8a05e49aa03
Deleted: sha256:af27f416f3c9a63fbd5263e31e4c4b111be210972275b54761a782e83e2efcf4
Deleted: sha256:8322e051202894897ff53ac62bf37e6821b75cf4b71641c6c0084e7dbafaeddb
Deleted: sha256:c7c34222507e9de3736a524d9669cd4aedc6f3df9763abb6a920bb067c0e6267
Deleted: sha256:56e944b601f7e5d943cbab5fe6b8e4d34db43f0c94222b43c48d6534d3333688
Deleted: sha256:26f5e5961804a8553c66e3dcce1f5f98513f5a2d7da846780a0b4f28b30b112b
Deleted: sha256:a9b56ba84b151d34a71590d404443a5eb92c5776dab04ed572542ad2b015be39
Deleted: sha256:8a567bee5f0f1555846cc93a215e92e9fc1ef1d71c593cff40ba6075ddec6df3
Deleted: sha256:e8921904550f109b2b3e08cd7fac3d9c772cc535732439363da3478f6cf38b19
Deleted: sha256:59482f86963c67de4dc5658b2171fffd48fc1a75518caf210d2eb76d5d4bd13f
Deleted: sha256:581d223e78457d6eb0f6bf2f4f7d12f8329a07099761830b29aef9f254a1821e
Deleted: sha256:1fc7add4686314ea18d1e3247b9a3d00c1eab73b37fafc105619d1dc9876e1fc
Deleted: sha256:68c33b667125dc41162deb205cec53f0b803ef82c49f657769e5c289b975d0c0
Deleted: sha256:67a90177684f4b7edd3ea67d7f94daf6b846e12b5c85a8d1922da433a304480c
Deleted: sha256:1fe0f4726fc6f50b1d68c41472cf671af67e51608baabf5725b923438a61674e
Deleted: sha256:6f5b89ff40f8153181604b4479ca2b31b1b545562091775139cb2a16f8f1ea20
Deleted: sha256:f44607b292a6842c812e660ae6840e5dd942bcf2039bb10a742fc789897f3269
Digests:
- us.gcr.io/apache-beam-testing/java-postcommit-it/java@sha256:758f5354929c0bca90b2460958c9fceea579987adbe6acdeb48ba03c98bd4859
  Associated tags:
 - 20210323000103
Tags:
- us.gcr.io/apache-beam-testing/java-postcommit-it/java:20210323000103
Deleted [us.gcr.io/apache-beam-testing/java-postcommit-it/java:20210323000103].
Deleted [us.gcr.io/apache-beam-testing/java-postcommit-it/java@sha256:758f5354929c0bca90b2460958c9fceea579987adbe6acdeb48ba03c98bd4859].

FAILURE: Build failed with an exception.

* What went wrong:
Execution failed for task ':runners:google-cloud-dataflow-java:googleCloudPlatformRunnerV2IntegrationTest'.
> There were failing tests. See the report at: file://<https://ci-beam.apache.org/job/beam_PostCommit_Java/ws/src/runners/google-cloud-dataflow-java/build/reports/tests/googleCloudPlatformRunnerV2IntegrationTest/index.html>

* Try:
Run with --stacktrace option to get the stack trace. Run with --info or --debug option to get more log output. Run with --scan to get full insights.

* Get more help at https://help.gradle.org

Deprecated Gradle features were used in this build, making it incompatible with Gradle 7.0.
Use '--warning-mode all' to show the individual deprecation warnings.
See https://docs.gradle.org/6.8/userguide/command_line_interface.html#sec:command_line_warnings

BUILD FAILED in 3h 21m 29s
252 actionable tasks: 169 executed, 81 from cache, 2 up-to-date
Gradle was unable to watch the file system for changes. The inotify watches limit is too low.

Publishing build scan...
https://gradle.com/s/275fcqjxfhdcg

Build step 'Invoke Gradle script' changed build result to FAILURE
Build step 'Invoke Gradle script' marked build as failure

---------------------------------------------------------------------
To unsubscribe, e-mail: builds-unsubscribe@beam.apache.org
For additional commands, e-mail: builds-help@beam.apache.org


Build failed in Jenkins: beam_PostCommit_Java #7352

Posted by Apache Jenkins Server <je...@builds.apache.org>.
See <https://ci-beam.apache.org/job/beam_PostCommit_Java/7352/display/redirect?page=changes>

Changes:

[msbukal] Minor FhirIO Search changes

[andyxu] Remove @Hidden and @Experimental annotation of CreateFromSnapshot


------------------------------------------
[...truncated 121.86 KB...]
***********************************************************

***********************************************************
***********************************************************
*************************Tear Down*************************
The Pub/Sub topic has been deleted: projects/apache-beam-testing/topics/testpipeline-jenkins-0322181725-92fac766
The Pub/Sub subscription has been deleted: projects/apache-beam-testing/subscriptions/testpipeline-jenkins-0322181725-92fac766
The BigQuery table might contain the example's output, and it is not deleted automatically: apache-beam-testing:beam_examples.testpipeline_jenkins_0322181725_92fac766
Please go to the Developers Console to delete it manually. Otherwise, you may be charged for its usage.
***********************************************************
***********************************************************

> Task :sdks:java:io:hadoop-format:runHadoopFormatIO292ElasticIT
> Task :sdks:java:io:kafka:kafkaVersion241Test
> Task :sdks:java:io:kafka:kafkaVersion251BatchIT
> Task :sdks:java:io:hadoop-format:runHadoopFormatIO292IT
> Task :sdks:java:io:kafka:kafkaVersion251Test
> Task :sdks:java:io:hadoop-format:runHadoopFormatIO292Test
> Task :sdks:java:io:kafka:kafkaVersionsCompatibilityTest
> Task :sdks:java:io:hadoop-format:runHadoopFormatIO321ElasticIT
> Task :sdks:java:io:hadoop-format:runHadoopFormatIO321IT
> Task :sdks:java:io:hadoop-format:runHadoopFormatIO321Test
> Task :sdks:java:io:hadoop-format:hadoopVersionsTest
> Task :javaHadoopVersionsTest
> Task :sdks:java:extensions:zetasketch:postCommit

> Task :runners:google-cloud-dataflow-java:examplesJavaLegacyWorkerIntegrationTest

org.apache.beam.examples.complete.TfIdfIT > classMethod FAILED
    java.lang.IllegalArgumentException at TfIdfIT.java:55

***********************************************************
***********************************************************
**********************Set Up Pubsub************************
The Pub/Sub topic has been set up for this example: projects/apache-beam-testing/topics/testpipeline-jenkins-0322183831-9c5e4a17
The Pub/Sub subscription has been set up for this example: projects/apache-beam-testing/subscriptions/testpipeline-jenkins-0322183831-9c5e4a17
******************Set Up Big Query Table*******************
The BigQuery table has been set up for this example: apache-beam-testing:traffic_max_lane_flow_1616438310655.traffic_max_lane_flow_table
*************************Tear Down*************************
The Pub/Sub topic has been deleted: projects/apache-beam-testing/topics/testpipeline-jenkins-0322183831-9c5e4a17
The Pub/Sub subscription has been deleted: projects/apache-beam-testing/subscriptions/testpipeline-jenkins-0322183831-9c5e4a17
The BigQuery table might contain the example's output, and it is not deleted automatically: apache-beam-testing:traffic_max_lane_flow_1616438310655.traffic_max_lane_flow_table
Please go to the Developers Console to delete it manually. Otherwise, you may be charged for its usage.
***********************************************************
***********************************************************

12 tests completed, 2 failed, 1 skipped

> Task :runners:google-cloud-dataflow-java:examplesJavaLegacyWorkerIntegrationTest FAILED
> Task :runners:google-cloud-dataflow-java:googleCloudPlatformLegacyWorkerIntegrationTest
> Task :runners:google-cloud-dataflow-java:googleCloudPlatformLegacyWorkerKmsIntegrationTest

> Task :runners:google-cloud-dataflow-java:buildAndPushDockerContainer
WARNING: `gcloud docker` will not be supported for Docker client versions above 18.03.

As an alternative, use `gcloud auth configure-docker` to configure `docker` to
use `gcloud` as a credential helper, then use `docker` as you would for non-GCR
registries, e.g. `docker pull gcr.io/project-id/my-image`. Add
`--verbosity=error` to silence this warning: `gcloud docker
--verbosity=error -- pull gcr.io/project-id/my-image`.

See: https://cloud.google.com/container-registry/docs/support/deprecation-notices#gcloud-docker

The push refers to repository [us.gcr.io/apache-beam-testing/java-postcommit-it/java]
ea95432fe2d7: Preparing
d1065608e98a: Preparing
27ac599eda6e: Preparing
1c6ca3d22a22: Preparing
0602eba35a92: Preparing
e7a7e52f9d71: Preparing
214c88a329f3: Preparing
fc06bb4a286c: Preparing
318fb9cff93d: Preparing
c718c9dccd57: Preparing
2f4e64f06d08: Preparing
e7a7e52f9d71: Waiting
8a970d4156d3: Preparing
09ac04d65797: Preparing
318fb9cff93d: Waiting
8a970d4156d3: Waiting
c718c9dccd57: Waiting
2f4e64f06d08: Waiting
59f1e8e1ce66: Preparing
bde301416dd2: Preparing
81496d8c72c2: Preparing
09ac04d65797: Waiting
644448d6e877: Preparing
59f1e8e1ce66: Waiting
bde301416dd2: Waiting
81496d8c72c2: Waiting
0e41e5bdb921: Preparing
644448d6e877: Waiting
ea95432fe2d7: Pushed
1c6ca3d22a22: Pushed
0602eba35a92: Pushed
d1065608e98a: Pushed
fc06bb4a286c: Pushed
214c88a329f3: Pushed
27ac599eda6e: Pushed
8a970d4156d3: Layer already exists
09ac04d65797: Layer already exists
59f1e8e1ce66: Layer already exists
bde301416dd2: Layer already exists
81496d8c72c2: Layer already exists
644448d6e877: Layer already exists
0e41e5bdb921: Layer already exists
c718c9dccd57: Pushed
2f4e64f06d08: Pushed
e7a7e52f9d71: Pushed
318fb9cff93d: Pushed
20210322180051: digest: sha256:da102081bd9aa13b3b3f34a7f70f5c96407a9d0e25e797a8af098f3f29f70336 size: 4099

> Task :runners:google-cloud-dataflow-java:coreSDKJavaRunnerV2IntegrationTest NO-SOURCE

> Task :runners:google-cloud-dataflow-java:examplesJavaRunnerV2IntegrationTest

org.apache.beam.examples.cookbook.BigQueryStorageAPIStreamingIT > testStorageAPIStreaming FAILED
    java.lang.IllegalArgumentException at BigQueryStorageAPIStreamingIT.java:119

***********************************************************
***********************************************************
**********************Set Up Pubsub************************
The Pub/Sub topic has been set up for this example: projects/apache-beam-testing/topics/testpipeline-jenkins-0322195806-9af64ae1
The Pub/Sub subscription has been set up for this example: projects/apache-beam-testing/subscriptions/testpipeline-jenkins-0322195806-9af64ae1
******************Set Up Big Query Table*******************
The BigQuery table has been set up for this example: apache-beam-testing:traffic_max_lane_flow_1616443085706.traffic_max_lane_flow_table
*************************Tear Down*************************
The Pub/Sub topic has been deleted: projects/apache-beam-testing/topics/testpipeline-jenkins-0322195806-9af64ae1
The Pub/Sub subscription has been deleted: projects/apache-beam-testing/subscriptions/testpipeline-jenkins-0322195806-9af64ae1
The BigQuery table might contain the example's output, and it is not deleted automatically: apache-beam-testing:traffic_max_lane_flow_1616443085706.traffic_max_lane_flow_table
Please go to the Developers Console to delete it manually. Otherwise, you may be charged for its usage.
***********************************************************
***********************************************************

***********************************************************
***********************************************************
**********************Set Up Pubsub************************
The Pub/Sub topic has been set up for this example: projects/apache-beam-testing/topics/testpipeline-jenkins-0322202203-d1ed111a
The Pub/Sub subscription has been set up for this example: projects/apache-beam-testing/subscriptions/testpipeline-jenkins-0322202203-d1ed111a
******************Set Up Big Query Table*******************
The BigQuery table has been set up for this example: apache-beam-testing:traffic_routes_1616444523118.traffic_routes_table
*************************Tear Down*************************
The Pub/Sub topic has been deleted: projects/apache-beam-testing/topics/testpipeline-jenkins-0322202203-d1ed111a
The Pub/Sub subscription has been deleted: projects/apache-beam-testing/subscriptions/testpipeline-jenkins-0322202203-d1ed111a
The BigQuery table might contain the example's output, and it is not deleted automatically: apache-beam-testing:traffic_routes_1616444523118.traffic_routes_table
Please go to the Developers Console to delete it manually. Otherwise, you may be charged for its usage.
***********************************************************
***********************************************************

9 tests completed, 1 failed

> Task :runners:google-cloud-dataflow-java:examplesJavaRunnerV2IntegrationTest FAILED
> Task :runners:google-cloud-dataflow-java:googleCloudPlatformRunnerV2IntegrationTest

org.apache.beam.sdk.io.gcp.pubsub.PubsubReadIT > testReadPubsubMessageId FAILED
    java.lang.AssertionError at PubsubReadIT.java:90

org.apache.beam.sdk.io.gcp.pubsub.PubsubReadIT > testReadPublicData FAILED
    java.lang.AssertionError at PubsubReadIT.java:62

36 tests completed, 2 failed, 1 skipped

> Task :runners:google-cloud-dataflow-java:googleCloudPlatformRunnerV2IntegrationTest FAILED

> Task :runners:google-cloud-dataflow-java:cleanUpDockerImages
Untagged: us.gcr.io/apache-beam-testing/java-postcommit-it/java:20210322180051
Untagged: us.gcr.io/apache-beam-testing/java-postcommit-it/java@sha256:da102081bd9aa13b3b3f34a7f70f5c96407a9d0e25e797a8af098f3f29f70336
Deleted: sha256:350e5c655818ac2d05c0be613c69d95a4b7ab886923930eec186a01770e9fb32
Deleted: sha256:c9a6ce3136e951e8bc9eb0f9158b79d289503c63afad0099f0fd4f3984870cc2
Deleted: sha256:8221cad598be69db2358f87bd42003ff0fd7e0a7baa38835a2b63d155a62f1d8
Deleted: sha256:16a67599107f1d7ad2d721cd912ea42cf7143b940457d623d5ef2f754efc24a5
Deleted: sha256:adca687bbd9d877e3b784a1ec9988d438d3dcda70b90ffb461023da17323a556
Deleted: sha256:64be1dc0f3426db7d55dd0cd337488cc310587425133b370dc6afc99076f808d
Deleted: sha256:31e2f80f3ead0f84b6a9bfcbca7110270fe3be6783c624d5e6ce52ac2b0e9ee1
Deleted: sha256:b0825046a9c8096687fb0498d40f0194f6b5ad321623d3f5581043dd35ddf316
Deleted: sha256:460dc52e6be013abf3d390dad75218b84732aba251e264128471eceb2323dafd
Deleted: sha256:35d22643643e7110d18374af26e3d51a8713515a86711ed490f493132bda4105
Deleted: sha256:f75e8f5963a92b8249004cf7ff4521da13bd9eed713c8dbb36f2d015017b4f30
Deleted: sha256:1266dbd17659532a5d6a70ed2eab5b598f5dc4bbfcbf7381147a0435b9afb277
Deleted: sha256:8aff27bc3e59ccb8c92ce011eed956ba1c7f15a28014e419b81be3c75061da65
Deleted: sha256:138c00b2f0144e379153359106600dd4cc05638e739c41a7936a5fe53bdadac4
Deleted: sha256:fffdc738bc25a5b061ed46785eecb8e424a7ab8570f2d4327852b830e4462326
Deleted: sha256:47064da566fe633fbdb56b3a798015c2533ded67fd0464c619a162cc98a75a70
Deleted: sha256:46d134b4eae178a957a0c81d5a2deb908d12b0fcf7384341a886493d3797a183
Deleted: sha256:d1cef731fdc5efc3d2cd58aa03f51eafb1bdad4bbde2a49e0106627bbae9c05e
Deleted: sha256:ef9ca7f9e22ce8af721f4478370af1ad18a8506a68da464eeceddb2a41c99b41
Deleted: sha256:99520cc9b001ef1facf91a6eedd03ae44d60386d9db7c340cd9c412b886199bb
Deleted: sha256:58a4b85e29703bf71b15ae47f1b344d61046e8745f2e451bc63b817cb81b915a
Deleted: sha256:c29a89986b3cc1da71d46386c6464414b9129403808f8c42abda4e43ca7ddee0
Deleted: sha256:d0162d8c8b4db77d2931745f8526e1bc8af2de7fbf5a37b40a726d641fb80832
Deleted: sha256:c9ac7e37e51f3fea7253cd031de7c0441ad144e8de40939c851a7614bf1f80b4
Deleted: sha256:9200de6ab12936bc9be4fa3f191d22f47b6676f65b4299b48f4bf5b4fcc86738
Deleted: sha256:44dd12f9ed833956acbeb7d1d5dabdc3c8dcefc4335d2c6029f24135acc6cb72
Digests:
- us.gcr.io/apache-beam-testing/java-postcommit-it/java@sha256:da102081bd9aa13b3b3f34a7f70f5c96407a9d0e25e797a8af098f3f29f70336
  Associated tags:
 - 20210322180051
Tags:
- us.gcr.io/apache-beam-testing/java-postcommit-it/java:20210322180051
Deleted [us.gcr.io/apache-beam-testing/java-postcommit-it/java:20210322180051].
Deleted [us.gcr.io/apache-beam-testing/java-postcommit-it/java@sha256:da102081bd9aa13b3b3f34a7f70f5c96407a9d0e25e797a8af098f3f29f70336].

FAILURE: Build completed with 3 failures.

1: Task failed with an exception.
-----------
* What went wrong:
Execution failed for task ':runners:google-cloud-dataflow-java:examplesJavaLegacyWorkerIntegrationTest'.
> There were failing tests. See the report at: file://<https://ci-beam.apache.org/job/beam_PostCommit_Java/ws/src/runners/google-cloud-dataflow-java/build/reports/tests/examplesJavaLegacyWorkerIntegrationTest/index.html>

* Try:
Run with --stacktrace option to get the stack trace. Run with --info or --debug option to get more log output. Run with --scan to get full insights.
==============================================================================

2: Task failed with an exception.
-----------
* What went wrong:
Execution failed for task ':runners:google-cloud-dataflow-java:examplesJavaRunnerV2IntegrationTest'.
> There were failing tests. See the report at: file://<https://ci-beam.apache.org/job/beam_PostCommit_Java/ws/src/runners/google-cloud-dataflow-java/build/reports/tests/examplesJavaRunnerV2IntegrationTest/index.html>

* Try:
Run with --stacktrace option to get the stack trace. Run with --info or --debug option to get more log output. Run with --scan to get full insights.
==============================================================================

3: Task failed with an exception.
-----------
* What went wrong:
Execution failed for task ':runners:google-cloud-dataflow-java:googleCloudPlatformRunnerV2IntegrationTest'.
> There were failing tests. See the report at: file://<https://ci-beam.apache.org/job/beam_PostCommit_Java/ws/src/runners/google-cloud-dataflow-java/build/reports/tests/googleCloudPlatformRunnerV2IntegrationTest/index.html>

* Try:
Run with --stacktrace option to get the stack trace. Run with --info or --debug option to get more log output. Run with --scan to get full insights.
==============================================================================

* Get more help at https://help.gradle.org

Deprecated Gradle features were used in this build, making it incompatible with Gradle 7.0.
Use '--warning-mode all' to show the individual deprecation warnings.
See https://docs.gradle.org/6.8/userguide/command_line_interface.html#sec:command_line_warnings

BUILD FAILED in 3h 33m 25s
252 actionable tasks: 172 executed, 78 from cache, 2 up-to-date
Gradle was unable to watch the file system for changes. The inotify watches limit is too low.

Publishing build scan...
https://gradle.com/s/sbdwczgpsps3a

Build step 'Invoke Gradle script' changed build result to FAILURE
Build step 'Invoke Gradle script' marked build as failure

---------------------------------------------------------------------
To unsubscribe, e-mail: builds-unsubscribe@beam.apache.org
For additional commands, e-mail: builds-help@beam.apache.org


Build failed in Jenkins: beam_PostCommit_Java #7351

Posted by Apache Jenkins Server <je...@builds.apache.org>.
See <https://ci-beam.apache.org/job/beam_PostCommit_Java/7351/display/redirect>

Changes:


------------------------------------------
[...truncated 94.02 KB...]
Resolving cached github.com/etcd-io/etcd: commit='11214aa33bf5a47d3d9d8dafe0f6b97237dfe921', urls=[https://github.com/etcd-io/etcd.git, git@github.com:etcd-io/etcd.git]
Resolving cached github.com/etcd-io/etcd: commit='11214aa33bf5a47d3d9d8dafe0f6b97237dfe921', urls=[https://github.com/etcd-io/etcd.git, git@github.com:etcd-io/etcd.git]
Resolving cached github.com/etcd-io/etcd: commit='11214aa33bf5a47d3d9d8dafe0f6b97237dfe921', urls=[https://github.com/etcd-io/etcd.git, git@github.com:etcd-io/etcd.git]
Resolving github.com/xordataexchange/crypt: commit='b2862e3d0a775f18c7cfe02273500ae307b61218', urls=[https://github.com/xordataexchange/crypt.git, git@github.com:xordataexchange/crypt.git]
Resolving go.opencensus.io: commit='3fb168f674736c026e623310bfccb0691e6dec8a', urls=[https://github.com/census-instrumentation/opencensus-go]

> Task :sdks:java:io:hadoop-file-system:hadoopVersion2101Test
> Task :sdks:java:io:kinesis:integrationTest
> Task :sdks:java:io:kafka:kafkaVersion01103BatchIT
> Task :sdks:java:extensions:ml:integrationTest
> Task :sdks:java:io:debezium:integrationTest
> Task :runners:google-cloud-dataflow-java:examplesJavaLegacyWorkerIntegrationTest
> Task :sdks:java:io:hadoop-format:runHadoopFormatIO2101ElasticIT
> Task :runners:spark:2:hadoopVersion321Test FROM-CACHE
> Task :runners:spark:2:hadoopVersionsTest UP-TO-DATE

> Task :sdks:go:resolveBuildDependencies
Resolving golang.org/x/crypto: commit='d9133f5469342136e669e85192a26056b587f503', urls=[https://go.googlesource.com/crypto]
Resolving golang.org/x/debug: commit='95515998a8a4bd7448134b2cb5971dbeb12e0b77', urls=[https://go.googlesource.com/debug]
Resolving golang.org/x/net: commit='2fb46b16b8dda405028c50f7c7f0f9dd1fa6bfb1', urls=[https://go.googlesource.com/net]
Resolving golang.org/x/oauth2: commit='5d25da1a8d43b66f2898c444f899c7bcfd6a407e', urls=[https://go.googlesource.com/oauth2]
Resolving golang.org/x/sync: commit='fd80eb99c8f653c847d294a001bdf2a3a6f768f5', urls=[https://go.googlesource.com/sync]
Resolving golang.org/x/sys: commit='fde4db37ae7ad8191b03d30d27f258b5291ae4e3', urls=[https://go.googlesource.com/sys]

> Task :sdks:java:extensions:ml:postCommit
> Task :sdks:java:extensions:zetasketch:integrationTest
> Task :sdks:java:io:google-cloud-platform:integrationTest

> Task :release:go-licenses:java:dockerRun
+ go-licenses save github.com/apache/beam/sdks/java/container --save_path=/output/licenses
+ go-licenses csv github.com/apache/beam/sdks/java/container
+ tee /output/licenses/list.csv

> Task :sdks:go:resolveBuildDependencies
Resolving golang.org/x/text: commit='23ae387dee1f90d29a23c0e87ee0b46038fbed0e', urls=[https://go.googlesource.com/text]
Resolving cached github.com/etcd-io/etcd: commit='11214aa33bf5a47d3d9d8dafe0f6b97237dfe921', urls=[https://github.com/etcd-io/etcd.git, git@github.com:etcd-io/etcd.git]

> Task :release:go-licenses:java:dockerRun
github.com/apache/beam/sdks/go/pkg/beam,https://github.com/apache/beam/blob/master/sdks/go/README.md,Apache-2.0
google.golang.org/grpc,https://github.com/grpc/grpc-go/blob/master/LICENSE,Apache-2.0
golang.org/x/sys,https://go.googlesource.com/sys/+/refs/heads/master/LICENSE,BSD-3-Clause
github.com/apache/beam/sdks/java/container,https://github.com/apache/beam/blob/master/LICENSE,Apache-2.0
github.com/golang/protobuf,https://github.com/golang/protobuf/blob/master/LICENSE,BSD-3-Clause
google.golang.org/protobuf,https://go.googlesource.com/protobuf/+/refs/heads/master/LICENSE,BSD-3-Clause
golang.org/x/net,https://go.googlesource.com/net/+/refs/heads/master/LICENSE,BSD-3-Clause
google.golang.org/genproto/googleapis/rpc/status,https://github.com/googleapis/go-genproto/blob/master/LICENSE,Apache-2.0
golang.org/x/text,https://go.googlesource.com/text/+/refs/heads/master/LICENSE,BSD-3-Clause
+ chmod -R a+w /output/licenses

> Task :release:go-licenses:java:createLicenses
> Task :sdks:java:container:java8:copyGolangLicenses
> Task :sdks:java:io:hadoop-file-system:hadoopVersion285Test
> Task :sdks:java:io:kafka:kafkaVersion01103Test
> Task :sdks:java:io:hadoop-format:runHadoopFormatIO2101IT
> Task :sdks:java:io:hadoop-file-system:hadoopVersion292Test
> Task :sdks:java:io:kafka:kafkaVersion100BatchIT
> Task :sdks:java:io:hadoop-format:runHadoopFormatIO2101Test
> Task :sdks:java:io:kafka:kafkaVersion100Test

> Task :sdks:go:resolveBuildDependencies
Resolving google.golang.org/api: commit='0324d5e90dc7753607860272666845fad9ceb97e', urls=[https://code.googlesource.com/google-api-go-client]

> Task :sdks:java:io:hadoop-file-system:hadoopVersion321Test
> Task :sdks:java:io:kafka:kafkaVersion111BatchIT
> Task :sdks:java:io:hadoop-file-system:hadoopVersionsTest

> Task :runners:google-cloud-dataflow-java:examplesJavaLegacyWorkerIntegrationTest

org.apache.beam.examples.cookbook.BigQueryStorageAPIStreamingIT > testStorageAPIStreaming FAILED
    java.lang.IllegalArgumentException at BigQueryStorageAPIStreamingIT.java:119

> Task :sdks:java:io:hadoop-format:runHadoopFormatIO285ElasticIT
> Task :sdks:java:io:kafka:kafkaVersion111Test
> Task :sdks:java:io:hadoop-format:runHadoopFormatIO285IT
> Task :sdks:java:io:kafka:kafkaVersion201BatchIT
> Task :sdks:java:io:hadoop-format:runHadoopFormatIO285Test
> Task :sdks:java:io:kafka:kafkaVersion201Test

> Task :sdks:go:resolveBuildDependencies
Resolving google.golang.org/genproto: commit='4d944d34d83c502a5f761500a14d8842648415c3', urls=[https://github.com/google/go-genproto]
Resolving google.golang.org/grpc: commit='5e8f83304c0563d1ba74db05fee83d9c18ab9a58', urls=[https://github.com/grpc/grpc-go]
Resolving google.golang.org/protobuf: commit='d165be301fb1e13390ad453281ded24385fd8ebc', urls=[https://go.googlesource.com/protobuf]
Resolving cached github.com/etcd-io/etcd: commit='11214aa33bf5a47d3d9d8dafe0f6b97237dfe921', urls=[https://github.com/etcd-io/etcd.git, git@github.com:etcd-io/etcd.git]
Resolving cached github.com/etcd-io/etcd: commit='11214aa33bf5a47d3d9d8dafe0f6b97237dfe921', urls=[https://github.com/etcd-io/etcd.git, git@github.com:etcd-io/etcd.git]

> Task :sdks:go:installDependencies
> Task :sdks:java:io:kafka:kafkaVersion211BatchIT
> Task :sdks:java:io:hadoop-format:runHadoopFormatIO292ElasticIT
> Task :sdks:java:io:kafka:kafkaVersion211Test
> Task :sdks:java:io:kafka:kafkaVersion222BatchIT

> Task :runners:google-cloud-dataflow-java:examplesJavaLegacyWorkerIntegrationTest

***********************************************************
***********************************************************
*************************Tear Down*************************
The Pub/Sub topic has been deleted: projects/apache-beam-testing/topics/testpipeline-jenkins-0322120710-c4802b62
The Pub/Sub subscription has been deleted: projects/apache-beam-testing/subscriptions/testpipeline-jenkins-0322120710-c4802b62
The BigQuery table might contain the example's output, and it is not deleted automatically: apache-beam-testing:beam_examples.testpipeline_jenkins_0322120710_c4802b62
Please go to the Developers Console to delete it manually. Otherwise, you may be charged for its usage.
***********************************************************
***********************************************************

> Task :sdks:go:buildLinuxAmd64
> Task :sdks:go:goBuild
> Task :sdks:java:io:hadoop-format:runHadoopFormatIO292IT

> Task :sdks:java:container:resolveBuildDependencies
Resolving ./github.com/apache/beam/sdks/go@<https://ci-beam.apache.org/job/beam_PostCommit_Java/ws/src/sdks/go>

> Task :sdks:java:container:installDependencies

> Task :sdks:java:container:buildLinuxAmd64
Unable to watch the file system for changes. The inotify watches limit is too low.

> Task :sdks:java:container:goBuild
> Task :sdks:java:container:java8:copySdkHarnessLauncher
> Task :sdks:java:io:kafka:kafkaVersion222Test
> Task :sdks:java:io:hadoop-format:runHadoopFormatIO292Test
> Task :sdks:java:io:kafka:kafkaVersion231BatchIT
> Task :sdks:java:io:kafka:kafkaVersion231Test
> Task :sdks:java:io:hadoop-format:runHadoopFormatIO321ElasticIT
> Task :sdks:java:io:kafka:kafkaVersion241BatchIT
> Task :sdks:java:io:kafka:kafkaVersion241Test
> Task :sdks:java:io:hadoop-format:runHadoopFormatIO321IT
> Task :sdks:java:io:kafka:kafkaVersion251BatchIT
> Task :sdks:java:io:google-cloud-platform:integrationTestKms
> Task :sdks:java:io:hadoop-format:runHadoopFormatIO321Test
> Task :sdks:java:io:kafka:kafkaVersion251Test
> Task :sdks:java:io:kafka:kafkaVersionsCompatibilityTest

> Task :sdks:java:container:pullLicenses
Copying already-fetched licenses from <https://ci-beam.apache.org/job/beam_PostCommit_Java/ws/src/sdks/java/container/build/reports/dependency-license> to <https://ci-beam.apache.org/job/beam_PostCommit_Java/ws/src/sdks/java/container/build/target/java_third_party_licenses>
Already using interpreter /usr/bin/python3
Using base prefix '/usr'
New python executable in <https://ci-beam.apache.org/job/beam_PostCommit_Java/ws/src/sdks/java/container/build/virtualenv/bin/python3>
Also creating executable in <https://ci-beam.apache.org/job/beam_PostCommit_Java/ws/src/sdks/java/container/build/virtualenv/bin/python>
Installing setuptools, pip, wheel...
done.
DEPRECATION: Python 3.5 reached the end of its life on September 13th, 2020. Please upgrade your Python as Python 3.5 is no longer maintained. pip 21.0 will drop support for Python 3.5 in January 2021. pip 21.0 will remove support for this functionality.
Collecting beautifulsoup4<5.0,>=4.9.0
  Using cached beautifulsoup4-4.9.3-py3-none-any.whl (115 kB)
Collecting future<1.0.0,>=0.16.0
  Using cached future-0.18.2-py3-none-any.whl
Collecting pyyaml<6.0.0,>=3.12
  Using cached PyYAML-5.3.1-cp35-cp35m-linux_x86_64.whl
Collecting tenacity<6.0,>=5.0.2
  Using cached tenacity-5.1.5-py2.py3-none-any.whl (34 kB)
Collecting soupsieve>1.2
  Using cached soupsieve-2.1-py3-none-any.whl (32 kB)
Collecting six>=1.9.0
  Using cached six-1.15.0-py2.py3-none-any.whl (10 kB)
Installing collected packages: soupsieve, six, tenacity, pyyaml, future, beautifulsoup4
Successfully installed beautifulsoup4-4.9.3 future-0.18.2 pyyaml-5.3.1 six-1.15.0 soupsieve-2.1 tenacity-5.1.5
Executing <https://ci-beam.apache.org/job/beam_PostCommit_Java/ws/src/sdks/java/container/build/virtualenv/bin/python> <https://ci-beam.apache.org/job/beam_PostCommit_Java/ws/src/sdks/java/container/license_scripts/pull_licenses_java.py> --license_index=<https://ci-beam.apache.org/job/beam_PostCommit_Java/ws/src/sdks/java/container/build/reports/dependency-license/index.json>        --output_dir=<https://ci-beam.apache.org/job/beam_PostCommit_Java/ws/src/sdks/java/container/build/target/java_third_party_licenses>        --dep_url_yaml=<https://ci-beam.apache.org/job/beam_PostCommit_Java/ws/src/sdks/java/container/license_scripts/dep_urls_java.yaml> 
INFO:root:Pulling license for 206 dependencies using 16 threads.
INFO:root:pull_licenses_java.py succeed. It took 3.051069 seconds with 16 threads.
Copying licenses from <https://ci-beam.apache.org/job/beam_PostCommit_Java/ws/src/sdks/java/container/build/target/java_third_party_licenses> to <https://ci-beam.apache.org/job/beam_PostCommit_Java/ws/src/sdks/java/container/build/target/third_party_licenses.>
Finished license_scripts.sh

> Task :sdks:java:container:java8:copyJavaThirdPartyLicenses NO-SOURCE
> Task :sdks:java:container:java8:dockerPrepare
> Task :sdks:java:io:hadoop-format:hadoopVersionsTest
> Task :javaHadoopVersionsTest

> Task :sdks:java:container:java8:docker
 ---> 49780ab10df4
Step 7/17 : ADD target/beam-sdks-java-harness.jar /opt/apache/beam/jars/
 ---> c687ef122456
Step 8/17 : ADD target/beam-sdks-java-io-kafka.jar /opt/apache/beam/jars/
 ---> d16d20d855d9
Step 9/17 : ADD target/kafka-clients.jar /opt/apache/beam/jars/
 ---> d12635aeb338
Step 10/17 : ADD target/linux_amd64/boot /opt/apache/beam/
 ---> c1d11c979a4d
Step 11/17 : COPY target/LICENSE /opt/apache/beam/
 ---> a17718fd74b5
Step 12/17 : COPY target/NOTICE /opt/apache/beam/
 ---> 0a150aed5a3d
Step 13/17 : ADD target/third_party_licenses /opt/apache/beam/third_party_licenses/
ADD failed: stat /var/lib/docker/tmp/docker-builder528414239/target/third_party_licenses: no such file or directory

> Task :sdks:java:container:java8:docker FAILED
> Task :sdks:java:io:google-cloud-platform:postCommit
> Task :sdks:java:extensions:zetasketch:postCommit

> Task :runners:google-cloud-dataflow-java:examplesJavaLegacyWorkerIntegrationTest

org.apache.beam.examples.complete.TfIdfIT > classMethod FAILED
    java.lang.IllegalArgumentException at TfIdfIT.java:55

***********************************************************
***********************************************************
**********************Set Up Pubsub************************
The Pub/Sub topic has been set up for this example: projects/apache-beam-testing/topics/testpipeline-jenkins-0322122206-b7c580ef
The Pub/Sub subscription has been set up for this example: projects/apache-beam-testing/subscriptions/testpipeline-jenkins-0322122206-b7c580ef
******************Set Up Big Query Table*******************
The BigQuery table has been set up for this example: apache-beam-testing:traffic_max_lane_flow_1616415725572.traffic_max_lane_flow_table
*************************Tear Down*************************
The Pub/Sub topic has been deleted: projects/apache-beam-testing/topics/testpipeline-jenkins-0322122206-b7c580ef
The Pub/Sub subscription has been deleted: projects/apache-beam-testing/subscriptions/testpipeline-jenkins-0322122206-b7c580ef
The BigQuery table might contain the example's output, and it is not deleted automatically: apache-beam-testing:traffic_max_lane_flow_1616415725572.traffic_max_lane_flow_table
Please go to the Developers Console to delete it manually. Otherwise, you may be charged for its usage.
***********************************************************
***********************************************************

12 tests completed, 2 failed, 1 skipped

> Task :runners:google-cloud-dataflow-java:examplesJavaLegacyWorkerIntegrationTest FAILED
> Task :runners:google-cloud-dataflow-java:googleCloudPlatformLegacyWorkerIntegrationTest FROM-CACHE
> Task :runners:google-cloud-dataflow-java:googleCloudPlatformLegacyWorkerKmsIntegrationTest FROM-CACHE

FAILURE: Build completed with 2 failures.

1: Task failed with an exception.
-----------
* What went wrong:
Execution failed for task ':sdks:java:container:java8:docker'.
> Process 'command 'docker'' finished with non-zero exit value 1

* Try:
Run with --stacktrace option to get the stack trace. Run with --info or --debug option to get more log output. Run with --scan to get full insights.
==============================================================================

2: Task failed with an exception.
-----------
* What went wrong:
Execution failed for task ':runners:google-cloud-dataflow-java:examplesJavaLegacyWorkerIntegrationTest'.
> There were failing tests. See the report at: file://<https://ci-beam.apache.org/job/beam_PostCommit_Java/ws/src/runners/google-cloud-dataflow-java/build/reports/tests/examplesJavaLegacyWorkerIntegrationTest/index.html>

* Try:
Run with --stacktrace option to get the stack trace. Run with --info or --debug option to get more log output. Run with --scan to get full insights.
==============================================================================

* Get more help at https://help.gradle.org

Deprecated Gradle features were used in this build, making it incompatible with Gradle 7.0.
Use '--warning-mode all' to show the individual deprecation warnings.
See https://docs.gradle.org/6.8/userguide/command_line_interface.html#sec:command_line_warnings

BUILD FAILED in 25m 43s
248 actionable tasks: 157 executed, 89 from cache, 2 up-to-date
Gradle was unable to watch the file system for changes. The inotify watches limit is too low.

Publishing build scan...
https://gradle.com/s/u5s3utxzvew2a

Build step 'Invoke Gradle script' changed build result to FAILURE
Build step 'Invoke Gradle script' marked build as failure

---------------------------------------------------------------------
To unsubscribe, e-mail: builds-unsubscribe@beam.apache.org
For additional commands, e-mail: builds-help@beam.apache.org


Build failed in Jenkins: beam_PostCommit_Java #7350

Posted by Apache Jenkins Server <je...@builds.apache.org>.
See <https://ci-beam.apache.org/job/beam_PostCommit_Java/7350/display/redirect>

Changes:


------------------------------------------
[...truncated 122.23 KB...]
Step 9/17 : ADD target/kafka-clients.jar /opt/apache/beam/jars/
 ---> 95e4804a18a6
Step 10/17 : ADD target/linux_amd64/boot /opt/apache/beam/
 ---> b22e735d6812
Step 11/17 : COPY target/LICENSE /opt/apache/beam/
 ---> eb787d576e7d
Step 12/17 : COPY target/NOTICE /opt/apache/beam/
 ---> e216ab02d5ff
Step 13/17 : ADD target/third_party_licenses /opt/apache/beam/third_party_licenses/
 ---> eafb03ac298d
Step 14/17 : COPY target/LICENSE target/go-licenses/* /opt/apache/beam/third_party_licenses/golang/
 ---> cd465f3f8763
Step 15/17 : RUN rm /opt/apache/beam/third_party_licenses/golang/LICENSE
 ---> Running in 1044b3fd9b14
Removing intermediate container 1044b3fd9b14
 ---> f6dc5b1636fd
Step 16/17 : RUN if [ "${pull_licenses}" = "false" ] ; then     rm -rf /opt/apache/beam/third_party_licenses ;    fi
 ---> Running in a1f5113af679
Removing intermediate container a1f5113af679
 ---> 99ab84c4c7a6
Step 17/17 : ENTRYPOINT ["/opt/apache/beam/boot"]
 ---> Running in 4dedc62bf28a
Removing intermediate container 4dedc62bf28a
 ---> 58e86f7423d2
Successfully built 58e86f7423d2
Successfully tagged apache/beam_java8_sdk:2.30.0.dev

> Task :sdks:java:io:kafka:kafkaVersion251BatchIT
> Task :sdks:java:io:hadoop-format:runHadoopFormatIO321Test
> Task :sdks:java:io:kafka:kafkaVersion251Test
> Task :sdks:java:io:kafka:kafkaVersionsCompatibilityTest
> Task :sdks:java:io:google-cloud-platform:postCommit
> Task :sdks:java:io:hadoop-format:hadoopVersionsTest
> Task :javaHadoopVersionsTest
> Task :sdks:java:extensions:zetasketch:postCommit

> Task :runners:google-cloud-dataflow-java:examplesJavaLegacyWorkerIntegrationTest

org.apache.beam.examples.complete.TfIdfIT > classMethod FAILED
    java.lang.IllegalArgumentException at TfIdfIT.java:55

***********************************************************
***********************************************************
**********************Set Up Pubsub************************
The Pub/Sub topic has been set up for this example: projects/apache-beam-testing/topics/testpipeline-jenkins-0322062446-6e95f0c9
The Pub/Sub subscription has been set up for this example: projects/apache-beam-testing/subscriptions/testpipeline-jenkins-0322062446-6e95f0c9
******************Set Up Big Query Table*******************
The BigQuery table has been set up for this example: apache-beam-testing:traffic_max_lane_flow_1616394286498.traffic_max_lane_flow_table
*************************Tear Down*************************
The Pub/Sub topic has been deleted: projects/apache-beam-testing/topics/testpipeline-jenkins-0322062446-6e95f0c9
The Pub/Sub subscription has been deleted: projects/apache-beam-testing/subscriptions/testpipeline-jenkins-0322062446-6e95f0c9
The BigQuery table might contain the example's output, and it is not deleted automatically: apache-beam-testing:traffic_max_lane_flow_1616394286498.traffic_max_lane_flow_table
Please go to the Developers Console to delete it manually. Otherwise, you may be charged for its usage.
***********************************************************
***********************************************************

12 tests completed, 2 failed, 1 skipped

> Task :runners:google-cloud-dataflow-java:examplesJavaLegacyWorkerIntegrationTest FAILED
> Task :runners:google-cloud-dataflow-java:googleCloudPlatformLegacyWorkerIntegrationTest FROM-CACHE
> Task :runners:google-cloud-dataflow-java:googleCloudPlatformLegacyWorkerKmsIntegrationTest FROM-CACHE

> Task :runners:google-cloud-dataflow-java:buildAndPushDockerContainer
WARNING: `gcloud docker` will not be supported for Docker client versions above 18.03.

As an alternative, use `gcloud auth configure-docker` to configure `docker` to
use `gcloud` as a credential helper, then use `docker` as you would for non-GCR
registries, e.g. `docker pull gcr.io/project-id/my-image`. Add
`--verbosity=error` to silence this warning: `gcloud docker
--verbosity=error -- pull gcr.io/project-id/my-image`.

See: https://cloud.google.com/container-registry/docs/support/deprecation-notices#gcloud-docker

The push refers to repository [us.gcr.io/apache-beam-testing/java-postcommit-it/java]
55773db2c037: Preparing
c647459f2686: Preparing
51ea21f14efc: Preparing
13b80b54fd3b: Preparing
2d9858b4afba: Preparing
95f6adcc7426: Preparing
36dcd820ac75: Preparing
0d81f6afccf0: Preparing
eed50767e878: Preparing
baaeb0d7050f: Preparing
5289267e1865: Preparing
8a970d4156d3: Preparing
09ac04d65797: Preparing
59f1e8e1ce66: Preparing
bde301416dd2: Preparing
81496d8c72c2: Preparing
644448d6e877: Preparing
0e41e5bdb921: Preparing
0d81f6afccf0: Waiting
09ac04d65797: Waiting
eed50767e878: Waiting
8a970d4156d3: Waiting
bde301416dd2: Waiting
59f1e8e1ce66: Waiting
95f6adcc7426: Waiting
baaeb0d7050f: Waiting
81496d8c72c2: Waiting
36dcd820ac75: Waiting
0e41e5bdb921: Waiting
2d9858b4afba: Pushed
55773db2c037: Pushed
13b80b54fd3b: Pushed
c647459f2686: Pushed
0d81f6afccf0: Pushed
36dcd820ac75: Pushed
baaeb0d7050f: Pushed
8a970d4156d3: Layer already exists
09ac04d65797: Layer already exists
51ea21f14efc: Pushed
59f1e8e1ce66: Layer already exists
bde301416dd2: Layer already exists
81496d8c72c2: Layer already exists
644448d6e877: Layer already exists
0e41e5bdb921: Layer already exists
5289267e1865: Pushed
95f6adcc7426: Pushed
eed50767e878: Pushed
20210322060102: digest: sha256:16462c444f4fe84584b2e931415cfe44828d11469be2327cd62580e6de66088d size: 4099

> Task :runners:google-cloud-dataflow-java:coreSDKJavaRunnerV2IntegrationTest NO-SOURCE

> Task :runners:google-cloud-dataflow-java:examplesJavaRunnerV2IntegrationTest

org.apache.beam.examples.cookbook.BigQueryStorageAPIStreamingIT > testStorageAPIStreaming FAILED
    java.lang.IllegalArgumentException at BigQueryStorageAPIStreamingIT.java:119

***********************************************************
***********************************************************
**********************Set Up Pubsub************************
The Pub/Sub topic has been set up for this example: projects/apache-beam-testing/topics/testpipeline-jenkins-0322062920-d076c808
The Pub/Sub subscription has been set up for this example: projects/apache-beam-testing/subscriptions/testpipeline-jenkins-0322062920-d076c808
******************Set Up Big Query Table*******************
The BigQuery table has been set up for this example: apache-beam-testing:traffic_max_lane_flow_1616394560277.traffic_max_lane_flow_table
*************************Tear Down*************************
The Pub/Sub topic has been deleted: projects/apache-beam-testing/topics/testpipeline-jenkins-0322062920-d076c808
The Pub/Sub subscription has been deleted: projects/apache-beam-testing/subscriptions/testpipeline-jenkins-0322062920-d076c808
The BigQuery table might contain the example's output, and it is not deleted automatically: apache-beam-testing:traffic_max_lane_flow_1616394560277.traffic_max_lane_flow_table
Please go to the Developers Console to delete it manually. Otherwise, you may be charged for its usage.
***********************************************************
***********************************************************

***********************************************************
***********************************************************
**********************Set Up Pubsub************************
The Pub/Sub topic has been set up for this example: projects/apache-beam-testing/topics/testpipeline-jenkins-0322065313-5e0c8021
The Pub/Sub subscription has been set up for this example: projects/apache-beam-testing/subscriptions/testpipeline-jenkins-0322065313-5e0c8021
******************Set Up Big Query Table*******************
The BigQuery table has been set up for this example: apache-beam-testing:traffic_routes_1616395992884.traffic_routes_table
*************************Tear Down*************************
The Pub/Sub topic has been deleted: projects/apache-beam-testing/topics/testpipeline-jenkins-0322065313-5e0c8021
The Pub/Sub subscription has been deleted: projects/apache-beam-testing/subscriptions/testpipeline-jenkins-0322065313-5e0c8021
The BigQuery table might contain the example's output, and it is not deleted automatically: apache-beam-testing:traffic_routes_1616395992884.traffic_routes_table
Please go to the Developers Console to delete it manually. Otherwise, you may be charged for its usage.
***********************************************************
***********************************************************

9 tests completed, 1 failed

> Task :runners:google-cloud-dataflow-java:examplesJavaRunnerV2IntegrationTest FAILED
> Task :runners:google-cloud-dataflow-java:googleCloudPlatformRunnerV2IntegrationTest

org.apache.beam.sdk.io.gcp.pubsub.PubsubReadIT > testReadPubsubMessageId FAILED
    java.lang.AssertionError at PubsubReadIT.java:90

org.apache.beam.sdk.io.gcp.pubsub.PubsubReadIT > testReadPublicData FAILED
    java.lang.AssertionError at PubsubReadIT.java:62

36 tests completed, 2 failed, 1 skipped

> Task :runners:google-cloud-dataflow-java:googleCloudPlatformRunnerV2IntegrationTest FAILED

> Task :runners:google-cloud-dataflow-java:cleanUpDockerImages
Untagged: us.gcr.io/apache-beam-testing/java-postcommit-it/java:20210322060102
Untagged: us.gcr.io/apache-beam-testing/java-postcommit-it/java@sha256:16462c444f4fe84584b2e931415cfe44828d11469be2327cd62580e6de66088d
Deleted: sha256:3ad2efd5e4312451e534beff07e18b7c8d36288dce9b4ef743bc42dbfd891afa
Deleted: sha256:2ac72261a89f519c3e98f0f2a635e89cee3ac43c90a7e5f783c8f53d24ee1c7c
Deleted: sha256:ee4b1bce24bfe8f94e212acd0c52b8e9171862a32d39fe2f62889652b89138f9
Deleted: sha256:91b8d7e89156c5d75ecbb812483d1f69dd9da2417c0036adc96fd59a0ef88a76
Deleted: sha256:56ced30e26dae34b0127126f89879d8fdff14b786b47c174b9b594b3ca567102
Deleted: sha256:7da62d2eadd0ed5024361d031e07a5b095f2192c6052a7822eaf51e04667ce9d
Deleted: sha256:f9dd11a05f616783e60bf3ee3793b0d71196338d12c0a451ab32b39eff7a142b
Deleted: sha256:dd939ebef33d6d3569ff5d3856b14178077f05e1a3b4d6e1c5e2ed05305ca033
Deleted: sha256:a3301e0a8332bf5c1b7d580b4e89dcc7958644379bf962922b22319195faf262
Deleted: sha256:cf33e14d2fec7cb9a82cb6173366d35b877808cde400f3c4cd29534691799c5d
Deleted: sha256:227bcc03f21a76f207b20db23afc4016846f129bdf1d88a771759f8990f0d8bf
Deleted: sha256:5ce7f7f40881b811a8c6c4b19cc4218ff00aa8f668b58c4b55a66173c2871e3b
Deleted: sha256:650ec6d3f6c1780ca5f5be970a6aadc95e930fe5f3d0c49aee5789931fbbbac6
Deleted: sha256:e8ae91b281e20742eb1733238336459b18538a3c9566a40babd2d6c1a779a38b
Deleted: sha256:ae73a55b12cb933f04a6420c64cfc3c439de8a0309eff9d4092cf5c1be2fb381
Digests:
- us.gcr.io/apache-beam-testing/java-postcommit-it/java@sha256:16462c444f4fe84584b2e931415cfe44828d11469be2327cd62580e6de66088d
  Associated tags:
 - 20210322060102
Tags:
- us.gcr.io/apache-beam-testing/java-postcommit-it/java:20210322060102
Deleted [us.gcr.io/apache-beam-testing/java-postcommit-it/java:20210322060102].
Deleted [us.gcr.io/apache-beam-testing/java-postcommit-it/java@sha256:16462c444f4fe84584b2e931415cfe44828d11469be2327cd62580e6de66088d].

FAILURE: Build completed with 3 failures.

1: Task failed with an exception.
-----------
* What went wrong:
Execution failed for task ':runners:google-cloud-dataflow-java:examplesJavaLegacyWorkerIntegrationTest'.
> There were failing tests. See the report at: file://<https://ci-beam.apache.org/job/beam_PostCommit_Java/ws/src/runners/google-cloud-dataflow-java/build/reports/tests/examplesJavaLegacyWorkerIntegrationTest/index.html>

* Try:
Run with --stacktrace option to get the stack trace. Run with --info or --debug option to get more log output. Run with --scan to get full insights.
==============================================================================

2: Task failed with an exception.
-----------
* What went wrong:
Execution failed for task ':runners:google-cloud-dataflow-java:examplesJavaRunnerV2IntegrationTest'.
> There were failing tests. See the report at: file://<https://ci-beam.apache.org/job/beam_PostCommit_Java/ws/src/runners/google-cloud-dataflow-java/build/reports/tests/examplesJavaRunnerV2IntegrationTest/index.html>

* Try:
Run with --stacktrace option to get the stack trace. Run with --info or --debug option to get more log output. Run with --scan to get full insights.
==============================================================================

3: Task failed with an exception.
-----------
* What went wrong:
Execution failed for task ':runners:google-cloud-dataflow-java:googleCloudPlatformRunnerV2IntegrationTest'.
> There were failing tests. See the report at: file://<https://ci-beam.apache.org/job/beam_PostCommit_Java/ws/src/runners/google-cloud-dataflow-java/build/reports/tests/googleCloudPlatformRunnerV2IntegrationTest/index.html>

* Try:
Run with --stacktrace option to get the stack trace. Run with --info or --debug option to get more log output. Run with --scan to get full insights.
==============================================================================

* Get more help at https://help.gradle.org

Deprecated Gradle features were used in this build, making it incompatible with Gradle 7.0.
Use '--warning-mode all' to show the individual deprecation warnings.
See https://docs.gradle.org/6.8/userguide/command_line_interface.html#sec:command_line_warnings

BUILD FAILED in 2h 2m 3s
252 actionable tasks: 161 executed, 89 from cache, 2 up-to-date
Gradle was unable to watch the file system for changes. The inotify watches limit is too low.

Publishing build scan...
https://gradle.com/s/dxtowc2zaoas4

Build step 'Invoke Gradle script' changed build result to FAILURE
Build step 'Invoke Gradle script' marked build as failure

---------------------------------------------------------------------
To unsubscribe, e-mail: builds-unsubscribe@beam.apache.org
For additional commands, e-mail: builds-help@beam.apache.org


Build failed in Jenkins: beam_PostCommit_Java #7349

Posted by Apache Jenkins Server <je...@builds.apache.org>.
See <https://ci-beam.apache.org/job/beam_PostCommit_Java/7349/display/redirect>

Changes:


------------------------------------------
[...truncated 114.38 KB...]

> Task :sdks:java:container:resolveBuildDependencies
Unable to watch the file system for changes. The inotify watches limit is too low.
Resolving ./github.com/apache/beam/sdks/go@<https://ci-beam.apache.org/job/beam_PostCommit_Java/ws/src/sdks/go>

> Task :sdks:java:container:installDependencies
> Task :sdks:java:container:buildLinuxAmd64
> Task :sdks:java:container:goBuild
> Task :sdks:java:container:java8:copySdkHarnessLauncher
> Task :sdks:java:container:java8:dockerPrepare
> Task :sdks:java:io:kafka:kafkaVersion251BatchIT
> Task :sdks:java:io:google-cloud-platform:integrationTestKms
> Task :sdks:java:container:java8:docker
> Task :sdks:java:io:kafka:kafkaVersion251Test
> Task :sdks:java:io:kafka:kafkaVersionsCompatibilityTest
> Task :sdks:java:io:google-cloud-platform:postCommit
> Task :sdks:java:io:hadoop-format:runHadoopFormatIO2101IT
> Task :sdks:java:io:hadoop-format:runHadoopFormatIO2101Test
> Task :sdks:java:io:hadoop-format:runHadoopFormatIO285ElasticIT
> Task :sdks:java:io:hadoop-format:runHadoopFormatIO285IT
> Task :sdks:java:io:hadoop-format:runHadoopFormatIO285Test

> Task :runners:google-cloud-dataflow-java:examplesJavaLegacyWorkerIntegrationTest

org.apache.beam.examples.complete.TfIdfIT > classMethod FAILED
    java.lang.IllegalArgumentException at TfIdfIT.java:55

> Task :sdks:java:extensions:zetasketch:postCommit
> Task :sdks:java:io:hadoop-format:runHadoopFormatIO292ElasticIT
> Task :sdks:java:io:hadoop-format:runHadoopFormatIO292IT
> Task :sdks:java:io:hadoop-format:runHadoopFormatIO292Test
> Task :sdks:java:io:hadoop-format:runHadoopFormatIO321ElasticIT
> Task :sdks:java:io:hadoop-format:runHadoopFormatIO321IT
> Task :sdks:java:io:hadoop-format:runHadoopFormatIO321Test
> Task :sdks:java:io:hadoop-format:hadoopVersionsTest
> Task :javaHadoopVersionsTest

> Task :runners:google-cloud-dataflow-java:examplesJavaLegacyWorkerIntegrationTest

***********************************************************
***********************************************************
**********************Set Up Pubsub************************
The Pub/Sub topic has been set up for this example: projects/apache-beam-testing/topics/testpipeline-jenkins-0322002302-a1117acb
The Pub/Sub subscription has been set up for this example: projects/apache-beam-testing/subscriptions/testpipeline-jenkins-0322002302-a1117acb
******************Set Up Big Query Table*******************
The BigQuery table has been set up for this example: apache-beam-testing:traffic_max_lane_flow_1616372582488.traffic_max_lane_flow_table
*************************Tear Down*************************
The Pub/Sub topic has been deleted: projects/apache-beam-testing/topics/testpipeline-jenkins-0322002302-a1117acb
The Pub/Sub subscription has been deleted: projects/apache-beam-testing/subscriptions/testpipeline-jenkins-0322002302-a1117acb
The BigQuery table might contain the example's output, and it is not deleted automatically: apache-beam-testing:traffic_max_lane_flow_1616372582488.traffic_max_lane_flow_table
Please go to the Developers Console to delete it manually. Otherwise, you may be charged for its usage.
***********************************************************
***********************************************************

12 tests completed, 2 failed, 1 skipped

> Task :runners:google-cloud-dataflow-java:examplesJavaLegacyWorkerIntegrationTest FAILED
> Task :runners:google-cloud-dataflow-java:googleCloudPlatformLegacyWorkerIntegrationTest FROM-CACHE
> Task :runners:google-cloud-dataflow-java:googleCloudPlatformLegacyWorkerKmsIntegrationTest FROM-CACHE

> Task :runners:google-cloud-dataflow-java:buildAndPushDockerContainer
WARNING: `gcloud docker` will not be supported for Docker client versions above 18.03.

As an alternative, use `gcloud auth configure-docker` to configure `docker` to
use `gcloud` as a credential helper, then use `docker` as you would for non-GCR
registries, e.g. `docker pull gcr.io/project-id/my-image`. Add
`--verbosity=error` to silence this warning: `gcloud docker
--verbosity=error -- pull gcr.io/project-id/my-image`.

See: https://cloud.google.com/container-registry/docs/support/deprecation-notices#gcloud-docker

The push refers to repository [us.gcr.io/apache-beam-testing/java-postcommit-it/java]
1cb4fef033bf: Preparing
15bafee74766: Preparing
266ba58602d1: Preparing
589d32d26ce7: Preparing
3759de840a28: Preparing
ce300ccb079f: Preparing
273da266cc28: Preparing
9e44b3a59d55: Preparing
9083f4b15a41: Preparing
f9a8600c9c13: Preparing
bb53cc7b7c46: Preparing
8a970d4156d3: Preparing
09ac04d65797: Preparing
59f1e8e1ce66: Preparing
bde301416dd2: Preparing
81496d8c72c2: Preparing
644448d6e877: Preparing
0e41e5bdb921: Preparing
09ac04d65797: Waiting
ce300ccb079f: Waiting
9083f4b15a41: Waiting
273da266cc28: Waiting
bb53cc7b7c46: Waiting
59f1e8e1ce66: Waiting
8a970d4156d3: Waiting
9e44b3a59d55: Waiting
f9a8600c9c13: Waiting
644448d6e877: Waiting
81496d8c72c2: Waiting
bde301416dd2: Waiting
0e41e5bdb921: Waiting
1cb4fef033bf: Pushed
3759de840a28: Pushed
589d32d26ce7: Pushed
15bafee74766: Pushed
266ba58602d1: Pushed
9e44b3a59d55: Pushed
273da266cc28: Pushed
8a970d4156d3: Layer already exists
f9a8600c9c13: Pushed
09ac04d65797: Layer already exists
59f1e8e1ce66: Layer already exists
bde301416dd2: Layer already exists
81496d8c72c2: Layer already exists
644448d6e877: Layer already exists
0e41e5bdb921: Layer already exists
bb53cc7b7c46: Pushed
ce300ccb079f: Pushed
9083f4b15a41: Pushed
20210322000105: digest: sha256:3b6ff66dba931db97d7ea0014f02da4490741a4bffb744b7100926d33f4be4f6 size: 4099

> Task :runners:google-cloud-dataflow-java:coreSDKJavaRunnerV2IntegrationTest NO-SOURCE

> Task :runners:google-cloud-dataflow-java:examplesJavaRunnerV2IntegrationTest

org.apache.beam.examples.cookbook.BigQueryStorageAPIStreamingIT > testStorageAPIStreaming FAILED
    java.lang.IllegalArgumentException at BigQueryStorageAPIStreamingIT.java:119

***********************************************************
***********************************************************
**********************Set Up Pubsub************************
The Pub/Sub topic has been set up for this example: projects/apache-beam-testing/topics/testpipeline-jenkins-0322002803-e0938b5
The Pub/Sub subscription has been set up for this example: projects/apache-beam-testing/subscriptions/testpipeline-jenkins-0322002803-e0938b5
******************Set Up Big Query Table*******************
The BigQuery table has been set up for this example: apache-beam-testing:traffic_max_lane_flow_1616372882980.traffic_max_lane_flow_table
*************************Tear Down*************************
The Pub/Sub topic has been deleted: projects/apache-beam-testing/topics/testpipeline-jenkins-0322002803-e0938b5
The Pub/Sub subscription has been deleted: projects/apache-beam-testing/subscriptions/testpipeline-jenkins-0322002803-e0938b5
The BigQuery table might contain the example's output, and it is not deleted automatically: apache-beam-testing:traffic_max_lane_flow_1616372882980.traffic_max_lane_flow_table
Please go to the Developers Console to delete it manually. Otherwise, you may be charged for its usage.
***********************************************************
***********************************************************

***********************************************************
***********************************************************
**********************Set Up Pubsub************************
The Pub/Sub topic has been set up for this example: projects/apache-beam-testing/topics/testpipeline-jenkins-0322004930-9bd203e8
The Pub/Sub subscription has been set up for this example: projects/apache-beam-testing/subscriptions/testpipeline-jenkins-0322004930-9bd203e8
******************Set Up Big Query Table*******************
The BigQuery table has been set up for this example: apache-beam-testing:traffic_routes_1616374170047.traffic_routes_table
*************************Tear Down*************************
The Pub/Sub topic has been deleted: projects/apache-beam-testing/topics/testpipeline-jenkins-0322004930-9bd203e8
The Pub/Sub subscription has been deleted: projects/apache-beam-testing/subscriptions/testpipeline-jenkins-0322004930-9bd203e8
The BigQuery table might contain the example's output, and it is not deleted automatically: apache-beam-testing:traffic_routes_1616374170047.traffic_routes_table
Please go to the Developers Console to delete it manually. Otherwise, you may be charged for its usage.
***********************************************************
***********************************************************

9 tests completed, 1 failed

> Task :runners:google-cloud-dataflow-java:examplesJavaRunnerV2IntegrationTest FAILED
> Task :runners:google-cloud-dataflow-java:googleCloudPlatformRunnerV2IntegrationTest

org.apache.beam.sdk.io.gcp.pubsub.PubsubReadIT > testReadPubsubMessageId FAILED
    java.lang.AssertionError at PubsubReadIT.java:90

org.apache.beam.sdk.io.gcp.pubsub.PubsubReadIT > testReadPublicData FAILED
    java.lang.AssertionError at PubsubReadIT.java:62

36 tests completed, 2 failed, 1 skipped

> Task :runners:google-cloud-dataflow-java:googleCloudPlatformRunnerV2IntegrationTest FAILED

> Task :runners:google-cloud-dataflow-java:cleanUpDockerImages
Untagged: us.gcr.io/apache-beam-testing/java-postcommit-it/java:20210322000105
Untagged: us.gcr.io/apache-beam-testing/java-postcommit-it/java@sha256:3b6ff66dba931db97d7ea0014f02da4490741a4bffb744b7100926d33f4be4f6
Deleted: sha256:0437e623a5c81402c3ee28d0980680aacd0b62ac28db64d4b11bcdf750e4ab57
Deleted: sha256:e375d3fdfbbab2386e9f9199bea7622bcf16770f69529fccccdbfc630b81cf40
Deleted: sha256:8f3a0322d882ae0ee09cf49f898efbbec4aa93632f2d7f3cda5189541c285d43
Deleted: sha256:6c688ad0cab3121b794fccd3ffc7819385e71a9f8abd8764d2ace1b96e3f113a
Deleted: sha256:a802566766f75da33da0b7402c28bad02f4011fd4cf6cb907c8a2ce51ec9f3a3
Deleted: sha256:e3350593e4cdf19d3234d3707c282bf992ed9554349dd9173a0e2f710aa1c89c
Deleted: sha256:30231a1ef3ff7b2475a48cc41e43c65809e6a430c6d56d2648d81d59ec48aa36
Deleted: sha256:67e1a06f84b664a9dd2464856eee9b33c42b0f54a5dd4837e8cb63e4aae3fd2f
Deleted: sha256:0400403c77a75e49081293cf7f1b3b92673bfd6419d9a14230b9f5affa837439
Deleted: sha256:abc989367b1a73462ef2a70aa00723dedbf46156df087d7b2ea96d679541db71
Deleted: sha256:9529e7cc5927dc8824dbc4c866b4a5a1cf7e8cd8377883586414a935330ae4b8
Deleted: sha256:c514f3947a818d61a516724310603a2e58345be6b3a860bd2a016c584d072793
Deleted: sha256:4a9dcc8ed374422c15c2560fd10f33d9f6edf2b9eaddf92e5b8657ab8306afcf
Deleted: sha256:3dd627e7d5f85858cdc847bcaaf3eefb77044e0be6723464fdea88e31cc2734f
Deleted: sha256:59a862e8449950fc6acd02a0adcd2cd9ee0a57b25ba5d65e9887d575aa892919
Digests:
- us.gcr.io/apache-beam-testing/java-postcommit-it/java@sha256:3b6ff66dba931db97d7ea0014f02da4490741a4bffb744b7100926d33f4be4f6
  Associated tags:
 - 20210322000105
Tags:
- us.gcr.io/apache-beam-testing/java-postcommit-it/java:20210322000105
Deleted [us.gcr.io/apache-beam-testing/java-postcommit-it/java:20210322000105].
Deleted [us.gcr.io/apache-beam-testing/java-postcommit-it/java@sha256:3b6ff66dba931db97d7ea0014f02da4490741a4bffb744b7100926d33f4be4f6].

FAILURE: Build completed with 3 failures.

1: Task failed with an exception.
-----------
* What went wrong:
Execution failed for task ':runners:google-cloud-dataflow-java:examplesJavaLegacyWorkerIntegrationTest'.
> There were failing tests. See the report at: file://<https://ci-beam.apache.org/job/beam_PostCommit_Java/ws/src/runners/google-cloud-dataflow-java/build/reports/tests/examplesJavaLegacyWorkerIntegrationTest/index.html>

* Try:
Run with --stacktrace option to get the stack trace. Run with --info or --debug option to get more log output. Run with --scan to get full insights.
==============================================================================

2: Task failed with an exception.
-----------
* What went wrong:
Execution failed for task ':runners:google-cloud-dataflow-java:examplesJavaRunnerV2IntegrationTest'.
> There were failing tests. See the report at: file://<https://ci-beam.apache.org/job/beam_PostCommit_Java/ws/src/runners/google-cloud-dataflow-java/build/reports/tests/examplesJavaRunnerV2IntegrationTest/index.html>

* Try:
Run with --stacktrace option to get the stack trace. Run with --info or --debug option to get more log output. Run with --scan to get full insights.
==============================================================================

3: Task failed with an exception.
-----------
* What went wrong:
Execution failed for task ':runners:google-cloud-dataflow-java:googleCloudPlatformRunnerV2IntegrationTest'.
> There were failing tests. See the report at: file://<https://ci-beam.apache.org/job/beam_PostCommit_Java/ws/src/runners/google-cloud-dataflow-java/build/reports/tests/googleCloudPlatformRunnerV2IntegrationTest/index.html>

* Try:
Run with --stacktrace option to get the stack trace. Run with --info or --debug option to get more log output. Run with --scan to get full insights.
==============================================================================

* Get more help at https://help.gradle.org

Deprecated Gradle features were used in this build, making it incompatible with Gradle 7.0.
Use '--warning-mode all' to show the individual deprecation warnings.
See https://docs.gradle.org/6.8/userguide/command_line_interface.html#sec:command_line_warnings

BUILD FAILED in 1h 56m 58s
252 actionable tasks: 161 executed, 89 from cache, 2 up-to-date
Gradle was unable to watch the file system for changes. The inotify watches limit is too low.

Publishing build scan...
https://gradle.com/s/gnumzcqc4xngo

Build step 'Invoke Gradle script' changed build result to FAILURE
Build step 'Invoke Gradle script' marked build as failure

---------------------------------------------------------------------
To unsubscribe, e-mail: builds-unsubscribe@beam.apache.org
For additional commands, e-mail: builds-help@beam.apache.org


Build failed in Jenkins: beam_PostCommit_Java #7348

Posted by Apache Jenkins Server <je...@builds.apache.org>.
See <https://ci-beam.apache.org/job/beam_PostCommit_Java/7348/display/redirect>

Changes:


------------------------------------------
[...truncated 120.81 KB...]
Step 11/17 : COPY target/LICENSE /opt/apache/beam/
 ---> b0b6f9a0b181
Step 12/17 : COPY target/NOTICE /opt/apache/beam/
 ---> 5b66f2403c0f
Step 13/17 : ADD target/third_party_licenses /opt/apache/beam/third_party_licenses/
 ---> 51cc31bdea92
Step 14/17 : COPY target/LICENSE target/go-licenses/* /opt/apache/beam/third_party_licenses/golang/
 ---> 639ec722c60a
Step 15/17 : RUN rm /opt/apache/beam/third_party_licenses/golang/LICENSE
 ---> Running in 5b754ab7d396
Removing intermediate container 5b754ab7d396
 ---> 5e4d5b491b0d
Step 16/17 : RUN if [ "${pull_licenses}" = "false" ] ; then     rm -rf /opt/apache/beam/third_party_licenses ;    fi
 ---> Running in a6c78198d3de
Removing intermediate container a6c78198d3de
 ---> f497f733bfe9
Step 17/17 : ENTRYPOINT ["/opt/apache/beam/boot"]
 ---> Running in 3f20da134a45
Removing intermediate container 3f20da134a45
 ---> 98d152ecbb8e
Successfully built 98d152ecbb8e
Successfully tagged apache/beam_java8_sdk:2.30.0.dev

> Task :sdks:java:io:kafka:kafkaVersion251BatchIT
> Task :sdks:java:io:kafka:kafkaVersion251Test
> Task :sdks:java:io:hadoop-format:runHadoopFormatIO321Test
> Task :sdks:java:io:google-cloud-platform:postCommit
> Task :sdks:java:io:kafka:kafkaVersionsCompatibilityTest
> Task :sdks:java:io:hadoop-format:hadoopVersionsTest
> Task :javaHadoopVersionsTest

> Task :runners:google-cloud-dataflow-java:examplesJavaLegacyWorkerIntegrationTest

org.apache.beam.examples.complete.TfIdfIT > classMethod FAILED
    java.lang.IllegalArgumentException at TfIdfIT.java:55

> Task :sdks:java:extensions:zetasketch:postCommit

> Task :runners:google-cloud-dataflow-java:examplesJavaLegacyWorkerIntegrationTest

***********************************************************
***********************************************************
**********************Set Up Pubsub************************
The Pub/Sub topic has been set up for this example: projects/apache-beam-testing/topics/testpipeline-jenkins-0321182144-b89ec394
The Pub/Sub subscription has been set up for this example: projects/apache-beam-testing/subscriptions/testpipeline-jenkins-0321182144-b89ec394
******************Set Up Big Query Table*******************
The BigQuery table has been set up for this example: apache-beam-testing:traffic_max_lane_flow_1616350903727.traffic_max_lane_flow_table
*************************Tear Down*************************
The Pub/Sub topic has been deleted: projects/apache-beam-testing/topics/testpipeline-jenkins-0321182144-b89ec394
The Pub/Sub subscription has been deleted: projects/apache-beam-testing/subscriptions/testpipeline-jenkins-0321182144-b89ec394
The BigQuery table might contain the example's output, and it is not deleted automatically: apache-beam-testing:traffic_max_lane_flow_1616350903727.traffic_max_lane_flow_table
Please go to the Developers Console to delete it manually. Otherwise, you may be charged for its usage.
***********************************************************
***********************************************************

12 tests completed, 2 failed, 1 skipped

> Task :runners:google-cloud-dataflow-java:examplesJavaLegacyWorkerIntegrationTest FAILED
> Task :runners:google-cloud-dataflow-java:googleCloudPlatformLegacyWorkerIntegrationTest FROM-CACHE
> Task :runners:google-cloud-dataflow-java:googleCloudPlatformLegacyWorkerKmsIntegrationTest FROM-CACHE

> Task :runners:google-cloud-dataflow-java:buildAndPushDockerContainer
WARNING: `gcloud docker` will not be supported for Docker client versions above 18.03.

As an alternative, use `gcloud auth configure-docker` to configure `docker` to
use `gcloud` as a credential helper, then use `docker` as you would for non-GCR
registries, e.g. `docker pull gcr.io/project-id/my-image`. Add
`--verbosity=error` to silence this warning: `gcloud docker
--verbosity=error -- pull gcr.io/project-id/my-image`.

See: https://cloud.google.com/container-registry/docs/support/deprecation-notices#gcloud-docker

The push refers to repository [us.gcr.io/apache-beam-testing/java-postcommit-it/java]
101212304e86: Preparing
fc328fb340ca: Preparing
4afe4b67d1ac: Preparing
4d87b7feb1ad: Preparing
cc9a936dcdbd: Preparing
0c0d32f21cbd: Preparing
b0a41930d9c1: Preparing
378e2923fa3b: Preparing
ac7cc5910689: Preparing
7df3ccf52039: Preparing
1168969c46ee: Preparing
8a970d4156d3: Preparing
09ac04d65797: Preparing
59f1e8e1ce66: Preparing
bde301416dd2: Preparing
81496d8c72c2: Preparing
644448d6e877: Preparing
0e41e5bdb921: Preparing
8a970d4156d3: Waiting
644448d6e877: Waiting
0c0d32f21cbd: Waiting
b0a41930d9c1: Waiting
81496d8c72c2: Waiting
0e41e5bdb921: Waiting
09ac04d65797: Waiting
378e2923fa3b: Waiting
bde301416dd2: Waiting
59f1e8e1ce66: Waiting
ac7cc5910689: Waiting
7df3ccf52039: Waiting
101212304e86: Pushed
fc328fb340ca: Pushed
cc9a936dcdbd: Pushed
4d87b7feb1ad: Pushed
4afe4b67d1ac: Pushed
378e2923fa3b: Pushed
b0a41930d9c1: Pushed
8a970d4156d3: Layer already exists
09ac04d65797: Layer already exists
59f1e8e1ce66: Layer already exists
bde301416dd2: Layer already exists
81496d8c72c2: Layer already exists
644448d6e877: Layer already exists
7df3ccf52039: Pushed
0e41e5bdb921: Layer already exists
1168969c46ee: Pushed
0c0d32f21cbd: Pushed
ac7cc5910689: Pushed
20210321180031: digest: sha256:5423c08ca8580d69aa7a25a87ebef467a939b1fd8a5855f2e33342491da5fee5 size: 4099

> Task :runners:google-cloud-dataflow-java:coreSDKJavaRunnerV2IntegrationTest NO-SOURCE

> Task :runners:google-cloud-dataflow-java:examplesJavaRunnerV2IntegrationTest

org.apache.beam.examples.cookbook.BigQueryStorageAPIStreamingIT > testStorageAPIStreaming FAILED
    java.lang.IllegalArgumentException at BigQueryStorageAPIStreamingIT.java:119

***********************************************************
***********************************************************
**********************Set Up Pubsub************************
The Pub/Sub topic has been set up for this example: projects/apache-beam-testing/topics/testpipeline-jenkins-0321182607-a70d184b
The Pub/Sub subscription has been set up for this example: projects/apache-beam-testing/subscriptions/testpipeline-jenkins-0321182607-a70d184b
******************Set Up Big Query Table*******************
The BigQuery table has been set up for this example: apache-beam-testing:traffic_max_lane_flow_1616351166310.traffic_max_lane_flow_table
*************************Tear Down*************************
The Pub/Sub topic has been deleted: projects/apache-beam-testing/topics/testpipeline-jenkins-0321182607-a70d184b
The Pub/Sub subscription has been deleted: projects/apache-beam-testing/subscriptions/testpipeline-jenkins-0321182607-a70d184b
The BigQuery table might contain the example's output, and it is not deleted automatically: apache-beam-testing:traffic_max_lane_flow_1616351166310.traffic_max_lane_flow_table
Please go to the Developers Console to delete it manually. Otherwise, you may be charged for its usage.
***********************************************************
***********************************************************

***********************************************************
***********************************************************
**********************Set Up Pubsub************************
The Pub/Sub topic has been set up for this example: projects/apache-beam-testing/topics/testpipeline-jenkins-0321184720-5a31caf0
The Pub/Sub subscription has been set up for this example: projects/apache-beam-testing/subscriptions/testpipeline-jenkins-0321184720-5a31caf0
******************Set Up Big Query Table*******************
The BigQuery table has been set up for this example: apache-beam-testing:traffic_routes_1616352440144.traffic_routes_table
*************************Tear Down*************************
The Pub/Sub topic has been deleted: projects/apache-beam-testing/topics/testpipeline-jenkins-0321184720-5a31caf0
The Pub/Sub subscription has been deleted: projects/apache-beam-testing/subscriptions/testpipeline-jenkins-0321184720-5a31caf0
The BigQuery table might contain the example's output, and it is not deleted automatically: apache-beam-testing:traffic_routes_1616352440144.traffic_routes_table
Please go to the Developers Console to delete it manually. Otherwise, you may be charged for its usage.
***********************************************************
***********************************************************

9 tests completed, 1 failed

> Task :runners:google-cloud-dataflow-java:examplesJavaRunnerV2IntegrationTest FAILED
> Task :runners:google-cloud-dataflow-java:googleCloudPlatformRunnerV2IntegrationTest

org.apache.beam.sdk.io.gcp.pubsub.PubsubReadIT > testReadPubsubMessageId FAILED
    java.lang.AssertionError at PubsubReadIT.java:90

org.apache.beam.sdk.io.gcp.pubsub.PubsubReadIT > testReadPublicData FAILED
    java.lang.AssertionError at PubsubReadIT.java:62

36 tests completed, 2 failed, 1 skipped

> Task :runners:google-cloud-dataflow-java:googleCloudPlatformRunnerV2IntegrationTest FAILED

> Task :runners:google-cloud-dataflow-java:cleanUpDockerImages
Untagged: us.gcr.io/apache-beam-testing/java-postcommit-it/java:20210321180031
Untagged: us.gcr.io/apache-beam-testing/java-postcommit-it/java@sha256:5423c08ca8580d69aa7a25a87ebef467a939b1fd8a5855f2e33342491da5fee5
Deleted: sha256:0096aef974447408fc39c539b1aaf3662b73891b3a0d5d994c0dfb678eafe5ee
Deleted: sha256:ddc6210f5a9d4c8aa3c9c7f5671bd3a24c1b806317208d051b851a8e17ca8e0b
Deleted: sha256:31941b85bb4a8703d983f926909009841a965c1ac22522bc7c740c6a342c1632
Deleted: sha256:df86c90c78821d304bbb32f7a52aff8baa0c901ae88eacab6171abc91a819a84
Deleted: sha256:4a422c35a1086386c1066082f2a2867cc28f9bff48058edcb8d77de29ced7ddd
Deleted: sha256:e9308ed54a45c7bd12b0f20c34d2db55b851a5ab54a175fbefeb618d5c14f025
Deleted: sha256:7b0523051bfea57065781b4f1ba5f253dd21f47074a5351c97ae7e86e4bb506c
Deleted: sha256:93a629c64dd9b9ef5f2112892e59455ee90138e77d8873919cfd6fd69be271fe
Deleted: sha256:2fbcc13132e543115b1fdf816d97714863fb8d79c106bcd0649c0e105b3b9ac3
Deleted: sha256:a2613783629f6d9f8a9fcf0b4c981b5886720e4a3764939493af60a99f384c6f
Deleted: sha256:b4447dd2871757dfdb7e30f79412cc9f936290f860a614ff87360728ffba8771
Deleted: sha256:bb9af07425956f9332c53e8a53ac3fba52f85176611f8cc8fc717fa104df963a
Deleted: sha256:e190535d50d52fbdc624b24fef5077b6c38cb18f404aca4b2fd43c8f06c6e663
Deleted: sha256:f982e3c8cb3c3b354b4a79aa7161a1c30496775af468f2fecc4768648fd3440c
Deleted: sha256:08c67ed330884700a1a8b83976daabbb59b5fa39fe2a4955bdaf7a981f7f67df
Digests:
- us.gcr.io/apache-beam-testing/java-postcommit-it/java@sha256:5423c08ca8580d69aa7a25a87ebef467a939b1fd8a5855f2e33342491da5fee5
  Associated tags:
 - 20210321180031
Tags:
- us.gcr.io/apache-beam-testing/java-postcommit-it/java:20210321180031
Deleted [us.gcr.io/apache-beam-testing/java-postcommit-it/java:20210321180031].
Deleted [us.gcr.io/apache-beam-testing/java-postcommit-it/java@sha256:5423c08ca8580d69aa7a25a87ebef467a939b1fd8a5855f2e33342491da5fee5].

FAILURE: Build completed with 3 failures.

1: Task failed with an exception.
-----------
* What went wrong:
Execution failed for task ':runners:google-cloud-dataflow-java:examplesJavaLegacyWorkerIntegrationTest'.
> There were failing tests. See the report at: file://<https://ci-beam.apache.org/job/beam_PostCommit_Java/ws/src/runners/google-cloud-dataflow-java/build/reports/tests/examplesJavaLegacyWorkerIntegrationTest/index.html>

* Try:
Run with --stacktrace option to get the stack trace. Run with --info or --debug option to get more log output. Run with --scan to get full insights.
==============================================================================

2: Task failed with an exception.
-----------
* What went wrong:
Execution failed for task ':runners:google-cloud-dataflow-java:examplesJavaRunnerV2IntegrationTest'.
> There were failing tests. See the report at: file://<https://ci-beam.apache.org/job/beam_PostCommit_Java/ws/src/runners/google-cloud-dataflow-java/build/reports/tests/examplesJavaRunnerV2IntegrationTest/index.html>

* Try:
Run with --stacktrace option to get the stack trace. Run with --info or --debug option to get more log output. Run with --scan to get full insights.
==============================================================================

3: Task failed with an exception.
-----------
* What went wrong:
Execution failed for task ':runners:google-cloud-dataflow-java:googleCloudPlatformRunnerV2IntegrationTest'.
> There were failing tests. See the report at: file://<https://ci-beam.apache.org/job/beam_PostCommit_Java/ws/src/runners/google-cloud-dataflow-java/build/reports/tests/googleCloudPlatformRunnerV2IntegrationTest/index.html>

* Try:
Run with --stacktrace option to get the stack trace. Run with --info or --debug option to get more log output. Run with --scan to get full insights.
==============================================================================

* Get more help at https://help.gradle.org

Deprecated Gradle features were used in this build, making it incompatible with Gradle 7.0.
Use '--warning-mode all' to show the individual deprecation warnings.
See https://docs.gradle.org/6.8/userguide/command_line_interface.html#sec:command_line_warnings

BUILD FAILED in 1h 55m 43s
252 actionable tasks: 161 executed, 89 from cache, 2 up-to-date
Gradle was unable to watch the file system for changes. The inotify watches limit is too low.

Publishing build scan...
https://gradle.com/s/5r25gsomj5kba

Build step 'Invoke Gradle script' changed build result to FAILURE
Build step 'Invoke Gradle script' marked build as failure

---------------------------------------------------------------------
To unsubscribe, e-mail: builds-unsubscribe@beam.apache.org
For additional commands, e-mail: builds-help@beam.apache.org


Build failed in Jenkins: beam_PostCommit_Java #7347

Posted by Apache Jenkins Server <je...@builds.apache.org>.
See <https://ci-beam.apache.org/job/beam_PostCommit_Java/7347/display/redirect>

Changes:


------------------------------------------
[...truncated 89.62 KB...]
Copying already-fetched licenses from <https://ci-beam.apache.org/job/beam_PostCommit_Java/ws/src/sdks/java/container/build/reports/dependency-license> to <https://ci-beam.apache.org/job/beam_PostCommit_Java/ws/src/sdks/java/container/build/target/java_third_party_licenses>

> Task :examples:java:compileJava FROM-CACHE
> Task :examples:java:classes UP-TO-DATE
> Task :runners:google-cloud-dataflow-java:jar
> Task :examples:java:jar
> Task :sdks:java:io:debezium:compileTestJava FROM-CACHE
> Task :sdks:java:io:debezium:testClasses UP-TO-DATE
> Task :examples:java:compileTestJava FROM-CACHE
> Task :examples:java:testClasses
> Task :examples:java:testJar
> Task :sdks:java:io:google-cloud-platform:compileTestJava FROM-CACHE
> Task :runners:google-cloud-dataflow-java:worker:legacy-worker:compileJava FROM-CACHE
> Task :runners:google-cloud-dataflow-java:worker:legacy-worker:classes UP-TO-DATE

> Task :sdks:go:resolveBuildDependencies
Resolving golang.org/x/net: commit='2fb46b16b8dda405028c50f7c7f0f9dd1fa6bfb1', urls=[https://go.googlesource.com/net]
Resolving golang.org/x/oauth2: commit='5d25da1a8d43b66f2898c444f899c7bcfd6a407e', urls=[https://go.googlesource.com/oauth2]

> Task :runners:google-cloud-dataflow-java:worker:legacy-worker:shadowJar FROM-CACHE
> Task :runners:google-cloud-dataflow-java:coreSDKJavaLegacyWorkerIntegrationTest NO-SOURCE
> Task :sdks:java:io:hadoop-format:compileTestJava FROM-CACHE

> Task :sdks:go:resolveBuildDependencies
Resolving golang.org/x/sync: commit='fd80eb99c8f653c847d294a001bdf2a3a6f768f5', urls=[https://go.googlesource.com/sync]

> Task :runners:spark:2:hadoopVersion2101Test FROM-CACHE

> Task :sdks:java:container:pullLicenses
DEPRECATION: Python 3.5 reached the end of its life on September 13th, 2020. Please upgrade your Python as Python 3.5 is no longer maintained. pip 21.0 will drop support for Python 3.5 in January 2021. pip 21.0 will remove support for this functionality.
INFO:root:Pulling license for 206 dependencies using 16 threads.

> Task :sdks:java:io:hadoop-file-system:hadoopVersion2101Test
> Task :sdks:java:io:kinesis:integrationTest
> Task :sdks:java:io:kafka:kafkaVersion01103BatchIT
> Task :sdks:java:extensions:ml:integrationTest
> Task :sdks:java:io:debezium:integrationTest
> Task :runners:google-cloud-dataflow-java:examplesJavaLegacyWorkerIntegrationTest

> Task :sdks:java:container:pullLicenses
INFO:root:pull_licenses_java.py succeed. It took 9.999441 seconds with 16 threads.

> Task :sdks:go:resolveBuildDependencies
Resolving golang.org/x/sys: commit='fde4db37ae7ad8191b03d30d27f258b5291ae4e3', urls=[https://go.googlesource.com/sys]

> Task :sdks:java:io:hadoop-format:testClasses
> Task :runners:spark:2:hadoopVersion285Test FROM-CACHE
> Task :runners:spark:2:hadoopVersion292Test FROM-CACHE
> Task :runners:spark:2:hadoopVersion321Test FROM-CACHE

> Task :runners:google-cloud-dataflow-java:examplesJavaLegacyWorkerIntegrationTest

org.apache.beam.examples.cookbook.BigQueryStorageAPIStreamingIT > testStorageAPIStreaming FAILED
    java.lang.IllegalArgumentException at BigQueryStorageAPIStreamingIT.java:119

> Task :runners:spark:2:hadoopVersionsTest UP-TO-DATE
> Task :sdks:java:io:google-cloud-platform:testClasses
> Task :sdks:java:io:hadoop-format:runHadoopFormatIO2101ElasticIT
> Task :sdks:java:io:google-cloud-platform:testJar
> Task :sdks:java:container:java8:copyJavaThirdPartyLicenses NO-SOURCE
> Task :sdks:java:extensions:ml:postCommit

> Task :sdks:go:resolveBuildDependencies
Resolving golang.org/x/text: commit='23ae387dee1f90d29a23c0e87ee0b46038fbed0e', urls=[https://go.googlesource.com/text]
Resolving cached github.com/etcd-io/etcd: commit='11214aa33bf5a47d3d9d8dafe0f6b97237dfe921', urls=[https://github.com/etcd-io/etcd.git, git@github.com:etcd-io/etcd.git]

> Task :sdks:java:extensions:zetasketch:integrationTest

> Task :release:go-licenses:java:dockerRun
+ go-licenses save github.com/apache/beam/sdks/java/container --save_path=/output/licenses
+ go-licenses csv github.com/apache/beam/sdks/java/container
+ tee /output/licenses/list.csv
+ chmod -R a+w /output/licenses

> Task :release:go-licenses:java:createLicenses
> Task :sdks:java:container:java8:copyGolangLicenses
> Task :sdks:java:io:hadoop-file-system:hadoopVersion285Test
> Task :sdks:java:io:google-cloud-platform:integrationTest
> Task :sdks:java:io:kafka:kafkaVersion01103Test
> Task :sdks:java:io:hadoop-file-system:hadoopVersion292Test
> Task :sdks:java:io:hadoop-format:runHadoopFormatIO2101IT
> Task :sdks:java:io:kafka:kafkaVersion100BatchIT

> Task :sdks:go:resolveBuildDependencies
Resolving google.golang.org/api: commit='0324d5e90dc7753607860272666845fad9ceb97e', urls=[https://code.googlesource.com/google-api-go-client]

> Task :sdks:java:io:hadoop-format:runHadoopFormatIO2101Test
> Task :sdks:java:io:kafka:kafkaVersion100Test
> Task :sdks:java:io:hadoop-file-system:hadoopVersion321Test
> Task :sdks:java:io:kafka:kafkaVersion111BatchIT
> Task :sdks:java:io:hadoop-file-system:hadoopVersionsTest
> Task :sdks:java:io:kafka:kafkaVersion111Test
> Task :sdks:java:io:hadoop-format:runHadoopFormatIO285ElasticIT

> Task :sdks:go:resolveBuildDependencies
Resolving google.golang.org/genproto: commit='4d944d34d83c502a5f761500a14d8842648415c3', urls=[https://github.com/google/go-genproto]

> Task :sdks:java:io:kafka:kafkaVersion201BatchIT

> Task :sdks:go:resolveBuildDependencies
Resolving google.golang.org/grpc: commit='5e8f83304c0563d1ba74db05fee83d9c18ab9a58', urls=[https://github.com/grpc/grpc-go]
Resolving google.golang.org/protobuf: commit='d165be301fb1e13390ad453281ded24385fd8ebc', urls=[https://go.googlesource.com/protobuf]
Resolving cached github.com/etcd-io/etcd: commit='11214aa33bf5a47d3d9d8dafe0f6b97237dfe921', urls=[https://github.com/etcd-io/etcd.git, git@github.com:etcd-io/etcd.git]
Resolving cached github.com/etcd-io/etcd: commit='11214aa33bf5a47d3d9d8dafe0f6b97237dfe921', urls=[https://github.com/etcd-io/etcd.git, git@github.com:etcd-io/etcd.git]

> Task :sdks:java:io:kafka:kafkaVersion201Test
> Task :sdks:java:io:hadoop-format:runHadoopFormatIO285IT
> Task :sdks:go:installDependencies
> Task :sdks:java:io:kafka:kafkaVersion211BatchIT
> Task :sdks:java:io:hadoop-format:runHadoopFormatIO285Test
> Task :sdks:java:io:kafka:kafkaVersion211Test
> Task :sdks:go:buildLinuxAmd64
> Task :sdks:go:goBuild

> Task :sdks:java:container:resolveBuildDependencies
Resolving ./github.com/apache/beam/sdks/go@<https://ci-beam.apache.org/job/beam_PostCommit_Java/ws/src/sdks/go>

> Task :sdks:java:container:installDependencies
> Task :sdks:java:io:hadoop-format:runHadoopFormatIO292ElasticIT
> Task :sdks:java:io:kafka:kafkaVersion222BatchIT

> Task :sdks:java:container:buildLinuxAmd64
Unable to watch the file system for changes. The inotify watches limit is too low.

> Task :sdks:java:container:goBuild
> Task :sdks:java:container:java8:copySdkHarnessLauncher
> Task :sdks:java:container:java8:dockerPrepare
> Task :sdks:java:container:java8:docker
> Task :sdks:java:io:kafka:kafkaVersion222Test
> Task :sdks:java:io:hadoop-format:runHadoopFormatIO292IT
> Task :sdks:java:io:kafka:kafkaVersion231BatchIT
> Task :sdks:java:io:hadoop-format:runHadoopFormatIO292Test
> Task :sdks:java:io:kafka:kafkaVersion231Test
> Task :sdks:java:io:kafka:kafkaVersion241BatchIT
> Task :sdks:java:io:hadoop-format:runHadoopFormatIO321ElasticIT
> Task :sdks:java:io:kafka:kafkaVersion241Test
> Task :sdks:java:io:kafka:kafkaVersion251BatchIT
> Task :sdks:java:io:hadoop-format:runHadoopFormatIO321IT
> Task :sdks:java:io:kafka:kafkaVersion251Test
> Task :sdks:java:io:kafka:kafkaVersionsCompatibilityTest
> Task :sdks:java:io:hadoop-format:runHadoopFormatIO321Test
> Task :sdks:java:io:hadoop-format:hadoopVersionsTest
> Task :javaHadoopVersionsTest
> Task :sdks:java:io:google-cloud-platform:integrationTestKms
> Task :sdks:java:io:google-cloud-platform:postCommit
> Task :sdks:java:extensions:zetasketch:postCommit

> Task :runners:google-cloud-dataflow-java:examplesJavaLegacyWorkerIntegrationTest

org.apache.beam.examples.complete.TfIdfIT > classMethod FAILED
    java.lang.IllegalArgumentException at TfIdfIT.java:55

12 tests completed, 2 failed, 1 skipped

> Task :runners:google-cloud-dataflow-java:examplesJavaLegacyWorkerIntegrationTest FAILED
> Task :runners:google-cloud-dataflow-java:googleCloudPlatformLegacyWorkerIntegrationTest FROM-CACHE
> Task :runners:google-cloud-dataflow-java:googleCloudPlatformLegacyWorkerKmsIntegrationTest FROM-CACHE

> Task :runners:google-cloud-dataflow-java:buildAndPushDockerContainer
WARNING: `gcloud docker` will not be supported for Docker client versions above 18.03.

As an alternative, use `gcloud auth configure-docker` to configure `docker` to
use `gcloud` as a credential helper, then use `docker` as you would for non-GCR
registries, e.g. `docker pull gcr.io/project-id/my-image`. Add
`--verbosity=error` to silence this warning: `gcloud docker
--verbosity=error -- pull gcr.io/project-id/my-image`.

See: https://cloud.google.com/container-registry/docs/support/deprecation-notices#gcloud-docker


> Task :runners:google-cloud-dataflow-java:coreSDKJavaRunnerV2IntegrationTest NO-SOURCE

> Task :runners:google-cloud-dataflow-java:examplesJavaRunnerV2IntegrationTest

org.apache.beam.examples.cookbook.BigQueryStorageAPIStreamingIT > testStorageAPIStreaming FAILED
    java.lang.IllegalArgumentException at BigQueryStorageAPIStreamingIT.java:119

9 tests completed, 1 failed

> Task :runners:google-cloud-dataflow-java:examplesJavaRunnerV2IntegrationTest FAILED
> Task :runners:google-cloud-dataflow-java:googleCloudPlatformRunnerV2IntegrationTest

org.apache.beam.sdk.io.gcp.pubsub.PubsubReadIT > testReadPubsubMessageId FAILED
    java.lang.AssertionError at PubsubReadIT.java:90

org.apache.beam.sdk.io.gcp.pubsub.PubsubReadIT > testReadPublicData FAILED
    java.lang.AssertionError at PubsubReadIT.java:62

36 tests completed, 2 failed, 1 skipped

> Task :runners:google-cloud-dataflow-java:googleCloudPlatformRunnerV2IntegrationTest FAILED

> Task :runners:google-cloud-dataflow-java:cleanUpDockerImages
Digests:
- us.gcr.io/apache-beam-testing/java-postcommit-it/java@sha256:b2d247906a3e0318cd123c231b8768c478510acceb95f5fc3ccb0c543f7daf5f
  Associated tags:
 - 20210321120046
Tags:
- us.gcr.io/apache-beam-testing/java-postcommit-it/java:20210321120046
Deleted [us.gcr.io/apache-beam-testing/java-postcommit-it/java:20210321120046].
Deleted [us.gcr.io/apache-beam-testing/java-postcommit-it/java@sha256:b2d247906a3e0318cd123c231b8768c478510acceb95f5fc3ccb0c543f7daf5f].

FAILURE: Build completed with 3 failures.

1: Task failed with an exception.
-----------
* What went wrong:
Execution failed for task ':runners:google-cloud-dataflow-java:examplesJavaLegacyWorkerIntegrationTest'.
> There were failing tests. See the report at: file://<https://ci-beam.apache.org/job/beam_PostCommit_Java/ws/src/runners/google-cloud-dataflow-java/build/reports/tests/examplesJavaLegacyWorkerIntegrationTest/index.html>

* Try:
Run with --stacktrace option to get the stack trace. Run with --info or --debug option to get more log output. Run with --scan to get full insights.
==============================================================================

2: Task failed with an exception.
-----------
* What went wrong:
Execution failed for task ':runners:google-cloud-dataflow-java:examplesJavaRunnerV2IntegrationTest'.
> There were failing tests. See the report at: file://<https://ci-beam.apache.org/job/beam_PostCommit_Java/ws/src/runners/google-cloud-dataflow-java/build/reports/tests/examplesJavaRunnerV2IntegrationTest/index.html>

* Try:
Run with --stacktrace option to get the stack trace. Run with --info or --debug option to get more log output. Run with --scan to get full insights.
==============================================================================

3: Task failed with an exception.
-----------
* What went wrong:
Execution failed for task ':runners:google-cloud-dataflow-java:googleCloudPlatformRunnerV2IntegrationTest'.
> There were failing tests. See the report at: file://<https://ci-beam.apache.org/job/beam_PostCommit_Java/ws/src/runners/google-cloud-dataflow-java/build/reports/tests/googleCloudPlatformRunnerV2IntegrationTest/index.html>

* Try:
Run with --stacktrace option to get the stack trace. Run with --info or --debug option to get more log output. Run with --scan to get full insights.
==============================================================================

* Get more help at https://help.gradle.org

Deprecated Gradle features were used in this build, making it incompatible with Gradle 7.0.
Use '--warning-mode all' to show the individual deprecation warnings.
See https://docs.gradle.org/6.8/userguide/command_line_interface.html#sec:command_line_warnings

BUILD FAILED in 2h 3m 10s
252 actionable tasks: 161 executed, 89 from cache, 2 up-to-date
Gradle was unable to watch the file system for changes. The inotify watches limit is too low.

Publishing build scan...
https://gradle.com/s/43uez7phlo3ro

Build step 'Invoke Gradle script' changed build result to FAILURE
Build step 'Invoke Gradle script' marked build as failure

---------------------------------------------------------------------
To unsubscribe, e-mail: builds-unsubscribe@beam.apache.org
For additional commands, e-mail: builds-help@beam.apache.org